##TITLE=IR Spectrum
##JCAMP-DX=5.00 $$ ACD/SpecManager v 12.01
##DATE=20 Mar 2009 10:21:02
##DATA TYPE=INFRARED SPECTRUM
##DATA CLASS=XYDATA
##ORIGIN=
##OWNER=
##NPOINTS=7053
##FIRSTX=599.86669922
##LASTX=4000.39697266
##MAXX=4000.39697266
##MINX=599.86669922
##MAXY=97.47553253
##MINY=36.79664230
##XFACTOR=1.0000000000
##YFACTOR=0.000000100000000
##FIRSTY=51.55271149
##DELTAX=0.48220792
##XUNITS=1/CM
##YUNITS=ARBITRARY UNITS
##XYDATA=(X++(Y..Y))
599.9E15527115j1603928j822204J1807861N040245k384987o113052M181366L571014
$$ 515527115 503923187 502100983 513908844 518949089 516564102 510451050 514632416 518203430
603.7E18203430m43802j048736J1237564P204857L702621P423897Q544197Q76312p051964
$$ 518203430 517759628 516710892 527948456 535153313 538855934 546279831 554824028 555700340 548648376
608.1E48648376o031990J13640P031403J2559738K002640o271782L252983J0354347
$$ 548648376 542616386 542730026 549761429 562321167 564323807 558052025 561305008 571659355
611.9E71659355J353188j614762M978371k774391k723389J6365204R676628L422508
$$ 571659355 573012543 571397781 576376152 573601761 570878372 587243576 596920204 600342712
615.8F00342712L278733O80847N43899P63703M505119K988663L447685K880135K456627
$$ 600342712 603621445 604302292 604846191 605609894 610115013 613103676 616551361 619431496 621888123
620.1F21888123J276664m025192J412697K455902o45599L2997J903534R420738J0323181
$$ 621888123 623164787 619139595 620552292 623008194 622362595 622395592 624299126 633719864 644043045
624.5F44043045j153336j0452346K228737P650795L983535O493225L312073J035385
$$ 644043045 642889709 632437363 634666100 642316895 646300430 652793655 656105728 657141113
628.3F57141113m93393L741761O87637p953873j2130P182312R828720K753830j186524
$$ 657141113 656647720 660389481 661077118 653123245 653111115 660293427 670122147 672875977 671689453
632.7F71689453L568955N589981K951965p103577J0279618R992599R88770m51279j1170654
$$ 671689453 675258408 680848389 683800354 676696777 686976395 696968994 697957764 697506485 686335831
637F86335831j135941P533493K88315j246490L293457N531234J426850K615432M577256
$$ 686335831 685199890 692733383 693021698 691775208 695068665 700599899 702026749 704642181 709219437
641.3G09219437j806565N972061O328660n165024r35364O552124j587753l43781N931168
$$ 709219437 707412872 713384933 719713593 714548569 713613205 720165329 718577576 718233795 724164963
645.7G24164963P480469O193771P755890l454437p623597J1712342O105804l783188
$$ 724164963 731645432 737839203 745595093 742140656 734517059 746229401 752335205 748552017
649.5G48552017O619568n55344p849655l186264Q422241Q581315M719924P389527n192871
$$ 748552017 755171585 754616241 746766586 743580322 752002563 760583878 765303802 772693329 767500458
653.9G67500458q268280q60291M603501L239517L844375p07855M885788J0333405j903458
$$ 767500458 759232178 758371887 762975388 766214905 770059280 769351425 774237213 784570618 782667160
658.2G82667160j3322601M47159J1313476k542114o827393K040787L773880L483124
$$ 782667160 769344559 769791718 781105194 778563080 771735687 773776474 777550354 781033478
662.1G81033478j822815M620590O459122O44912n384597j516648N753022Q287506J984939
$$ 781033478 779210663 783831253 790290375 790935287 785550690 784034042 789787064 798074570 800059509
666.4H00059509J3508606L4492722J14531708p6025849n5651245j9781570p214051
$$ 800059509 813568115 848060837 962592545 886566696 830915451 811133881 803919830
669.8H03919830J958924L786468L641434O10351N532151N944595r898987o580353P537842
$$ 803919830 805878754 809665222 813306656 813917007 819449158 825393753 815494766 808914413 816452255
674.1H16452255k60086k770462R339829N176773j633301K30102J689530K71759R17969
$$ 816452255 816192169 813421707 822761536 827938309 826305008 826535110 828224640 828496399 829414368
678.5H29414368O110229L40195J997146K657700j813431r131546Q10623L615494k194595
$$ 829414368 835524597 835864792 837861938 840519638 838706207 829574661 830385284 834000778 831806183
682.8H31806183O44379J5446090O682663L91770N971145K614517p311401k991943L076172
$$ 831806183 832450562 847896652 854579315 854971085 860942230 863556747 856245346 853253403 856329575
687.1H56329575m709092M138642M167175n680847K36740L101959Q27027m41819q626709
$$ 856329575 851620483 855759125 859926300 854245453 854482193 857584152 858411179 857969360 849342651
691.5H49342651l152771J653366K428818L595352k68631M174500N498962J126633k838211
$$ 849342651 846189880 847843246 850272064 853867416 853598785 857773285 863272247 864398880 861560669
695.8H61560669p392426K053833N624619N363998J964951j673889l211365Q56628L990403
$$ 861560669 854168243 856222076 861846695 867210693 869175644 867501755 864290390 865147018 869137421
700.2H69137421p46918L151321l139648n549469P36771k774735j111908O687470M134445
$$ 869137421 868390503 871541824 868402176 862852707 863589478 860814743 859702835 866390305 870524750
704.5H70524750K438812l687973K236328K171097K850799N631791m018784r52377K20871
$$ 870524750 872963562 869275589 871511917 873683014 876533813 882165604 878146820 877194443 877415314
708.8H77415314m890290M552994L609390p44781N654221L641738k211685o209793j595688
$$ 877415314 872525024 877078018 880687408 879942627 885596848 889238586 887026901 880817108 879221420
713.2H79221420Q790589M780349j905365l852768j162185J452713L075256j694565
$$ 879221420 888012009 892792358 890886993 887034225 885872040 887324753 890400009 888705444
717H88705444m12445O132508Q391189j942901m068757o728210j996078O451873O672516
$$ 888705444 888292999 894425507 902816696 900873795 896805038 890076828 888080750 894532623 901205139
721.4I01205139k624588M2267k06604n711517m341812J084747L874435L951340P831039
$$ 901205139 898580551 898622818 898416214 892704697 888362885 889447632 893322067 897273407 905104446
725.7I05104446K188797o897659Q88977k548218K447205l82843l795090J576843m426574
$$ 905104446 907293243 900395584 901284561 898736343 901183548 900800705 897005615 898582458 894155884
730.1H94155884k619400R450149O257401l609848K171936K813721M16870j197434l869247
$$ 894155884 891536484 900986633 907244034 903634186 905806122 908619843 909036713 907839279 903970032
734.4I03970032j904221N608215K671586m061051j808624q60062L100815N04532o321640
$$ 903970032 902065811 907674026 910345612 906284561 904475937 903615875 906716690 907221222 900899582
738.7I00899582K174454L890457k412110m753112N772476L057251j877747L291779
$$ 900899582 903074036 906964493 904552383 899799271 905571747 908628998 906751251 910043030
742.6I10043030L761596P305451L731460p470550l599396j030044r56574p43255J476898
$$ 910043030 913804626 921110077 924841537 917370987 913771591 912741547 911784973 911041718 912518616
746.9I12518616K341308j137924n123215N39551M216156l962250l356628L320541k625656
$$ 912518616 914859924 913722000 908598785 909138336 913354492 909392242 906035614 909356155 906730499
751.3I06730499l158798R47800j928787J051483l812638n928268l202057k922287M425049
$$ 906730499 903571701 904519501 902590714 903642197 899829559 893901291 890699234 887776947 892201996
755.6H92201996N553360l915482l6087n23910J549759J137695l068543J220551R01260
$$ 892201996 897755356 893839874 893803787 893279877 894829636 895967331 892898788 894119339 895020599
760H95020599l625335R28650O45980Q778229O080170k315445J839294L776398k505341
$$ 895020599 891395264 892323914 892969894 901748123 907828293 905512848 907352142 911128540 908623199
764.3I08623199M783249P704010K326813j733093o764755M90417J114884n86396J060105
$$ 908623199 913406448 921110458 923437271 921704178 914939423 915429840 916544724 915958328 917018433
768.6I17018433M670257Q07343m106446k396774M988403q65707O32172Q73336K989808
$$ 917018433 921688690 922496033 918389587 915992813 920981216 920115509 920747681 921621017 924610825
773I24610825K878036j021271k374572K260971k903214o074142J696548K734757L839416
$$ 924610825 927488861 926467590 924093018 926353989 923450775 917376633 919073181 921807938 925647354
777.3I25647354m69055m071426o825562M436493J4173660j2333679j2508392O492080
$$ 925647354 925178299 921106873 914281311 918717804 932891464 920557785 908049393 914541473
781.2I14541473J258469k582550O60019m518051q208008m108887p473602n641861J261444
$$ 914541473 915799942 913217392 913877411 909359360 901151352 897042465 889568863 883927002 885188446
785.5H85188446q812942j3196183r533081j1374435p116013j1794433j005555P320328
$$ 885188446 876375504 863179321 853646240 842271805 835155792 823361359 822355804 829676132
789.4H29676132O048813J0071564P651901J191788k690430L216324o798859j0107879
$$ 829676132 835724945 845796509 853448410 854640198 851949768 855166092 848367233 838259354
793.2H38259354j5904541j7958298p901306j6797257k1549835j3308029r835968j961517
$$ 838259354 822354813 804396515 796495209 779697952 758148117 744840088 735004120 733042603
797.1G33042603L174285K454377N645218Q216781M629822L234558R269180J1929398
$$ 733042603 736216888 738671265 744316483 752533264 757163086 760397644 769666824 781596222
800.9G81596222Q322220R048385J3168259N536041P473069J3103790R262390P822952
$$ 781596222 789918442 798966827 812135086 817671127 825144196 838247986 847510376 855333328
804.8H55333328Q004608K371293J377639O651001M839859N412369P254791O959687
$$ 855333328 863337936 865709229 867086868 873737869 878577728 883990097 891244888 898204575
808.7H98204575O365280J140213j291123P312775J239700j270752L179779M557572
$$ 898204575 904569855 905710068 904418945 911731720 912971420 911700668 914880447 919438019
812.5I19438019N786819j878128K898026J414566p320938N64041Q793945L111191L665008
$$ 919438019 925224838 923346710 926244736 927659302 920338364 920902405 929696350 932807541 936472549
816.9I36472549j850967o176224m468918J425705Q821183k83890p114868l094712Q21152
$$ 936472549 934621582 928445358 923976440 925402145 934223328 933939438 926824570 923729858 924551010
821.2I24551010R197312L589706l481979L673400O92826n36347n506820j830902M474639
$$ 924551010 933748322 937338028 933856049 937529449 938222275 937685928 932179108 930348206 934822845
825.5I34822845N990601J381455j1436921k776489J463318L040924J251678k201614
$$ 934822845 940813446 942194901 930757980 927981491 929444809 932485733 933737411 931535797
829.4I31535797J183014k260971k887955N505371K03934m354477Q197708J102066m921264
$$ 931535797 932718811 930457840 927569885 933075256 933279190 928924713 937122421 938224487 933303223
833.7I33303223K462692R6588K585831K455673k663116L876113m080047p866822k882690
$$ 933303223 935765915 935862503 938448334 940904007 938240891 942117004 938036957 930170135 927287445
838.1I27287445J715241N866775J130371n988617n666885M719848L317109J332779
$$ 927287445 929002686 934869461 935999832 930011215 924344330 929064178 932381287 933714066
841.9I33714066K381591l896103j828918K546768J624451j865158J472320K984925
$$ 933714066 936095657 932199554 930370636 932917404 934541855 932676697 934149017 937133942
845.8I37133942K709655K733002o269455o469040J167450Q293915k529068j022949
$$ 937133942 939843597 942576599 936307144 929838104 931005554 939299469 936770401 935747452
849.7I35747452j190567k201386p120895j841278Q94546m858093l837051P798614K068558
$$ 935747452 934556885 932355499 925234604 923393326 924287872 919429779 915592728 923391342 925459900
854I25459900l695068Q085403M285583l213500k92206J517410J0910j603699p36236
$$ 925459900 921764832 929850235 934135818 930922318 930630112 932147522 932158432 930554733 929818497
858.3I29818497l002014l758316m450760L098907Q718338p35397l199845j213607k710419
$$ 929818497 926816483 923058167 918607407 921706314 930424652 929689255 926489410 925275803 922565384
862.7I22565384q59070n280914j380310N982208K530899n896149k277298J377259Q18786
$$ 922565384 921706314 916425400 915045090 921027298 923558197 917662048 915384750 916762009 917580795
867I17580795k135544m498825L373871l156357q154754o016922K008362j272583j952820
$$ 917580795 915445251 910946426 914320297 911163940 903009186 896992264 899000626 897728043 895775223
871.3H95775223m16336k986679l496781J373139n787278j1694030j568604K259216
$$ 895775223 895358887 892372208 888875427 890248566 884461288 872767258 871198654 873457870
875.2H73457870j2528457j6687164n685807j0041351j5365219p267761n946045j7748719
$$ 873457870 860929413 844242249 838556442 828515091 813149872 805882111 799936066 782187347
879.1G82187347k1571960j7299271j3248138j7834702k7478180k5896377k4027634
$$ 782187347 760615387 743316116 730067978 712233276 684755096 658858719 634831085
882.4F34831085l1215400l3892479l0019455k4488793k7156753k2432328j2106475
$$ 634831085 603615685 569723206 539703751 515214958 488058205 465625877 453519402
885.8D53519402o075554r573174J435547K885094j370316J1786041J5763817J7531929
$$ 453519402 447443848 437870674 439306221 442191315 440820999 452607040 468370857 485902786
889.7D85902786J4940148J8368721K7488746K3003388J6989288K0649986K0742760
$$ 485902786 500842934 519211655 546700401 569703789 586693077 607343063 628085823
893F28085823J7463493K1540909K8551483K2024918J2723312J4320221K0687943J5099792
$$ 628085823 645549316 667090225 695641708 717666626 730389938 744710159 765398102 780497894
896.9G80497894R528885J4382858R991532N311050J2637024J0607605L803558O249848
$$ 780497894 790026779 804409637 814401169 819712219 832349243 842956848 846760406 853010254
900.8H53010254O929932L674850N81436J134415P471008K247162n10559P275238L172226
$$ 853010254 859940186 863615036 864196472 865330887 872801895 875049057 874538498 881813736 884985962
905.1H84985962l093948j266022J605072K933502j341095k022858l553924j751022
$$ 884985962 881892014 880625992 882231064 885164566 883823471 881800613 878246689 876495667
909H76495667j157380m922561j1940079j2363358j1121978j2930603j5846558j8493118
$$ 876495667 875338287 870415726 858475647 846112289 834990311 822059708 806213150 787720032
912.8G87720032j7691422r469375l51792M801407J1902161J2473907J6178284J8674850
$$ 787720032 770028610 760559235 760207443 765008850 776911011 789384918 805563202 824238052
916.7H24238052J1073456J2717972K903671j89285J0964584R686814J834182R797669
$$ 824238052 835311508 848029480 850933151 850743866 861708450 871395264 873229446 883027115
920.5H83027115L911209J1215363M177932l796844j413498o63300L146286O628647
$$ 883027115 886938324 898153687 902331619 898534775 897121277 896457977 899604263 906232910
924.4I06232910K629700r9716J967468J30310J989899N281677K4643l65601M555741
$$ 906232910 908862610 908762894 910730362 910860672 912850571 918132248 918156891 917791290 922347031
928.7I22347031L153686n433502k742767J109848J525268Q26340L470383m87137J539917
$$ 922347031 925500717 920067215 917324448 918434296 919959564 920785904 924256287 923769150 925309067
933.1I25309067j240692j91803r09348M982300k948380j788024J601333m426880j06735
$$ 925309067 924068375 923876572 922967224 927949524 925001144 923213120 924814453 920387573 920280838
937.4I20280838K29J126251l836670k757416J806336M150390J190796l315582M780655
$$ 920280838 920281067 921407318 917570648 914813232 916619568 920769958 921960754 918645172 923425827
941.8I23425827J982956J604919j515808l180313L488693m73938j570053n783310K782288
$$ 923425827 925408783 927013702 925497894 922317581 925806274 925332336 923762283 917978973 920761261
946.1I20761261Q347015K672882k917709o300659k420273K008286J665725J263199
$$ 920761261 929108276 931781158 928863449 922562790 920142517 922150803 923816528 925079727
949.9I25079727L099289o562271m910584K560425j776123q115005o372986m793625
$$ 925079727 928179016 921616745 916706161 919266586 917490463 909375458 903002472 898208847
953.8H98208847L76892l895721r689560J110687J054916j109924P90253J153946Q05053
$$ 898208847 898585739 894690018 885000458 886111145 887166061 886056137 886846390 888000336 888805389
958.1H88805389N011292P192383J118087L316193O032715j983643n002441L502350
$$ 888805389 893816681 901009064 902127151 905443344 911476059 909492416 904489975 907992325
962I07992325O049805J488723j328430N109863K294617j960678J273117M331970M48456
$$ 907992325 914042130 915530853 914202423 919312286 921606903 919646225 920919342 925251312 925699768
966.3I25699768k991714k844315K971954N308228J480102k038116n471573l68652K775573
$$ 925699768 922708054 919863739 922835693 928143921 929624023 927585907 922114334 921745682 924521255
970.7I24521255K214509J766738j917114j780624l53241o86798k184754l23181R82666
$$ 924521255 926735764 928502502 926585388 924804764 924451523 923764725 921579971 921256790 922239456
975I22239456J040268k320022j573792M96750R61304O00967q74481m00238n172196
$$ 922239456 923279724 920959702 919385910 919882660 920843964 921444931 920570450 920170212 914998016
979.4I14998016j309051q3847m965515m502793l217544M509201j050034m035797j960602
$$ 914998016 913688965 913605118 908639603 904136810 900919266 905428467 904378433 900342636 898382034
983.7H98382034J316376K412720l652878j734085J393967K255935J775131r21936k175750
$$ 898382034 899698410 902111130 898458252 896724167 898118134 900374069 902149200 901227264 899051514
988H99051514J802520k040481m872894L019790O217804L306885r766l084945j430893
$$ 899051514 900854034 898813553 893940659 896960449 903178253 906485138 906475372 903390427 901959534
992.4I01959534o80771K69012n02701j458892k083969l017045K593155J948471l178100
$$ 901959534 901278763 901547775 901045074 899586182 897502213 894485168 897078323 899026794 895848694
996.7H95848694J700134P31964J941071J213455j287766J508713o7444k05154j634674
$$ 895848694 897548828 898280792 900221863 901435318 900147552 901656265 901588821 901383667 899748993
1001.1H99748993j78528n48096q84933P45087m514695l197860L984298K753678J346893
$$ 899748993 899570465 899022369 898137436 898882523 894367828 891169968 895154266 897907944 899254837
1005.4H99254837l91540k563935j720886l849564p530517n574341k891617l32489k641601
$$ 899254837 898863297 896299362 894578476 890728912 883198395 877624054 874732437 874399948 871758347
1009.7H71758347l835068k469864j391068l697815j659851J170121j701889o660386
$$ 871758347 867923279 865453415 864062347 860364532 858704681 859874802 858172913 851512527
1013.6H51512527o770095k779618Q42209j425705L742829J162109l674774j848526
$$ 851512527 844742432 841962814 842805023 841379318 845122147 846284256 842609482 840760956
1017.5H40760956K354049M824372J452255j87836K62223l554764p13654K820053K448197
$$ 840760956 843115005 847939377 849391632 849203796 849466019 845911255 845197601 848017654 850465851
1021.8H50465851J471252M70887q77686K60391L087158J692658K857666O718979K911529
$$ 850465851 851937103 852407990 851530304 851790695 854877853 856570511 859428177 866147156 869058685
1026.1H69058685p97348M89731J514053J079636k1667J390762q94318M456330L877258
$$ 869058685 868261337 868751068 870265121 871344757 871323090 872713852 871819534 876275864 880153122
1030.5H80153122K20032L863754P73087m366303r15527N134658q95156r52683K934952
$$ 880153122 880373154 884236908 885009995 880643692 879728165 884862823 883967667 883014984 885949936
1034.8H85949936j160736n261917l451157m069214j941452M050827K282105m64249
$$ 885949936 884789200 879527283 876076126 872006912 870065460 874116287 876398392 875934143
1038.7H75934143J633148m083786l889007j260147K029037l39279P29904M435272r14459
$$ 875934143 877567291 873483505 869594498 868334351 870363388 870024109 870754013 875189285 874274826
1043H74274826n213242l98864Q0337k747574l995361M81110L815689l015366o332016
$$ 874274826 869061584 868662720 868743057 865995483 862000122 862481232 866296921 863281555 856949539
1047.4H56949539k702484m84619m365082l975677m702835m192048k726211k921829
$$ 856949539 854247055 853762436 849397354 845421677 840718842 836526794 833800583 830878754
1051.2H30878754k840195L89709N309220K821121L654480M234161P207642N574646
$$ 830878754 828038559 828428268 833737488 836558609 840213089 844447250 851654892 857229538
1055.1H57229538N18951L026276L317184M149857Q4457j878738M117737N031891L40194
$$ 857229538 857748489 860774765 864091949 868241806 868326263 866447525 870565262 875597153 875937347
1059.4H75937347n241165M323197P508392j205826k441253Q39462M035721L436813
$$ 875937347 870696182 875019379 882527771 881321945 878880692 879720154 883755875 887192688
1063.3H87192688l972244m632874L083267L054505l549423J697464L930740K678757
$$ 887192688 883220444 878587570 881670837 884725342 881175919 882873383 886804123 889482880
1067.1H89482880K317886L57513l005294l631974K19269J298447j643372j223984J573410
$$ 889482880 891800766 892158279 889152985 885521011 885740280 887038727 885395355 884171371 885744781
1071.5H85744781K047425m90341k9679J311875j212387m620133L854752M822311n548324
$$ 885744781 887792206 887301865 887272186 888584061 887371674 882751541 886606293 891428604 885880280
1075.8H85880280l372574q06275o85959L824311k296219J520462M090347N29175j510925
$$ 885880280 882507706 881701431 881015472 884839783 882543564 884064026 888154373 888683548 887172623
1080.1H87172623l884812r52301M815903N798R48334M009552J071701j122284L24860
$$ 887172623 883287811 882335510 887151413 887157211 888105545 892115097 893186798 892064514 892389374
1084.5H92389374M61654J384659L224716J190720Q12302K1362m99115L06015j691132
$$ 892389374 892851028 894235687 897460403 898651123 899463425 899484787 898985672 899291687 897600555
1088.8H97600555m63104k71149P26090k493439j641998L764038O69174p72323j441498
$$ 897600555 897137451 896866302 897592392 895098953 893456955 897220993 897890167 897117844 895676346
1093.2H95676346j881638K672119K580338j600037o21872K34375P3853J882400J557312
$$ 895676346 893794708 896466827 899047165 897447128 896825256 897059631 897133484 899015884 900573196
1097.5I00573196k018356l120575R98154j692887l88946J915817p93838l729172o74362
$$ 900573196 898554840 895434265 896432419 894739532 894350586 896266403 895472565 891743393 891069031
1101.8H91069031j898346j280747J409378o84051r85947J849823O78330j800690n570755
$$ 891069031 889170685 887889938 889299316 888615265 887629318 889479141 890157471 888356781 882786026
1106.2H82786026k20642M564209o32858j953125j68915L247680j158065j651612J938553
$$ 882786026 882565384 887129593 886496735 884543610 884374695 887622375 886464310 884812698 886751251
1110.5H86751251l732300j018295k682342k468415K653961L216553l164520k154236
$$ 886751251 883018951 882000656 879318314 876849899 879503860 882720413 879555893 877401657
1114.4H77401657L272400K089920k122955R29718L071594n19562L23181L155442P82623
$$ 877401657 880674057 882763977 880641022 881570740 884642334 884122772 884445953 887601395 888384018
1118.7H88384018K8000R28955K4261J799012K051620K795258L828048K401352j385345
$$ 888384018 888412018 889340973 889365234 891164246 893215866 896011124 899839172 902240524 900855179
1123.1I00855179m003754j996765K744522L965073j879883k468185L431625L3798r20792
$$ 900855179 896851425 894854660 897599182 901564255 899684372 897216187 900647812 900681610 899760818
1127.4H99760818M488984O02798P00379L47518J53351k6779k018585j594925l292313
$$ 899760818 904249802 904852600 905552979 905900497 906053848 906027069 904008484 902413559 899121246
1131.7H99121246p55310L356858J681976N18951J436310n63202n064239l835144J181717
$$ 899121246 898365936 901722794 903404770 903923721 905360031 904796829 899732590 895897446 897079163
1136.1H97079163L086929o59943o13861K683487k287903P6294J281433l127136k702103
$$ 897079163 900166092 899506149 898892288 901575775 899287872 899364166 900645599 897518463 894816360
1140.4H94816360P06101k971039l848953k830734k936707m854507m507294l610077
$$ 894816360 895522461 892551422 888702469 885871735 882935028 878080521 873573227 869963150
1144.3H69963150q209152j3108444j2131501p269134n839920l335953L16162j028671
$$ 869963150 861753998 848645554 836514053 829244919 823404999 820069046 820385208 819356537
1148.1H19356537K020721N084076O987458N969161K581711M297180L655930k372971
$$ 819356537 821377258 826461334 833448792 839417953 841999664 846296844 849952774 847579803
1152H47579803p253952p296829k102737q361664q882217p22199K038498J95694M205627
$$ 847579803 840325851 833029022 830926285 822564621 813682404 812960205 814998703 815194397 819400024
1156.3H19400024R665070N927963O708298R009781Q431015J0217438Q842468N959320
$$ 819400024 829065094 834993057 841701355 850711136 859142151 869359589 878202057 884161377
1160.2H84161377J074753K127456J491852J134110K885895J759643j031952K766876
$$ 884161377 885236130 887363586 888855438 889989548 892875443 894635086 893603134 896370010
1164.1H96370010M116822L66134q25424J409378J616364L216095n58930j885071K31934
$$ 896370010 900486832 900852966 900027542 901436920 903053284 906269379 905710449 903825378 904057312
1168.4I04057312J046143j431961J187515N109863K634888n567017n685196J385041
$$ 904057312 905103455 903671494 904859009 909968872 912603760 907036743 901351547 902736588
1172.2I02736588N763626L910675j759110l042526o79169j47629M59290J372223P54166
$$ 902736588 908500214 912410889 910651779 907609253 906930084 906782455 907241745 908613968 909368134
1176.6I09368134r14841n32074J663589n48019l00522J712494N27039M32815l617172
$$ 909368134 908453293 907921219 909584808 909036789 908736267 910448761 910975800 911408615 907791443
1180.9I07791443l33786K000427K128677J164322K594k173996p83157k632828m56466
$$ 907791443 907457657 909458084 911586761 912751083 912753677 910579681 909796524 907163696 906707230
1185.3I06707230K741317j357422k772369K002030L441238j531754O09970J762162
$$ 906707230 909448547 908091125 905318756 907320786 910762024 909230270 909840240 911602402
1189.1I11602402j871567j502152K17057r37271M37317M68750m6998j081085l358688
$$ 911602402 909730835 908228683 908445740 907508469 907945786 908414536 908367538 907286453 903927765
1193.5I03927765j917420M27399l917312k108994O33926k868194p817154j418533P86743
$$ 903927765 902010345 902437744 898520432 896411438 897045364 894177170 886360016 884941483 885728226
1197.8H85728226j517258k715912J608277M725875J232987O57272R16519K938919J583405
$$ 885728226 884210968 881495056 883103333 887829208 889062195 889719467 890635986 893574905 895158310
1202.1H95158310M18854j494141R52454M12216j433792J538162l96652o89087J661453
$$ 895158310 895577164 894083023 895035477 895447693 894013901 895552063 895155411 894466324 896127777
1206.5H96127777J979675j38626q27636k44446j183701Q17719K767257K510224L045730
$$ 896127777 898107452 897968826 897141190 896896744 895713043 896530762 899298019 901808243 904853973
1210.8I04853973J01242k406082k80533K783051L262787J316986O56204J428147k868195
$$ 904853973 904955215 902549133 902268600 905051651 908314438 909631424 910287628 911715775 908847580
1215.2I08847580j723023j250915j384659n63888n88913M21524L442764K481079l739853
$$ 908847580 907124557 905873642 904488983 903925095 903336182 903757706 907200470 909681549 905941696
1219.5I05941696l143844P06863J412048k33993j565781M79813j0376j977768m870987
$$ 905941696 902797852 903504715 904916763 904682770 903116989 903596802 903586426 901608658 896737671
1223.8H96737671j809464k22168l053588k920838R71375l541413k520904R3994k574310
$$ 896737671 894928207 894706039 891652451 888731613 889702988 886161575 883640671 883734665 881160355
1228.2H81160355J429748L746338J785126J487198K47955o74210K282410m9820k057953
$$ 881160355 882590103 886336441 888121567 889608765 889856720 889182510 891464920 891415100 889357147
1232.5H89357147M86374j764526k308045j124038k353745m11072J250992P12433N44586
$$ 889357147 889843521 888078995 885770950 884646912 882293167 881882095 883133087 883845520 884390106
1236.9H84390106K297745j548080k746277l92685J51214R13239O56738j706848o50558
$$ 884390106 886687851 885139771 882393494 882000809 882152023 883065262 883722000 882015152 881364594
1241.2H81364594j408310J239013k33688m57611J903000J111984m9667k039261J648559
$$ 881364594 879956284 881195297 880961609 880503998 882406998 883518982 883469315 881430054 883078613
1245.5H83078613J879044J169281L869552K525712m35334K19116j102142j500931O83747
$$ 883078613 884957657 886126938 889996490 892522202 892086868 892305984 891203842 889702911 890386658
1249.9H90386658J186676M66842k52838m697342j529541K880707K92359j969071P57294
$$ 890386658 891573334 892040176 891787338 887089996 885560455 888441162 888733521 886764450 887521744
1254.2H87521744L038940j144104j620788J796493K029114K991867j608200l334885
$$ 887521744 890560684 889416580 887795792 889592285 891621399 894613266 893005066 889670181
1258.1H89670181o98547J465301J163865K100219J476212m2496j288910L31955M276886
$$ 889670181 888971634 890436935 891600800 893701019 895177231 895134735 893845825 894177780 898454666
1262.4H98454666J444855j30005p24640K91901O51703q87986M76151K551880n66178
$$ 898454666 899899521 899769516 899044876 899336777 899988480 899100494 899576645 902128525 901562347
1266.8I01562347J707535L627320m20533j644287r68017j341553q43430L52555q3390
$$ 901562347 903269882 906897202 906476669 904832382 903864365 902522812 901679382 902031937 901948547
1271.1I01948547J496430k471085k132492R98001o89544k540284m33883J200638j173859
$$ 901948547 903444977 900973892 898841400 899839401 899149857 896609573 896175690 897376328 896202469
1275.4H96202469j712570n26123J364975J83563n78919l738K34985J381531J612854
$$ 896202469 894489899 893963776 895328751 895512314 894933395 894929657 895164642 896546173 898159027
1279.8H98159027k64740p94449J09329Q49610k47269m254074m272995r4833k53830
$$ 898159027 897894287 897099838 897209167 898058777 897811508 893557434 889284439 889189606 888935776
1284.1H88935776j09482j327667j500931P40204k50855r34753k947312P85065K362061
$$ 888935776 888826294 887498627 885997696 886737900 886487045 885552292 882604980 883390045 885752106
1288.5H85752106J015472j142502J052780K565308J993179Q83255O81610J348877K025452
$$ 885752106 886767578 885625076 886677856 889243164 891236343 892119598 892801208 894150085 896175537
1292.8H96175537n52750q91876k74200K10571P7286L44238j019058k45285n78385r31091
$$ 896175537 895622787 894730911 894456711 894667282 894744568 895088806 894069748 893824463 893246078 892314987
1297.6H92314987o45294j44653K037658j153793j593780P33337p5989l83224j105271
$$ 892314987 891669693 891525040 893562698 892408905 890815125 891548462 891472473 891089249 889983978
1302H89983978l926544M03290N32074j245194L73612k369690n6381p08313J203537
$$ 889983978 886057434 886460724 886992798 885747604 886121216 883751526 883695145 882986832 884190369
1306.3H84190369K17132k030868O10m17480k850342r20563l85742l958130j543121
$$ 884190369 884407501 882376633 882377243 881959763 879109421 878188858 877803116 873844986 872301865
1310.6H72301865L645935K170028J225739K006760k26441M959J110001J602249J835709
$$ 872301865 875947800 878117828 879343567 881350327 881123886 881128845 882238846 883841095 885676804
1315H85676804L200607K200012M94003J138611J208115K352829k215958j730575Q24279
$$ 885676804 888877411 891077423 891571426 892710037 893918152 896270981 894055023 892324448 893148727
1319.3H93148727K86789l817520j897583M00238K148133O97860n81360J92337n57556
$$ 893148727 893435516 889617996 887720413 888120651 890268784 890966644 890385284 890577621 890020065
1323.7H90020065m005279j303482q4610N78460j416320l172608l41568J717606O19278
$$ 890020065 886014786 884711304 884626694 885205154 883788834 880616226 880274658 881992264 882611542
1328H82611542R88693o04248l87344L64532Q47168J159210n01861l209992j960602
$$ 882611542 883600235 882995987 882608643 882973175 883820343 884979553 884477692 881267700 879307098
1332.3H79307098J517640J898345L563462J893005k397842r31626K954331J754074
$$ 879307098 880824738 882723083 886286545 888179550 885781708 884850082 887804413 889558487
1336.2H89558487j151962J886139J795120J109543K055816R48334k501144k505646
$$ 889558487 888406525 890292664 892087784 893197327 895253143 896201477 893700333 891194687
1340.1H91194687j122666L369370m05426k378082R72290K051925R12323J5641k952958
$$ 891194687 890072021 893441391 893035965 890657883 891630173 893682098 894594421 894610062 891657104
1344.4H91657104J970521K789840j005783j892547j672822l393707R84268Q91037j720886
$$ 891657104 893627625 896417465 895411682 893519135 891846313 888452606 889436874 890327911 888607025
1348.7H88607025j330566L43399L08533M70962R58710j002426j500092r57947j062088
$$ 888607025 887276459 887619858 887928391 888399353 889358063 888355637 886855545 885897598 884835510
1353.1H84835510J09864l4791j129150j436996K192611K204361j354980q48694r38644
$$ 884835510 884945374 884910583 883781433 882344437 884537048 886741409 885386429 884537735 883599091
1357.4H83599091m134369k583313J189727J10627J992569K685012k323913n422821
$$ 883599091 879464722 876881409 878071136 878181763 880174332 882859344 880535431 875112610
1361.3H75112610K237320O96029p278289r853440j374740p06330l521347l699951m023056
$$ 875112610 877349930 878045959 870767670 860914230 859539490 858833160 855311813 851611862 847588806
1365.6H47588806m580078m893570n194092m025039l930359p995835j0153274p370529
$$ 847588806 843008728 838115158 832921066 828896027 824965668 816969833 806816559 799446030
1369.5G99446030n987091o791993o168212o974488n943908l096543k817383o690139
$$ 799446030 793458939 786666946 780498734 773524246 767580338 764483795 761666412 754976273
1373.3G54976273j3156434q921966o257706j4382934n626526k423325n942688k185669
$$ 754976273 741819839 732897873 726640167 712257233 706630707 704207382 698264694 696079025
1377.2F96079025M334030J2129288J8041458J9087220J6016922J6516036J5329896
$$ 696079025 700413055 712542343 730583801 749671021 765687943 782203979 797533875
1380.6G97533875R995346Q161544Q101426O431884M992447L560181K627411K857666
$$ 797533875 807529221 815690765 823792191 830224075 835216522 838776703 841404114 844261780
1384.4H44261780M167175L860779M994430L866425K77557l364944l342438M607849
$$ 844261780 848428955 852289734 857284164 861150589 861428146 858063202 854720764 859328613
1388.3H59328613J652985j34201K477188K814941L02201n646j00403K12784J914139
$$ 859328613 860981598 860847397 863324585 866139526 866441727 866436081 866335678 866548462 868462601
1392.6H68462601L470230O324615J436692j0789109n129394J090011q03146L198318
$$ 868462601 871932831 878257446 879694138 868905029 863775635 864865646 864062500 867260818
1396.5H67260818N284958J174851o02799L906250J049500p305298l72009J285934j261368
$$ 867260818 872545776 873720627 873117828 877024078 878073578 870768280 870396271 871682205 870420837
1400.8H70420837J17417P46078J345063K23770Q15658K102051L249435l435287q355866
$$ 870420837 870538254 871284332 872629395 872853165 873668823 875770874 879020309 875585022 867229156
1405.2H67229156l131484J477355J955338J191330K70767j633835k209243L46908J432190
$$ 867229156 864097672 865575027 867530365 868721695 868992462 867358627 865149384 865496292 866928482
1409.5H66928482m0817K81524P98111r3231l371429k114640k126693j676560r40704
$$ 866928482 866887665 867169189 867967300 867874069 864502640 862388000 860261307 858584747 857644043
1413.8H57644043L20358r9182j488342o73905j006240k18125l531418k703323M070358
$$ 857644043 857964401 857865219 856376877 855702972 854696732 854478607 850947189 848243866 852314224
1418.2H52314224J066666o861649j7621231J756363L355103l614960k229309q04672
$$ 852314224 853380890 846519241 828898010 830654373 834009476 830394516 828165207 827360535
1422H27360535j808930l404846n391464p603989o796875m740600n095444n991516o426697
$$ 827360535 825551605 822146759 816755295 809151306 802354431 797613831 792518387 786526871 780100174
1426.4G80100174p304993q604889r058303j0262528q388061q897019j6883087k2105408
$$ 780100174 772795181 764190292 755131989 744869461 736481400 727584381 710701294 688595886
1430.2F88595886q925323j0325775j1689072j1131134r852524j2075806j2571601r028664
$$ 688595886 679670563 669344788 657655716 646524582 636672058 624596252 612024651 602995987
1434.1F02995987n700111n183487j950837K857171L410987j8058815J209526P652474
$$ 602995987 597295876 592112389 590161552 593018723 596429710 578370895 579580421 587232895
1437.9E87232895N908890M388427M275589K632943L619308L883324M726028L633728
$$ 587232895 593141785 597530212 601805801 604438744 608058052 611941376 616667404 620301132
1441.8F20301132K846146M661980O387329M153976L390923J223068K510605M454727
$$ 620301132 623147278 627809258 634196587 638350563 641741486 642964554 645475159 649929886
1445.7F49929886J928711K128906M977341J618652m612121l761292k81372j715927
$$ 649929886 651858597 653987503 658964844 660583496 655971375 652210083 651928711 650212784
1449.5F50212784q15659m421463m485626l802681m760056n487442m43649K982941N215301
$$ 650212784 649397125 644975662 640490036 636687355 631927299 626439857 625996208 628979149 634194450
1453.9F34194450O248360P914734J0095215J7214737J9072265J0905075n624694J2429123
$$ 634194450 640442810 648357544 658452759 675667496 694739761 705644836 700020142 712449265
1457.7G12449265J1578598R068450P559433R678574J1219025P293777O183472R287567
$$ 712449265 724027863 733096313 740655746 750334320 761553345 768847122 775030594 784318161
1461.6G84318161R158325R619446N811615O054382O997376K365188p78350R42611M866104
$$ 784318161 793476486 803095932 808907547 814961929 821959305 824324493 823546143 824488754 829354858
1465.9H29354858M574204M633102K006073J718903L248978K689514J634369K424469
$$ 829354858 833929062 838562164 840568237 842287140 845536118 848225632 849860001 852284470
1469.8H52284470N054702O190110M500351M232635m326630M50974K254562r260635
$$ 852284470 857339172 863529282 868029633 872262268 867935638 868386612 870641174 861380539
1473.6H61380539Q0490M932938L644256N880356q38013p829895K433930L406601J812057
$$ 861380539 861461029 866393967 870038223 875918579 875080566 867250671 869684601 873091202 874903259
1478H74903259J428147k376404j535187L266602N005035J647644o059799j205673L511123
$$ 874903259 876331406 873955002 872419815 875686417 880691452 882339096 876279297 875073624 878584747
1482.3H78584747K760163J601867r92279j070938K79694k3346J043548M602051O401291
$$ 878584747 881344910 882946777 881954498 880883560 881163254 881139908 882183456 886785507 893186798
1486.6H93186798J51825m761734l0365L029633L686370O55900m793015k560654l836212
$$ 893186798 893338623 888576889 888546524 891576157 895262527 895918427 891125412 888564758 884728546
1491H84728546j32675L985290J766434R14612n21316M21981J219101N035553L843918
$$ 884728546 884595871 888581161 890347595 891262207 890740891 891162872 892381973 897417526 901261444
1495.3I01261444m526138j5562287K658387O950149N081406K737732o144409n017167
$$ 901261444 896735306 881173019 883831406 890781555 895862961 898600693 892456284 887439117
1499.2H87439117J832428K778931P09839L207931n71823k849655J895371j84327j344833
$$ 887439117 889271545 892050476 892760315 895968246 895396423 892546768 894442139 894257812 892912979
1503.5H92912979K933350P608871P306290n33295j5122299O216736O95724p817459
$$ 892912979 895846329 903455200 910761490 910228195 895105896 901322632 902018356 894200897
1507.4H94200897N540161j537323n401306L793869j572113m595718M699325N369339
$$ 894200897 899741058 898203735 892802429 896596298 895024185 890428467 895127792 900497131
1511.2I00497131J225129m651566l690643L701248L47519j66092J368713j161499K610398
$$ 900497131 901722260 897070694 893380051 897081299 897428818 897262726 898631439 897469940 900080338
1515.6I00080338N510177O110077m091797j4042511k526092O817321O578598K950440
$$ 900080338 905590515 911700592 907608795 893566284 891040192 897857513 904436111 907386551
1519.4I07386551R75647k723541q55713j0769196J922302L835679o082764M26330M603501
$$ 907386551 908362198 905638657 904782944 894013748 895936050 899771729 893688965 894115295 898718796
1523.8H98718796M273910K585221p329560r295425P256164L861542j650390p76749
$$ 898718796 902992706 905577927 898248367 888952942 896209106 900070648 898420258 897643509
1527.6H97643509N88226l545913Q25958L357010M45480Q19702J194077n54734m0130
$$ 897643509 898231735 894685822 895511780 898868790 899314270 900133972 901328049 900773315 900733185
1532I00733185K909927K05918m279938n171051j041413K832795o05469L47137R71680
$$ 900733185 903643112 903849030 899569092 894398041 893356628 896189423 895583954 895931091 896902771
1536.3H96902771K555313K565765M251023P195206K86636j5509415N847855n08194
$$ 896902771 899458084 902023849 906274872 913470078 913756714 898247299 904095154 903586960
1540.2I03586960n245056N391159J214370j1581954L403244N497894k487259J499405
$$ 903586960 898341904 903733063 904947433 893365479 896768723 902266617 899779358 901278763
1544I01278763O65359o419525n263977L396912N75638P35321M305038R93271K97928
$$ 901278763 901944122 895524597 890260620 893657532 894233170 894968491 899273529 900266800 900564728
1548.4I00564728K670288q11844n741882p130509R49478K339707K22244J812973M457550
$$ 900564728 903235016 902423172 896681290 889550781 890500259 892839966 893062210 894875183 899332733
1552.7H99332733N653839m03290j0337295j1121368N524444N756302M045563N615463
$$ 899332733 904986572 904583282 894245987 883124619 888649063 894405365 898450928 904066391
1556.6I04066391Q306046K004241n415344n770111J079788O492463j9839173k0995331
$$ 904066391 912372437 914376678 908961334 903191223 904271011 910763474 890924301 869928970
1560.4H69928970J1975785Q424224L179474j7471J222458J232758K978134J655502
$$ 869928970 881904755 890328979 893508453 893490982 894713440 895946198 898924332 900579834
1564.3I00579834m379959l308716K843704j24969o05316J172714P86667K602005Q58383
$$ 900579834 896199875 892891159 895734863 895609894 895004578 896177292 896963959 899565964 900424347
1568.6I00424347Q98285o941376j0149383J328353K205887J963730p39441r90448J587372
$$ 900424347 901322632 894381256 884231873 885560226 887766113 889729843 888990402 887999954 889587326
1573H89587326M9820j295624J776657M906617O503067L96957j9642716L15705L707809
$$ 889587326 889637146 888341522 890118179 895024796 901527863 901924820 882282104 882597809 886305618
1577.3H86305618p41653l20816o33850K425537R26971j330795J068j806793o79169
$$ 886305618 885563965 885243149 884609299 887034836 887961807 886631012 886632080 884825287 884146118
1581.6H84146118N70374j197968j158447K63367R38186l74527j242065J300659o07605
$$ 884146118 884716492 883518524 882360077 882623444 883561630 883187103 881945038 883245697 882638092
1586H82638092l233108K58483K875367J79672o35529N41611k808151k474671P97577
$$ 882638092 879404984 879663467 882538834 882718506 882082977 882624588 879816437 877341766 878139343
1590.3H78139343K672577L029862l47290k448426o81762j368409j179962p11822R11712
$$ 878139343 880811920 883841782 883494492 881046066 880364304 878995895 877815933 877104111 878015823
1594.7H78015823K742768K115020j08718k939072j061249J106339n87616J070785Q02841
$$ 878015823 880758591 882873611 882764893 879825821 878764572 879870911 879283295 880354080 881156921
1599H81156921j060333m85000J010589N24140Q48617J927719l64609k184143l9291
$$ 881156921 880096588 879611588 880622177 881146317 881994934 883922653 883558044 881373901 881334610
1603.3H81334610J090088O5307j782379l3569K412949K63061k318954k621155l68195
$$ 881334610 882424698 882490005 880707626 880674057 883087006 883350067 881031113 878409958 878041763
1607.7H78041763L609543J575165n93491j617355l82843J737137m4327j770630j348190
$$ 878041763 881651306 883226471 882632980 881015625 880632782 882369919 882325592 880554962 879206772
1612H79206772J866684n66864l204651N85098Q98056J756592L748398J009064j602173
$$ 879206772 881073456 880506592 877301941 877887039 878785095 880541687 884290085 885299149 883696976
1616.4H83696976j5105439j55105P168350J584244j733475J174622q48465j067429
$$ 883696976 868591537 868436432 875604782 877189026 875455551 876630173 875781708 874714279
1620.2H74714279L72162m09775P32117L38135J215057M313965o461334r909210R39254
$$ 874714279 875086441 874676666 875408783 875746918 876961975 881275940 874814606 864905396 865844650
1624.6H65844650L724518N01785R11026K008667Q07953k445221o733246k737197J270828
$$ 865844650 869569168 870070953 870981979 872990646 873798599 871353378 864620132 861882935 863153763
1628.9H63153763P25784p01370k242050k551804k943191o92292q12225j976318k001419
$$ 863153763 863879547 863178177 860936127 858384323 855441132 854748840 853936615 851960297 849958878
1633.2H49958878J199722L081512j166992j7650909k9757843M362259Q489074j247711
$$ 849958878 851158600 854240112 853073120 835422211 805664368 810026627 818515701 817267990
1637.1H17267990j3173141j0971375o307068j0213928j3837433j5565338j7463379
$$ 817267990 804094849 793123474 786816406 776602478 762765045 747199707 729736328
1640.5G29736328j6802063j4380340j3286057j3671493j4140473j1013641n278397
$$ 729736328 712934265 698553925 685267868 671596375 657455902 646442261 641163864
1643.8F41163864j968231J318664N039597N589371n186463J1855927K0584106J5546952
$$ 641163864 639195633 640514297 645553894 651143265 645956802 657812729 678396835 693943787
1647.7F93943787J4406814J5837555J8707657J6187820J6423264J4077835J3810349
$$ 693943787 708350601 724188156 742895813 759083633 775506897 789584732 803395081
1651.1H03395081J4759674J6025695J8724823m090347n143127O417236k480545l321228
$$ 803395081 818154755 834180450 852905273 848814926 843671799 850089035 847608490 844287262
1654.9H44287262N446701L958435L930740L614350J556549K192459K274322N68314
$$ 844287262 849733963 853692398 857623138 861237488 862794037 864986496 867260818 867829132
1658.8H67829132P60269J845246J591568K289733K161713L578797L775177p105866
$$ 867829132 868589401 870434647 872026215 874315948 876477661 880056458 883831635 876725769
1662.7H76725769j2919083L781815N432739P99408J134949P89413J601563L043899
$$ 876725769 863806686 867588501 873021240 873820648 874955597 875745010 877346573 880390472
1666.5H80390472L28293J829987L107681K809754p0115j1369552k028198M861526L267059
$$ 880390472 880718765 882548752 885656433 888466187 888396072 877026520 874998322 879859848 883126907
1670.9H83126907j595535r779587P92237M882507K408523R17664Q92792L764953q952636
$$ 883126907 881531372 871751785 872544022 877426529 879835052 880752716 881645508 885410461 876457825
1675.2H76457825k2305832P973785P440796K089539j046601j433334K090073N194931
$$ 876457825 854151993 862125778 869566574 871656113 870609512 869176178 871266251 876461182
1679H76461182N502166j29089k741852r22241L216553N894851P283173O356278r99299
$$ 876461182 881963348 881834259 879092407 878170166 881386719 887281570 894564743 900921021 899921722
1683.4H99921722m513321n841903k2518082M688568J4354935N189133J410293J060257
$$ 899921722 895408401 889566498 867048416 871736984 886091919 891281052 892691345 893751602
1687.2H93751602r44290m66537l54844L777771K812653l416595l535004N49240j524582
$$ 893751602 892807312 892340775 891985931 895763702 898576355 895159760 891624756 892173996 890649414
1691.6H90649414K506943K424087j405487J425019K114944N032425P123260m813690
$$ 890649414 893156357 895580444 894174957 895599976 897714920 902747345 909870605 905056915
1695.4I05056915k5701599L007279O896667K547760K710419Q349685Q854065L439866
$$ 905056915 879355316 882362595 889259262 891807022 894517441 902867126 911721191 915161057
1699.3I15161057l432923l1324615j4823380J8525543Q650055J708908N38407K534637
$$ 915161057 911728134 880403519 865580139 884105682 892755737 894464645 895003052 897537689
1703.2H97537689K980118l160782l690948K249908J241379k088318n530853L68652
$$ 897537689 900517807 897357025 893666077 895915985 897157364 895069046 889538193 889906845
1707H89906845J996918p67670J1292L17459N90820p63931j900635J725922R97085J407242
$$ 889906845 891903763 891136093 891147385 891464844 892055664 891291733 889391098 891117020 892114105 893521347
1711.8H93521347J933899o9885K278366M073410j341324m010849o877670K134933Q125305
$$ 893521347 895455246 895385361 897663727 901737137 900395813 896384964 889507294 891642227 899767532
1716.2H99767532M747086j128540o756058N122910n752487q642808L396607J866531
$$ 899767532 904514618 903386078 896630020 901752930 896000443 887357635 890754242 892620773
1720H92620773p2174K909241r18274j155930K398072n90515k101288O37054R69696
$$ 892620773 892548599 895457840 894539566 893383636 895781708 895191193 893089905 893726959 894696655
1724.4H94696655l39355K164535R079j567383J996689K033692J605301M97741N15290
$$ 894696655 894357300 896521835 896530914 894963531 896960220 898993912 900599213 901096954 901612244
1728.7I01612244J633834k381744k791519j71814L478928N67398L433914N881271L790589
$$ 901612244 903246078 900864334 898072815 897901001 901379929 901947327 905381241 911262512 915053101
1733.1I15053101m843827j3610382k0322494M50973J5515824M873962j161652L08152
$$ 915053101 910209274 896598892 876276398 876727371 892243195 897117157 895955505 896263657
1736.9H96263657R69543L47900M774094J703720n02090m598694o703949R80835J633758
$$ 896263657 897233200 897581100 902355194 904058914 903556824 898958130 892254181 893235016 894868774
1741.3H94868774K243576K316514L099746m333954k456817J657028J059570k49634
$$ 894868774 897112350 899428864 902528610 898194656 895737839 897394867 898454437 898204803
1745.1H98204803P55539j010131O76193J719589n1193J296310l430710m103317L521271
$$ 898204803 898960342 897950211 898626404 900345993 900294800 901591110 898160400 894057083 897578354
1749.5H97578354L482971J885605n26047j0187988l934097M905471L123322K583237
$$ 897578354 901061325 902946930 902420883 892232895 888298798 893204269 896327591 898910828
1753.3H98910828j80436k094650P17011J610183J794205J251526m846573n943375J654282
$$ 898910828 898730392 896635742 897352753 898962936 900757141 902008667 897162094 891218719 892873001
1757.6H92873001K903290j865540j002350J338730K345581M162293J063156n825119
$$ 892873001 895776291 893910751 892908401 894247131 896592712 900755005 901818161 895993042
1761.5H95993042q669739L405457L782654K56805J402206o90689q57162M89883j372452
$$ 895993042 887323303 890728760 894511414 894768219 896170425 895479736 894622574 895112457 893740005
1765.8H93740005j929550J649247K968902j492309p560120j270294L394394L845062
$$ 893740005 891810455 893459702 896428604 894936295 887376175 886105881 889500275 893345337
1769.7H93345337L093338K290268m793320o075516P100754k062683j5072632M77906
$$ 893345337 896438675 898728943 893935623 887860107 894960861 892898178 877825546 878303452
1773.6H78303452M015197K271271J152802k482682l636474L284225J549149l161698
$$ 878303452 882318649 884589920 885742722 883260040 879623566 882907791 884456940 881295242
1777.4H81295242l85589M00467j1750m9362n08270j320114p76139J925431J04980q02002
$$ 881295242 880909653 881310120 881298370 881249008 880740738 879420624 878644485 880569916 880674896 879872894
1782.2H79872894Q00171P7362j068802K673569J570740k997513j143341J788177l62548
$$ 879872894 880673065 880750427 879681625 882355194 883925934 880928421 879785080 881573257 881210709
1786.6H81210709R86099J176987N76477Q12530l36685J447678L325576K379685Q52585
$$ 881210709 882196808 883373795 883950272 884762802 884426117 885873795 889199371 891579056 892431641
1790.9H92431641j811524J378784j232223r276352O44607M687119N059738L183136
$$ 892431641 890620117 891998901 890766678 881490326 882134933 886822052 891881790 895064926
1794.8H95064926j459274k063294k238464o92596K936782K790986K3345j90887j230087
$$ 895064926 893605652 891542358 889303894 888611298 891548080 894339066 894362411 894171524 892941437
1799.1H92941437r10416m0741M078369L423615r18198j967773l653031J42289L963699
$$ 892941437 892031021 891990280 896068649 899492264 898574066 896606293 892953262 893095551 897059250
1803.5H97059250j061630j531983K31934Q26874J791687k012253j426544J487655M95835
$$ 897059250 895997620 894465637 894697571 895524445 897316132 895303879 893877335 895364990 895860825
1807.8H95860825L70330K25296j02768O16456K700729l171997l503266K165757N78918
$$ 895860825 896231155 896456451 896353683 896970139 899670868 896498871 892995605 895161362 895740280
1812.1H95740280R00498l73993j728897J922760J863098Q18634J972198q83560k322540
$$ 895740280 896640778 896266785 894537888 896460648 898323746 899142380 901114578 900231018 897908478
1816.5H97908478p99866P57141r45511j71890J292801M05731O95419j474304k20413
$$ 897908478 897108612 897865753 896920242 896748352 898041153 898446884 899142303 897667999 897447586
1820.8H97447586L59726J362381O79321q73489O83212Q08640N71136K21253n561524
$$ 897447586 897807312 899169693 899849014 898975525 899658737 900467377 901038513 901259766 895698242
1825.2H95698242m867782L530731J094589k84653L343048L439103J951522r8953k789459
$$ 895698242 890830460 894361191 895455780 895171127 898514175 901953278 903904800 903805847 901016388
1829.5I01016388o648254j406785J837769J585083M77295k42691J833038J280289K331390
$$ 901016388 894368134 892961349 894799118 896384201 896861496 896618805 898451843 899732132 902063522
1833.8I02063522q06274k023697j77536n34439J216049l7689l283691r39332K689896
$$ 902063522 901257248 899233551 899056015 898521576 899737625 899699936 896416245 895476913 898166809
1838.2H98166809J440048o98700k67868o60324K94876L602448J095810r66797R21860
$$ 898166809 899606857 898908157 898640289 897979965 898274841 901877289 902973099 902006302 902928162
1842.5I02928162P51266M19388k290726j1604919J445465O505203Q33588J827774J947174
$$ 902928162 903679428 904098816 901808090 890203171 891648636 898153839 898987427 900815201 902762375
1846.9I02762375k731247k302857k53677P8735N71671J89438n15137M55551l15170
$$ 902762375 900031128 897728271 897474594 897553329 898125000 898314438 897799301 898254852 897939682
1851.2H97939682r13467j124115j455384Q53424K094727N12009j41068p76214R36431
$$ 897939682 897026215 895902100 894446716 895300140 897394867 897906876 897765808 896989594 897926025
1855.5H97926025M50974j708908q05664J211700O28128l04031o36368m25339J631394
$$ 897926025 898376999 896668091 895862427 897074127 897702255 897398224 896761856 896336517 897967911
1859.9H97967911P91549o95114p37762o72760k02255L99627M43650j443482P88040
$$ 897967911 898759460 898064346 897326584 896653824 896451569 896851196 897294846 895851364 896639404
1864.2H96639404Q6289j073761K82821M047089L903351k253189l107071l80325R86251
$$ 896639404 896725693 895651932 895934753 899981842 903885193 901632004 898524933 898144608 899130859
1868.6H99130859j117096n594101j45797L388824K37045M25416j06507j4419m07181
$$ 899130859 898013763 892419662 892273865 895662689 895899734 896325150 896218643 896204224 895797043
1872.9H95797043j960602j269226J635132L120041J93786p85522J11770j88293k94571
$$ 895797043 893836441 892567215 894202347 897322388 897516174 896730652 896842422 896654129 896359558
1877.2H96359558n63736Q95996J635590M90036j140671j170425n875j92871p15408
$$ 896359558 895795822 896691818 898327408 898817444 897676773 896506348 896500473 896307602 895592194
1881.6H95592194Q34274J682129j50681N6229m02832j764145o75049N96314J378860
$$ 895592194 896426468 898108597 897957916 898014145 897611313 895847168 895172119 895768433 897147293
1885.9H97147293M22363o19812Q77838J53p65304K61535j67236n92346M27703L73078
$$ 897147293 897569656 896949844 897827682 897827835 897062531 897324066 897156830 896564484 896992187 897365265
1890.7H97365265M23660j287079j173782J736603K255401K80609J891327j312484k558518
$$ 897365265 897788925 896501846 895328064 897064667 899320068 899600677 901492004 900179520 897621002
1895.1H97621002L50800q90045k79999J600265j35345j470719K13547P52564k48795
$$ 897621002 897971802 897081757 896801758 898402023 898266678 896795959 897009506 897762070 897513275
1899.4H97513275j619797l70102Q44880J149444m32281j990815J008378J171569p52792
$$ 897513275 895893478 895523376 896368256 897517700 897085419 895094604 896102982 897274551 896521759
1903.8H96521759J083603J193542r92508J56632p26547j118698J267089L53623j476135
$$ 896521759 897605362 898798904 897806396 897963028 897236481 896117783 897384872 897738495 896262360
1908.1H96262360L36303J6251n86090j768799Q64410J632767p14722l17993J429825
$$ 896262360 896598663 896614914 896028824 894260025 895124435 896757202 896042480 895724487 897154312
1912.4H97154312M11377j764221j76239J762237J467591N70450l40577j669616M94537
$$ 897154312 897565689 895801468 895625229 897387466 898855057 899425507 899084930 897415314 897909851
1916.8H97909851L456726j068878l636169J052093L10669j635971J71356J57013O08139
$$ 897909851 901366577 900297699 896661530 897713623 898024292 896388321 896559677 896716690 897324829
1921.1H97324829O60553K69089K068405k145615k938308J232605J773758j987915j918793
$$ 897324829 897985382 898254471 900322876 898177261 895238953 896471558 898245316 896257401 894338608
1925.5H94338608m55170M8905K62527J591263O58645p20901J413879N69458j224517
$$ 894338608 893883438 893932343 894194870 895786133 896444778 895723877 897137756 897707214 896482697
1929.8H96482697j171265o88324k88696k57950R08890N58624Q67843l44162j892623
$$ 896482697 895311432 894623108 894334412 894076462 894985352 895543976 896411819 896067657 894175034
1934.1H94175034j918259L31268l967J627808l0976m65088J425858j3046j803055P55920
$$ 894175034 892256775 892588043 892584076 894211884 894180908 893715820 895141678 895128632 893325577 894081497
1939H94081497J081391l31498Q85315J154175j180496J058350J32598m303512Q86383
$$ 894081497 895162888 894831390 895716705 896870880 895690384 896748734 896881332 892577820 893464203
1943.3H93464203K586517J032334o409l332062k321167N32150N25055J098252N34362
$$ 893464203 896050720 897083054 897076645 893744583 891423416 891955566 892480621 893578873 894113235
1947.6H94113235m64782l35236P92313K1438r4375n02777r26438j597748Q77991K566223
$$ 894113235 893648453 893313217 894105530 894126968 894032593 893529816 892603378 891005630 891883621 894449844
1952.5H94449844K155381q8654j406097j548462j088715K51770J603699J179733j884003
$$ 894449844 896605225 896516571 895110474 893562012 892473297 892725067 894328766 895508499 893624496
1956.8H93624496j59759Q16727r17511p02668j029052J669311K359543k00195k398835
$$ 893624496 893464737 894281464 893363953 892661285 891632233 893301544 895661087 895460892 893062057
1961.1H93062057J003571K269287Q41446k323227k098007K74506J756286J062775J106262
$$ 893062057 894065628 896334915 897176361 894853134 892755127 893029633 894785919 895848694 896954956
1965.5H96954956P06177k659226k373199o69785Q87452J795654k58026M7226m13514
$$ 896954956 897661133 895001907 892628708 891958923 892846375 894642029 894384003 894431229 894017715
1969.8H94017715o5841J815872J491928K26059k53983l225555J2207J926422N62210
$$ 894017715 893951874 895767746 897259674 897485733 897231750 894006195 894018402 895944824 896507034
1974.2H96507034P93991j716766j377106r71832Q56705R68857r46274P30057J056518
$$ 896507034 897301025 895584259 894207153 893235321 894092026 895060883 894114609 894844666 895901184
1978.5H95901184j711883r81217J161194K486114O33011j864242k109452j234664n41764
$$ 895901184 894189301 893208084 894369278 896855392 897488403 895624161 893514709 892280045 891738281
1982.8H91738281J02463J644135J635742r73511q1100o33469K81830J837921q42819
$$ 891738281 891840744 893484879 895120621 894147110 894066010 893432541 893714371 895552292 894709473
1987.2H94709473j706620k263946r31854K777710J868286q0033r25674J703415Q76236
$$ 894709473 893002853 890738907 889807053 892584763 894453049 894373016 893447342 895150757 896026993
1991.5H96026993k510681k576676j093216K985764K624435Q8196j218338k84195J085434
$$ 896026993 893516312 890939636 889846420 892832184 895456619 895544815 894326477 894042282 895127716
1995.9H95127716m89349r48868Q57849J317139j232224k809067M22135J377487l10135
$$ 895127716 894638367 893689499 894547348 895864487 894632263 891823196 892245331 893622818 893312683
2000.2H93312683j472397R27201K65350L46985j454010j022415L63311J026001l77426
$$ 893312683 891840286 892767487 893032837 893379822 891925812 890903397 891266708 892292709 891915283
2004.5H91915283m40445R50470J132508J063003j602096J136627O96335k188950p50504
$$ 891915283 891474838 892425308 893557816 894620819 893018723 894155350 894851685 892662735 891912231
2008.9H91912231L202210J219711l40881m0894j740570r43527J332016N60913j337128
$$ 891912231 895114441 896334152 895993271 895952377 894211807 893268280 894600296 895161209 893824081
2013.2H93824081p78350n44358L50037k11716N08728J972733p23877j558304N64041
$$ 893824081 893045731 892501373 892851410 892639694 893148422 895121155 894397278 892838974 893403015
2017.6H93403015R73511q22144r50622J38550l28293m76990N53818j353302o46057
$$ 893403015 894376526 893554382 892603760 892742310 892414017 891937027 892490845 891137543 890491486
2021.9H90491486J810226Q93021L00598N1117n21088j315155r46350J353760J234359
$$ 890491486 892301712 893194733 893495331 893546448 893025360 891710205 890763855 892117615 893351974
2026.2H93351974J299363J921539j164780k485962j333999J372757J13144k172776
$$ 893351974 894651337 896572876 895408096 892922134 891588135 892960892 893074036 890901260
2030.1H90901260j144638J266556K918930J166763P26777j512452r11483L04794M47006
$$ 890901260 889756622 891023178 893942108 895108871 895835648 894323196 893411713 893716507 894163513
2034.4H94163513O22406O95420k780152j176834R4681N56640M88892j74332q54492
$$ 894163513 894785919 895481339 892701187 891524353 891619034 892175674 892664566 892490234 891635742
2038.8H91635742P06406K173614j622085k134247J023407j316757j573181J246795
$$ 891635742 892342148 894515762 892893677 890759430 891782837 890466080 888892899 890139694
2042.6H90139694R39179K225036k9525k038117q99963J307602K021637o791K12098
$$ 890139694 891078873 893303909 893274384 891236267 890336304 891643906 893665543 893658752 893870850
2047H93870850J752624N722k650223k92816N44205M75235j092758K20108P30667J92261
$$ 893870850 895623474 895629196 892978973 892686157 893230362 893705597 892612839 892832947 893563614 893755875
2051.8H93755875J915588j401138k186508j174546j479187j70212K214737L031464
$$ 893755875 895671463 894270325 892083817 890909271 889430084 889259872 891474609 894506073
2055.7H94506073O43845k488709l093033M43116J181411J580658J691971j56860k179032
$$ 894506073 895149918 892661209 889568176 890011292 891192703 892773361 894465332 894308472 892129440
2060H92129440j712341j12915J936645k94952n68771J888046M3945k731476O02036
$$ 892129440 890417099 890304184 892240829 891945877 891377106 893265152 893309097 890577621 891179657
2064.3H91179657J030350L60412Q51746r46350j745300l52707j410065O87866R41773
$$ 891179657 892210007 892570419 893422165 892475815 890730515 890377808 888967743 889655609 890597382
2068.7H90597382J407775Q37632j721955N53742O81534j155777q82492P67593K184753
$$ 890597382 892005157 892842789 891120834 891674576 892356110 891200333 890317841 891085434 893270187
2073H93270187J042633K79999j368103p75604l85208k06757o37436J488648K19192
$$ 893270187 894312820 894592819 893224716 892449112 892063904 891857147 891219711 892708359 892927551
2077.4H92927551m506378j055450K983169P15103p46917L261337K73056j610565j194229
$$ 892927551 888421173 887365723 890348892 891063995 890317078 893578415 893851471 892240906 891046677
2081.7H91046677L36227L1662o20804k70233j191177O68411J854935R38339k620392
$$ 891046677 891382904 891414566 890793762 890523529 889332352 890000763 891855698 892794037 890173645
2086H90173645R52377K258377j653900J181946q36334j158600L92380q33206P60192
$$ 890173645 891126022 893384399 891730499 892912445 892076111 890917511 891309891 890476685 891236877
2090.4H91236877L660126o08139j026459j211929q56094J774292L46451q89664k468338
$$ 891236877 894897003 894288864 893262405 892050476 891194382 892968674 893315125 892425461 889957123
2094.7H89957123k534714m55627N07736J838989J968079L12118J16348r06219n66406
$$ 889957123 887422409 886966782 887474518 889313507 891281586 891593704 891710052 890803833 890237427
2099.1H90237427K47192m48913P60498N00412J434860o790k118912n1041J153717j30310
$$ 890237427 890484619 890035706 890796204 891296616 892731476 892724686 890605774 890554733 891708450 891578140
2103.9H91578140k53677L58734J670761J20087k13547j953735j539688K031860J441498
$$ 891578140 891324463 891683197 893353958 893474045 893260498 891306763 889767075 891798935 893240433
2108.2H93240433N38940m00162L00141k182770j365738L25546l28064n67398K194596
$$ 893240433 893779373 893379211 893679352 891496582 890130844 890456390 890128326 889560928 891755524
2112.6H91755524J885986j882248J141968K296905j375885j705322L43018K52227O69632
$$ 891755524 893641510 891759262 892901230 895198135 893822250 892116928 892459946 892712173 893381805
2116.9H93381805k247085O14624J535492o09741J027374O01425J033173l235779j177368
$$ 893381805 891134720 891749344 893284836 892675095 893702469 894303894 895337067 892101288 890923920
2121.2H90923920P41272k09275r71298q54721o16302K40936M95376J269150K79999
$$ 890923920 891665192 891455917 890484619 889629898 889013596 889254532 889749908 891019058 891299057
2125.6H91299057j399002j150665k09198N25207Q39844Q64792N51452J15738j669922
$$ 891299057 889900055 888749390 888540192 889065399 889905243 890770035 891321487 891437225 889767303
2129.9H89767303l00674K845764K26364j522293j653366j968765m89426J312638J108093
$$ 889767303 889466629 892312393 892538757 891016464 889363098 887394333 886904907 888217545 889325638
2134.3H89325638L46069M50974L45077j768951P4463J294479M23660j238098k63290
$$ 889325638 889671707 890122681 890467758 888698807 888773270 890067749 890491409 889253311 888990021
2138.6H88990021J280670j533890n05447q76236K892608J407929j226120P88803m16641
$$ 888990021 890270691 888736801 888231354 887355118 890247726 891655655 890429535 891218338 890801697
2142.9H90801697k193604J725998K203064j734466j671296N51606J235733J296844
$$ 890801697 888608093 890334091 892537155 890802689 889131393 889682999 890918732 892215576
2146.8H92215576M44946k093887P81250N87006o73676R08051k23236k628022k072753
$$ 892215576 892660522 890566635 891347885 891934891 891261215 892169266 891946030 889318008 887245255
2151.1H87245255k17972L069305K046738k170944j277848J097946K2278j761169M28467
$$ 887245255 887027283 890096588 892143326 889972382 888694534 889792480 889814758 888053589 888482056
2155.5H88482056R42688j782685m83322K245178K83280l36533O7826j887589K5559
$$ 888482056 889424744 887642059 887158737 889403915 889687195 889350662 889418488 887530899 887556458
2159.8H87556458K629623N34515j674270o76880K420959O0349j294937j320725R14612
$$ 887556458 890186081 890720596 889046326 888369446 890790405 890850754 889555817 888235092 889149704
2164.1H89149704J070938N92575M5319k004471j20544J754913j770630P77283L004074
$$ 889149704 890220642 890813217 890858536 888854065 888733521 890488434 888717804 889495087 892499161
2168.5H92499161k326432j233596O80084J30539P25479Q35953J351700j417389n51072
$$ 892499161 890172729 888939133 889619217 889749756 890475235 891311188 892662888 891245499 890694427
2172.8H90694427j029281j221466k53144q32061J316833O714Q0795N59922J45568r70230
$$ 890694427 889665146 888443680 888190536 887358475 888675308 888682022 888762817 889322739 889468307 888498077
2177.7H88498077p93228J318512J322174j952667O8665J797638K25067j110535J817627
$$ 888498077 887704849 889023361 890345535 888392868 888461533 890259171 890484238 889373703 891191330
2182H91191330K319336j851959j912003n60150o30722J470108K464676M63562p59888
$$ 891191330 893510666 891658707 889746704 889186554 888555832 890025940 892490616 892954178 892194290
2186.3H92194290k144546j174469P56683J293945j957931j042710J849137m19998r26743
$$ 892194290 890049744 888875275 889631958 890925903 888967972 887925262 889774399 889354401 888427658
2190.7H88427658L39737Q04977k64282q03146J78985J696930m28390j577377P24105
$$ 888427658 888767395 889572372 889308090 888504944 888683929 890380859 889952469 888375092 889099197
2195H89099197R00650q15124j214447l22952J020126Q71506r90219j360856K251359
$$ 889099197 889999847 889184723 887970276 887647324 888667450 889538956 888548737 887187881 889439240
2199.4H89439240J708221l96042o67496p74383o34690L04642l405380l49350K269821
$$ 889439240 891147461 890751419 890083923 889309540 888674850 888979492 885574112 885224762 887494583
2203.7H87494583J53885r17358O73217J507950R1782l43323N09415N92651n54581q57086
$$ 887494583 887648468 886731110 887404327 888912277 889004059 888660736 889170151 889762802 889208221 888351135
2208.5H88351135j251907k45590O61697J738892N89218j416321n72128M4174j014023
$$ 888351135 887099228 886853638 887515335 889254227 889843445 888427124 887854996 887899170 886885147
2212.9H86885147R06677M68216k00348J731034j954880k316055J847000R16900M29154
$$ 886885147 887791824 888260040 888059692 889790726 887835846 885519791 887366791 888283691 888712845
2217.2H88712845j099548j103211L137360N21774j648102j179809Q4457Q6670J270142
$$ 888712845 887613297 886510086 889647446 890169220 888521118 887341309 887425766 887512436 888782578
2221.5H88782578O10961P5455L17841n41916o40793J20697q35495m04663J325607k38266
$$ 888782578 889393539 889468994 889786835 889244919 888604126 888724823 887889328 887484665 888810272 888572006
2226.4H88572006r85031J297836Q54874L24097j157608j118927J240005j104889n85785
$$ 888572006 887586975 888884811 889739685 890063782 888906174 887787247 889027252 887922363 887336578
2230.7H87336578O69251j450424N31845P11059q5144K5864K18658j56707j42594j648865
$$ 887336578 888005829 886555405 887087250 887798309 887713165 887739029 887957687 887800980 887658386 886009521
2235.5H86009521m95376J840820M66538j028061j826630k06299J513520J990203J484375
$$ 886009521 885514145 887354965 887821503 886793442 884966812 884760513 886274033 888264236 889748611
2239.9H89748611j041564o59562L36686j412888l788452o49491L809357J318665m85993
$$ 889748611 888707047 888047485 888384171 886971283 883182831 882533340 886342697 887661362 887175369
2244.2H87175369l92990m26025O31485J042022j745224o30569J353073K708130p16400
$$ 887175369 886782379 886356354 886987839 888029861 886284637 885654068 887007141 889715271 888998871
2248.5H88998871l465195J283341O54754p99103k44140L96957J319885J19629j667709
$$ 888998871 885533676 886817017 887471771 886672668 886428528 886825485 888145370 888264999 886597290
2252.9H86597290j470108K70767J71509L43323K312927J899719k847213k608796K579270
$$ 886597290 885127182 885397949 885569458 885912781 888225708 890125427 887278214 884669418 887248688
2257.2H87248688m9515l1967K344818p23648p59583j011047m99878Q32596l49198L88108
$$ 887248688 887199173 887167206 889512024 888788376 888028793 887017746 886517868 887350464 887001266 887389374
2262H87389374R66415P75833J036072j020813K877350J376953l638534k289887K76718
$$ 887389374 888355789 889131622 890167694 889146881 892024231 893401184 889762650 887472763 887749481
2266.4H87749481K100144J158218j704254q48999J076126J170959q79898q40225j161804
$$ 887749481 889849625 891007843 889303589 888454590 889530716 890701675 889821777 888981552 887819748
2270.7H87819748j930008K214355K917099L45002j447449p83157j271973j032181K204666
$$ 887819748 885889740 888104095 891021194 891366196 889918747 889135590 887863617 886831436 889036102
2275.1H89036102K356644j400833l421707N7678K894287m68292j023102j162491j60522
$$ 889036102 891392746 889991913 886570206 886627884 889522171 889053879 888030777 886868286 886707764
2279.4H86707764J238174K51389L54919q09860m21982J64261J061630J045838k755509
$$ 886707764 887945938 888197327 888552246 887742386 887320404 887484665 888546295 889592133 886836624
2283.7H86836624m07638J316833j280517J592788J293259j739121k75726O09284L00445
$$ 886836624 886428986 887745819 886465302 888058090 889351349 887612228 887336502 887945786 888246231
2288.1H88246231J123657J243210j229324j394882P96585J268005J79367k00729J6479
$$ 888246231 889369888 890613098 889383774 887988892 888785477 890053482 890232849 890032120 890048599
2292.4H90048599R80683n65796j165390K061615j38626m48151L077850j849518O06232
$$ 890048599 891029282 890463486 889298096 891359711 891221085 890772934 893850784 892001266 892607498
2296.8H92607498K084809r61838K005386j234817k111283L221894K102661P66372j739883
$$ 892607498 894692307 893730469 895735855 894501038 892389755 895611649 897714310 898480682 896740799
2301.1H96740799j915283J904983J979599r40551l478699K040252K342148j007690
$$ 896740799 894825516 896730499 898710098 897769547 894290848 896331100 898673248 897665558
2305H97665558l718872K719497N656434L249588k051011k411575K369080N085754j418381
$$ 897665558 893946686 896666183 902322617 905572205 903521194 901109619 903478699 908564453 907146072
2309.3I07146072m908981K460938N797653P54471m268418j444778N747680N112381
$$ 907146072 902237091 904698029 910495682 911250153 906981735 905536957 911284637 916397018
2313.2I16397018m746780m120178K850723J940994k834472o83670M146042N622634
$$ 916397018 911650238 907530060 910380783 912321777 909487305 908803635 912949677 918572311
2317I18572311p43408n301742L727951O494217J257553o876068K096557J2221909m811478
$$ 918572311 917828903 912527161 916255112 922749329 924006882 917130814 919227371 931449280 926637802
2321.3I26637802j1872940P192383J1430893m705200j0358735M036561J2624816l044891
$$ 926637802 914764862 921957245 933388138 928682938 918324203 922360764 934985580 931940689
2325.2I31940689r736786N483628Q750381l267975o592941M822616M445115q185196
$$ 931940689 922203903 927687531 936437912 933169937 926576996 931399612 935844727 927659531
2329.1I27659531r14383N747909P528916k091370j992874L703384O74362o965332K746659
$$ 927659531 926745148 932493057 940021973 937930603 935937729 939641113 940315475 933350143 936096802
2333.4I36096802J1709366K225647j5410309J249084Q770676p859802j606522P619629
$$ 936096802 947806168 950031815 934621506 935870590 944641266 936781464 935174942 942794571
2337.3I42794571l254166m176025N475464K424469n354386k701568J527786J025543
$$ 942794571 939540405 935364380 940839844 943264313 937909927 935208359 936736145 937761688
2341.1I37761688k722244N012054N253830n751571l892823K365113r08890n300369
$$ 937761688 935039444 940051498 945305328 939553757 935660934 938026047 937117157 931816788
2345I31816788N780410L424912j0072021o665192M98581o690293q753509L512268P075882
$$ 931816788 937597198 941022110 930950089 924284897 924783478 918093185 909339676 912851944 919927826
2349.3I19927826R505691M885025j727294M288787j470413R28726J3741913K202912
$$ 919927826 929433517 934318542 932591248 936880035 935409622 936338348 950080261 952283173
2353.2I52283173q037110P645264K322235j2826004R739456J1300049q932114p75299
$$ 952283173 944246063 951891327 954213562 941387558 951127014 962427063 953494949 952719650
2357I52719650J449890r22622Q093185j98974n981827O182480J716232n041657L690873
$$ 952719650 954169540 953246918 961340103 961141129 955159302 961341782 963058014 958016357 961707230
2361.4I61707230M560852Q487243j0618133k2319947P646409P761764n299301K771530
$$ 961707230 966268082 974755325 964137192 941817245 949463654 957225418 951926117 954697647
2365.2I54697647n296860R10340K989959n479888o50330K568359o263809K927322o75582
$$ 954697647 949400787 950311127 953301086 947821198 947170868 949739227 943475418 946402740 945727158
2369.6I45727158m288636q633728n338058L98178j614304n58777n554962n323562J08337
$$ 945727158 941438522 932804794 927466736 927864914 926250610 925691833 920136871 914813309 914921646
2373.9I14921646k112198j340179l261566L767013j784057k818985m263001l052139
$$ 914921646 912809448 911469269 908207703 911974716 910190659 907371674 903108673 900056534
2377.8I00056534j164093K82440K123566k759095m43115r72900m594574k639694R95025
$$ 900056534 898892441 899174881 901298447 898539352 898096237 897123337 892528763 889889069 890884094
2382.1H90884094L94364k101517j921082m20608n68314m2572j09405j16883j624908
$$ 890884094 891278458 889176941 887255859 886835251 886266937 886224365 886114960 885998077 884373169
2386.4H84373169j5106J309051j20239K478943K506409k596131k532882Q00094j130447
$$ 884373169 884358063 885667114 885546875 888025818 890532227 887936096 885403214 886203308 885072861
2390.8H85072861k391129L25241M66843J070328Q61663j607437J010666P14264r95331
$$ 885072861 882681732 883006973 883473816 884544144 885405807 883798370 884809036 885523300 884527969
2395.1H84527969m74701K183991n31311j402359n89295q1863j388092j498947L82309
$$ 884527969 884053268 886237259 885705948 884303589 883714294 883632431 882244339 880745392 881127701
2399.5H81127701K136764Q46711k83738q82034m39529K228317P90024j926880j315918
$$ 881127701 883264465 884111176 883827438 882945404 882505875 884734192 885524216 883597336 882281418
2403.8H82281418P87735J173019j653900K33765J369629l43781Q52814K238235j565551
$$ 882281418 883069153 884242172 882588272 882822037 884191666 883847885 884700699 886938934 885373383
2408.1H85373383k777176o40030J137008n74264J177215l51943l382264R40934K054595
$$ 885373383 882596207 881956177 883093185 882518921 883696136 883344193 879961929 880902863 882957458
2412.5H82957458K072831K98538l22113R94186J4496k258530j731338O93512M87060
$$ 882957458 885030289 885328827 885006714 886000900 886015396 883756866 882025528 882719040 883206100
2416.8H83206100R87244j121750j125641J456375L790970j291046k454681l94516n86777
$$ 883206100 884193344 883071594 881945953 883402328 887193298 885902252 883447571 883053055 882466278
2421.2H82466278j847153J015168K261352P77588n86624j99280j188888m04664M43039
$$ 882466278 880619125 881634293 883895645 884673233 884086609 883887329 882698441 882293777 882736816
2425.5H82736816J149216L03803j337662o03943j557236K514496K702103J11847R04922
$$ 882736816 883886032 884189835 882852173 882248230 880690994 883205490 885907593 886019440 886924362
2429.8H86924362k252884p39212K074814k177429j514893J112747j020965o34689K394867
$$ 886924362 884671478 883932266 886007080 883829651 882314758 883427505 882406540 881771851 884166718
2434.2H84166718l50113k203827K845688k9374j658172Q09250J782837j344376j666183
$$ 884166718 883816605 881612778 884458466 884429092 882770920 883580170 885363007 884018631 882352448
2438.5H82352448R78775J415100j205292J209640J758423j993255k676850p63702P37839
$$ 882352448 883331223 884746323 883541031 884750671 886509094 884515839 881838989 881075287 881813126
2442.9H81813126J979065R6206o68182p91092P51724N90592K77633k482605k036361
$$ 881813126 883792191 883888397 883220215 882429123 883180847 883771439 884049072 881566467 879530106
2447.2H79530106J356277J231232M02832j191559j605759J053009Q36487K67716q93784
$$ 879530106 880886383 882117615 882520447 881328888 879723129 880776138 881612625 881880341 880986557
2451.5H80986557j59454O51626n55954r94491J785888l85208j345901J11007J381302
$$ 880986557 880827103 881478729 880922775 879928284 881714172 881328964 879983063 880094070 881475372
2455.9H81475372L418579N13535p38983l57895M68292R87473j796341j247101O45752
$$ 881475372 884893951 885407486 884668503 884310608 884778900 885766373 883970032 882722931 883368683
2460.2H83368683j215744k49939L99856l81622M4327K42691q39310j265259r54818
$$ 883368683 882152939 881903000 882302856 881921234 881965561 882208252 881368942 880103683 879148865
2464.6H79148865J908798k74582j397476J010971K089767j566391l19519O11115J152344
$$ 879148865 881057663 880783081 879385605 880396576 882486343 880919952 880600433 881211548 882363892
2468.9H82363892J097793j460495n86395K70309L37906p43789p07093p06253J581116
$$ 882363892 883461685 882001190 881414795 881685104 882023010 881279221 880572128 879865875 881446991
2473.2H81446991M64783j010132k820892M43344L067627J293640k479859k828445J509323
$$ 881446991 881911774 880901642 878080750 878524094 881591721 882885361 880405502 877577057 879086380
2477.6H79086380o78253j672516K232666K945251j33132j114045N6382l61023J245269
$$ 879086380 878408127 876735611 878968277 881913528 881780396 880666351 880722733 880361710 881606979
2481.9H81606979K39258j510086K48566r2774j174240J148911J006698j773071K4338
$$ 881606979 881846237 880336151 880584717 880491943 879317703 880466614 881473312 879700241 879724579
2486.3H79724579j609497n56183K712860Q23059j282883j501693Q85772J165314P14111
$$ 879724579 878115082 877558899 880271759 881094818 879811935 878310242 879196014 880361328 881075439
2490.6H81075439J449128j380692q21228K840958O91223k79236O06232k086258j619797
$$ 881075439 882524567 881143875 880322647 883163605 883854828 883575592 884181824 882095566 880475769
2494.9H80475769K231293L75213l50113j76162M29992K932663K20566l037643R12170
$$ 880475769 882707062 883082275 882732162 882556000 882985992 885918655 886139221 883101578 884013748
2499.3H84013748k75116r77707k097473N58167K11868j27640N66788k81601o47507
$$ 884013748 883738632 882760925 880663452 881221619 881433487 881305847 881872635 881591034 880943527
2503.6H80943527O49567M28161j749343J10550M09317Q1710K331391j072388o03409
$$ 880943527 881593094 882021255 880271912 880382462 880791779 880873489 883204880 882132492 881529083
2508H81529083K50397J430664Q6517n84716o25916J443787%J76925l50036j30539p82700
$$ 881529083 881779480 883210144 883296661 882711945 882086029 883529816 883529816 883706741 883356705 883226166 882443466
2513.3H82443466j644363j51062J049499J850968J377487j627274j287765Q61053J5335
$$ 882443466 880799103 880648041 881697540 883548508 884925995 883298721 882010956 882872009 882887344
2517.6H82887344j04446N19104j478195q49304k003479j578141J351624o47965k131118
$$ 882887344 882782898 883302002 881823807 880974503 878971024 877392883 878744507 878096542 875965424
2521.9H75965424J4343L362045N15900M88739Q54645j926957M89426K93121k009277
$$ 875965424 875979767 879341812 879857712 880346451 881201096 879274139 879763565 880056686 878047409
2526.3H78047409M41666K82058J642304J767959o34689l032150j564331K480087m21142
$$ 878047409 878489075 878771133 880413437 882181396 881546707 878514557 876950226 879430313 879009171
2530.6H79009171k25144J563187K638626j473313j812667O28738p88803O29654J433487
$$ 879009171 878784027 880347214 882985840 881512527 879699860 880328598 879539795 880169449 881602936
2535H81602936l42713L12348O76575k049408k253418J241607J144943J137543L66059
$$ 881602936 881260223 881572571 882249146 880199738 877946320 879187927 880332870 881470413 881836472
2539.3H81836472L37448J8158j85089j55564j654129o22330L18604K46124j69906M12445
$$ 881836472 882173920 882192078 882006989 881851425 880197296 879574966 879893570 880139694 879969788 880382233
2544.1H80382233J081161r33761J466522Q91342j138001r16214j112213O82679q36945
$$ 880382233 881463394 880529633 881996155 882887497 881749496 880833282 879721069 880403748 879566803
2548.5H79566803j009522K141114K370376j387252j965714L269959l75748m182663
$$ 879566803 878557281 880698395 883068771 881681519 879715805 882985764 882610016 878427353
2552.3H78427353r03092J239396m89350k079925n13230M67377J154327J498185K279815
$$ 878427353 877524261 878763657 878274307 876194382 875681152 876148529 877302856 878801041 881080856
2556.7H81080856J602021j052399k718201l110885r42994L884354K019119k408294
$$ 881080856 882682877 881630478 878912277 875801392 874858398 878742752 880761871 878353577
2560.5H78353577j125183P41653n15823O27288O28586k047577j332016k68783J837692
$$ 878353577 877228394 877970047 877454224 878081512 878710098 876662521 875330505 875061722 876899414
2564.9H76899414J665115q48159j667176J050034K155075j943436P3929O70319j441040
$$ 876899414 878564529 877716370 876049194 877099228 879254303 877310867 877384796 878055115 876614075
2569.2H76614075P99331J955719K64511l97338K82669m48532j770096k02332N64499
$$ 876614075 877413406 879369125 879633636 879236298 879518967 879070435 877300339 877098007 877662506
2573.5H77662506J070557J815109O86493j130371k226868R53903K119065k47727j649093
$$ 877662506 878733063 880548172 881234665 880104294 877877426 878831329 880950394 880702667 879053574
2577.9H79053574J389541Q08411m214859p18537K573319J053543j011887n53131Q77457
$$ 879053574 880443115 881251526 877036667 876318130 878891449 879944992 878933105 878379974 879257431
2582.2H79257431J059647k83127m5624J753082r72595k496719J284408j628723j180954
$$ 879257431 880317078 880033951 879988327 881741409 880768814 878272095 879556503 877927780 876746826
2586.6H76746826J18408J469727M50058k306595J980743M536667N25208j058655k909851
$$ 876746826 876865234 878334961 878785019 876478424 878459167 882995834 883521042 882462387 879552536
2590.9H79552536k977219j613693r21860n0811K111053J689530R61990N43365r66949
$$ 879552536 876575317 874961624 874039764 873988953 876100006 877789536 878751526 879294891 878327942
2595.2H78327942J026611J077957n99136j149521j047516j26190j238708n16892j266174
$$ 878327942 879354553 880432510 879833374 878683853 877636337 877510147 876271439 875754547 874488373
2599.6H74488373O24542K322617P06329k98233l278198j281433K42843p27005P07779
$$ 874488373 875112915 877435532 878141861 877843628 874565430 873283997 873526840 872799835 873507614
2603.9H73507614O15692M239655J205902k470627q92334J007462N15060j549759k109756
$$ 873507614 874123306 878362961 879568863 877098236 876205902 877213364 877728424 876178665 874068909
2608.3H74068909J04675J227036m27628l34930q98972j348343k8610K144165P83386
$$ 874068909 874173584 875400620 874972992 874638062 873739090 872390747 872362137 874506302 875289688
2612.6H75289688k022171P12814L35770l371658k201767J732864L534241J648331N5542
$$ 875289688 873267517 873980331 874316101 870944443 868742676 870475540 874009781 875658112 875713654
2616.9H75713654Q04367j987076j569138J618424K621917M29154k043991j770325J013870
$$ 875713654 876518021 874530945 872961807 874580231 877202148 877631302 875587311 873816986 874830856
2621.3H74830856K467804J343613R0866n22766J379394j495819k347259m28848J815948
$$ 874830856 877298660 878642273 878733139 878210373 879589767 878093948 875746689 875317841 877133789
2625.6H77133789j096268k128448K138519K198486L18833j465073k97012K509766j185608
$$ 877133789 876037521 873909073 876047592 878246078 878564911 877099838 876802826 879312592 878126984
2630H78126984l469162j232148K256318K300643l85131j002198P05643J499100O26144
$$ 878126984 874657822 873425674 875681992 877982635 877597504 876595306 877300949 878800049 879426193
2634.3H79426193k091675O30646J684723q62961k424240K22397K213745l12805j728973
$$ 879426193 877334518 877965164 879649887 878786926 876362686 876585083 878798828 878486023 876757050
2638.6H76757050m18168j26113P858m72946M88739J667709O03790j17263j867981k518387
$$ 876757050 876338882 876212769 876220627 875747681 876236420 877904129 878507919 878390656 876522675 874004288
2643.5H74004288J781387K230301K67181n18646k441482N04608K982254j228638j368179
$$ 874004288 875785675 878015976 878283157 877764511 875323029 875827637 878809891 877581253 876213074
2647.8H76213074R689L19061l93371j148453o02036K83280r56116J18485K0370K511597
$$ 876213074 876222763 876541824 876148453 875000000 874397964 874681244 873725128 873843613 873863983 876375580
2652.6H76375580J023865j844941n22537j358490K186203K790222k7771j622543j913376
$$ 876375580 877399445 875554504 875031967 873673477 875859680 878649902 878622131 876999588 875086212
2657H75086212k158432M07639K14157l94592k065049Q00171K203446J295013r62830
$$ 875086212 872927780 873335419 873549576 873154984 871089935 871890106 874093552 875388565 874425735
2661.3H74425735J76163J70136j745072l608017j320190K095489K22779k716065k083282
$$ 874425735 874601898 874772034 873026962 869418945 868098755 870194244 870417023 867700958 865617676
2665.6H65617676J173935K626571K149659j856919j347351J858139j136932j515732
$$ 865617676 866791611 869418182 871567841 869710922 868363571 870221710 869084778 867569046
2669.5H67569046K603455K68020O29959j363372j651688L030243L2501k864380L08304
$$ 867569046 870172501 870440521 871070480 869707108 868055420 871085663 871118164 868253784 868562088
2673.8H68562088L782349K487411j035538r00344O24847j893845O19355J008300k559127
$$ 868562088 872344437 874831848 873796310 872895966 873520813 871626968 872246323 873254623 870695496
2678.2H70695496J779403J164780l266602Q81119K985153j931305j659088J847992
$$ 870695496 872474899 873639679 870373077 871254196 874239349 872308044 870648956 872496948
2682H72496948m7912L00064j713333K63443L991394N30395k231827j161041k94952
$$ 872496948 872449036 872749100 871035767 871299210 875290604 875820999 873589172 872428131 872133179
2686.4H72133179K098160J043014Q88138k12021l170013J435699J77994j074448p7209
$$ 872133179 874231339 875274353 876162491 875950470 872780457 874216156 874394150 873319702 873242493
2690.7H73242493j375656j255341Q95767J60752N62057N07507Q00400J257477j27869
$$ 873242493 871866837 870611496 871507263 871668015 872230072 872737579 873537979 874795456 874667587
2695.1H74667587j538315j489944J752319M20151N96848j221238l247528k940979K089997
$$ 874667587 873129272 871639328 873391647 873811798 874408646 873187408 869939880 866998901 869088898
2699.4H69088898L688430O31257N96847k072983j811218j4877J524276K88926j219483
$$ 869088898 872777328 873408585 874005432 871932449 870121231 870106354 871630630 871919556 870700073
2703.7H70700073Q79135L008500L93447k627792r91745J242981P34863j970978J869889
$$ 870700073 871579208 874587708 874981155 872353363 871361618 872604599 873339462 871368484 873238373
2708.1H73238373J439895k790832j073303R53903O19888m173965R27276K697068l596573
$$ 873238373 874678268 871887436 870814133 871768036 872387924 868213959 869141235 871838303 868241730
2712.4H68241730j254273O67420j67466n96466m375228Q28323K901459k127076j193542
$$ 868241730 866987457 867654877 867487411 866890945 862515717 863344040 866245499 864118423 862924881
2716.8H62924881O75354j457672p03430j070328j147461r46121j563950J096955j837388
$$ 862924881 863600235 862142563 861439133 860368805 859221344 858275223 856711273 857808228 855970840
2721.1H55970840l786315k797471j194076J8997j180725k197952m422608j84707L256607
$$ 855970840 852184525 849387054 848192978 848211975 847031250 844833298 840410690 840225983 843482590
2725.4H43482590k260971j002808J101761J543198J930236J916046J096726L402100
$$ 843482590 841221619 840218811 841320572 842863770 844794006 846710052 847806778 851208878
2729.3H51208878K187500j132584j855927L84217K379608n83572K137222L129577P39747
$$ 851208878 853396378 852263794 850407867 850792084 853171692 852588120 854725342 857854919 858594666
2733.6H58594666R91821O5002M31900O54984J277008r00269j857147P94373J784439
$$ 858594666 859586487 859651489 860083389 860738373 862015381 861115112 859257965 860052338 861836777
2738H61836777k22473j741944L70178K647782J146316k82669j072235j719894K61383
$$ 861836777 861614304 859872360 860242538 862890320 864036636 863753967 862681732 860961838 861223221
2742.3H61223221K96631k938385K392044J742859j390152Q2626J628113J529007n2033
$$ 861223221 861519852 858581467 860973511 862716370 861326218 861408844 863036957 864565964 864513931
2746.7H64513931O08902K39029Q8730K78244j596527m85306J938172k101441J5793
$$ 864513931 865122833 865361862 865450592 865728836 864132309 863647003 865585175 863483734 863499527
2751H63499527Q14438j071472J771469m81034q24050o90613J46103J697769J196670
$$ 863499527 864313965 863242493 865013962 864532928 863708878 863018265 863164368 864862137 866058807
2755.3H66058807j014175j783295R5902R39636J39771r18046j095352L854676K211608
$$ 866058807 865044632 863261337 863357239 864296875 864436646 863518600 862423248 866277924 868489532
2759.7H68489532l517684o21720J175995K63519k274704k044601L604889K163391k415848
$$ 868489532 864971848 864350128 865526123 865789642 863514938 861470337 865075226 867238617 864822769
2764H64822769n7373m0130K31552J854095J833801k352447p03736o9274k718277N97076
$$ 864822769 864765396 864725266 864956818 866810913 868644714 866292267 865588531 865519257 862800980 863398056
2768.8H63398056K396469N09415J548919j202011k199096j200028j46255K696457K943267
$$ 863398056 865794525 866303940 867852859 866650848 864451752 863251724 863105469 865801926 868745193
2773.2H68745193j448211k478867j429138M952698j119538m458923K171631R74274
$$ 868745193 867296982 864818115 863388977 868341675 867222137 862763214 864934845 865909119
2777H65909119k688523k815857J197739L669815J589661J81045j65100J91879j989822
$$ 865909119 863220596 860404739 861602478 865272293 866861954 867042999 866877899 867069778 865079956
2781.4H65079956m100418J5793R33075J059875j554489j657638j108246J030349Q62046
$$ 865079956 860979538 860995331 861928406 862988281 861433792 859776154 858667908 859698257 860560303
2785.7H60560303m84772J36414L95584Q65936K076950m22821k578964j15509r15680
$$ 860560303 860075531 860211945 860607529 861473465 863550415 863127594 860548630 860433121 859517441
2790.1H59517441j602631p50046m33960o97326o34918j638794o41022J510773K138290
$$ 859517441 857914810 857164764 856730804 856033478 855398560 853759766 853118744 854629517 856767807
2794.4H56767807m661789l058395J221847l18298j09558j263657n78384J974411k21100
$$ 856767807 852106018 849047623 850269470 849951172 849841614 848577957 847999573 849973984 849752884
2798.7H49752884l816452k394333l59802l87955k595978j266098K185974r6969m647599
$$ 849752884 845936432 843542099 843182297 842794342 840198364 838932266 841118240 841021271 836373672
2803.1H36373672m784927p89642J013946j401062k1896M97971k080994m65012J149216
$$ 836373672 831588745 830799103 831813049 830411987 830390091 830888062 828807068 828342056 829491272
2807.4H29491272q54569j015243k281494l986969k796860K99378L16391j569520j044921
$$ 829491272 828636703 827621460 825339966 821352997 818556137 818855515 819171906 817602386 816557465
2811.8H16557465J242828j361008j036987j175156l802414l584365r61609k244339
$$ 816557465 817800293 816439285 815402298 814227142 810424728 806840363 805878754 803634415
2815.6H03634415o68335N98297j062241m796066m388733o96259l690567m725646l113556
$$ 803634415 802966080 803564377 802502136 797706070 793317337 792621078 788930511 784204865 781091309
2820G81091309k291413l548431n866699n135880m352417p397308r197617k854309l704529
$$ 781091309 778799896 775251465 769384766 764248886 759896469 752499161 743301544 740447235 736742706
2824.3G36742706n416565q426971j1462860j1871033r685058r948884j0098648q926620
$$ 736742706 731326141 722899170 711436310 699565277 689880219 679931335 669832687 660906067
2828.1F60906067j1380692j0554161j0431175j2308845j0603219j0458717o679726
$$ 660906067 649525375 638971214 628540039 616231194 605627975 595169258 588489532
2831.5E88489532p244148q100281l384513k410889m776955j038398Q70513L105889
$$ 588489532 581245384 573145103 569760590 567349701 562572746 561534348 562404861 565510750
2835.4E65510750M299698J301384K848816K487869M672546L842888P48444M180755
$$ 565510750 569810448 571111832 573960648 576448517 581121063 584963951 585712395 589893150
2839.2E89893150L384438J785355L188552M827843L245773L103638M124031M544220
$$ 589893150 593277588 595062943 598251495 603079338 606325111 609428749 613552780 618097000
2843.1F18097000J104508p60117J219101O356239N173111l08227n32379M51545J402436
$$ 618097000 619201508 618441391 619660492 626016731 631189842 630881615 630349236 630800781 632203217
2847.4F32203217r5749n170288m637909l258324k136612l881607o308136p392311n497170
$$ 632203217 632107468 626937180 622299271 619040947 616904335 613022728 606714592 599322281 593825111
2851.8E93825111m166832n111427n695686m439163m322739l634415q39462K60010K67639
$$ 593825111 589658279 584546852 578851166 574412003 570089264 566454849 565615387 565875397 566143036
2856.1E66143036O20994L00904J712532K883568M969215L113709J515350K163086L158150
$$ 566143036 566764030 567064934 568777466 571661034 576630249 579743958 581259308 583422394 586580544
2860.5E86580544K542152O775665L751984J102524L421936L893852J720085l68004
$$ 586580544 589122696 595898361 599650345 600752869 604174805 608068657 609788742 609420738
2864.3F09420738m52881q6708J429711j094857j271858k080612k611771n229873n221253
$$ 609420738 608967857 608881149 610310860 609216003 607944145 605863533 603251762 598021889 592800636
2868.7E92800636l132858l307075k726288m846535m046478k081795k912598l549385
$$ 592800636 589667778 586360703 583634415 578787880 574741402 572659607 569747009 566197624
2872.5E66197624k265434k603684n502700o321373l789368k431679k690811j915283
$$ 566197624 563932190 561328506 555825806 549504433 545715065 543283386 540592575 538677292
2876.4E38677292j657524m55475P06215j620636k595711q83255L05061p15370j298179
$$ 538677292 537019768 536564293 537270508 535649872 533054161 532170906 532475967 531760597 530462418
2880.7E30462418j683274k450638j944084k903213k555771k951546l388748n697021
$$ 530462418 528779144 526328506 524384422 521481209 518925438 515973892 512585144 506888123
2884.6E06888123l882790m0779j722832l877220k982636l197288k605209k434273k181893
$$ 506888123 503005333 502964554 501241722 497364502 494381866 491184578 488579369 486145096 483963203
2888.9D83963203j890983n12543J254959k043571p49436K198754J417312j36146k221222
$$ 483963203 482072220 481559677 482814636 480771065 480021629 482220383 483637695 483501549 481280327
2893.2D81280327j17111J024055q22334j391068j851425q46252J941185J058159l954049
$$ 481280327 481163216 482187271 481364937 479973869 478122444 477276192 479217377 480275536 476321487
2897.6D76321487k009086j50070j820717l236733j228065j465683k776337n21583K997703
$$ 476321487 474312401 474162331 472341614 469104881 467876816 466411133 463634796 463113213 466110916
2901.9D66110916J806946n313416l881416n91621m26255k224998k214203j687660k536354
$$ 466110916 467917862 462604446 458723030 458131409 457705154 455480156 453265953 451578293 449041939
2906.3D49041939k360878l959084l441200j832352l584900m935302m784508o685753
$$ 449041939 446681061 442721977 439280777 437448425 433863525 428928223 424143715 417457962
2910.1D17457962m428940q7280m420624o307335m490547n409546l651008j616211l740120
$$ 417457962 413029022 412941742 408521118 402213783 397723236 392313690 388662682 387046471 383306351
2914.5C83306351n731736j445655J883964r03854m318466j871567k952614J154213
$$ 383306351 377574615 376128960 378012924 377109070 372790604 370919037 367966423 369120636
2918.3C69120636J370926j392899m02069m22020P48062J566658J634255J843033K594299
$$ 369120636 370491562 369098663 368696594 368274574 369022636 370589294 372223549 374066582 376660881
2922.7C76660881J37863p33032P98225K926484L789215K486763n04952k78740M609337
$$ 376660881 376798744 376065712 376863937 379790421 383579636 386066399 385561447 385282707 389892044
2927C89892044O873818K024688L363266M760437L451233N749779L399658Q58383K939263
$$ 389892044 396765862 398790550 402153816 406914253 410365486 416115265 419514923 420373306 423312569
2931.3D23312569M177627O999207O474075L816185M762459K717476K023544L318443
$$ 423312569 427490196 434489403 440963478 444779663 449542122 452259598 454283142 457601585
2935.2D57601585O137963R095993M547424K080727L937301L033562P755432Q469620
$$ 457601585 463739548 472835541 477382965 479463692 483400993 486434555 494189987 502659607
2939.1E02659607N436439N467492M220962L526764N647697Q405915P962951R861603
$$ 502659607 508096046 513563538 517784500 521311264 526958961 535364876 543327827 553189430
2942.9E53189430Q436852N959091M740143P223205Q267823L327293N022774Q152656
$$ 553189430 561626282 567585373 572325516 579548721 587816544 591143837 596166611 604319267
2946.8F04319267M983673M613037L329049N119400K020607J929359O231270O079483
$$ 604319267 609302940 613915977 617245026 622364426 624385033 626314392 632545662 638625145
2950.6F38625145L896217j011886j482163l128Q3542n63011m209175n05982n073127
$$ 638625145 642521362 641509476 640027313 640024185 640107727 639544716 635335541 634829559 629756432
2955F29756432n345040l200073l230400n433350q325767q157921r116325q101731p863655
$$ 629756432 624411392 621211319 617980919 612547569 604221802 596063881 586947556 578845825 570982170
2959.3E70982170r153290q860817p979431q127670j0151138r943772q326301o028176
$$ 570982170 561828880 552968063 544988632 536860962 526709824 516766052 508439751 502411575
2963.2E02411575q951759n985565k123642j796456j573371J269455L073692M515266
$$ 502411575 493459816 487474251 485350609 483554153 481980782 483250237 486323929 490839195
2967D90839195M950600M565773N716743P680359Q904648R716721J0477333J2974853
$$ 490839195 495789795 500355568 506072311 513752670 522657318 532374039 542851372 555826225
2970.9E55826225J2283058J0388833J3727836J1462670Q455314Q045235Q055725O381645
$$ 555826225 568109283 578498116 592225952 603688622 612143936 620189171 628244896 634626541
2974.7F34626541Q539353Q840560R414750O857452M408340N298996N911484N947571
$$ 634626541 643165894 652006454 661421204 668278656 672686996 677985992 683897476 689845047
2978.6F89845047M497223L544998M977646M361038L404694K756195L605804L483963
$$ 689845047 694342270 697887268 702864914 707225952 710630646 713386841 716992645 720476608
2982.5G20476608M676895N280152J010361j370926K863006K548447k51999L2577j710662
$$ 720476608 725153503 730433655 731444016 730073090 732936096 735484543 735232544 735265121 733554459
2986.8G33554459k999344K096863M320297J394272j265335L317031O916123N934143
$$ 733554459 730555115 732651978 736972275 738366547 737101212 740418243 747334366 753268509
2990.7G53268509n72739k136917L215027M615097J570664Q15200J450882K521668M399719
$$ 753268509 752695770 750558853 753773880 758388977 759959641 760774841 762225723 764747391 769147110
2995G69147110L208694J171570P82242l38821k070008P477J090088Q33588K175064
$$ 769147110 772355804 773527374 774309616 773970795 771900787 771908264 772998352 773831940 776007004
2999.3G76007004K235565m869843n298919r82361J199417j690369k299499k477265
$$ 776007004 778242569 773372726 768073807 767091446 768290863 766600494 764300995 761823730
3003.2G61823730j957473k556229n554504l657379j684037O65665j564179j889801
$$ 761823730 759866257 757310028 751755524 748098145 746414108 747079773 745515594 743625793
3007G43625793j130828j575776r44595K848663j384277k805939J149216j706390l671112
$$ 743625793 742494965 740919189 739974594 742823257 741438980 738633041 739782257 738075867 734404755
3011.4G34404755J399688L735886p41806J032867j50909J455841K741547L21273K670975
$$ 734404755 735804443 739540329 738798523 739831390 739680481 741136322 743877869 744199142 746870117
3015.7G46870117M726486N072556K992477R54514K499084K585984O662979M783478
$$ 746870117 751596603 756669159 759661636 760616150 763115234 765701218 772364197 777147675
3019.6G77147675p17850J401138O488724M559173M961243K762680K597199R48486K717743
$$ 777147675 776429825 777830963 784319687 788878860 793840103 796602783 799199982 800148468 802866211
3023.9H02866211L922653M47006K244034J509018j165542M175033L536148K059784
$$ 802866211 806788864 807235870 809479904 810988922 809823380 813998413 817534561 819594345
3027.8H19594345J52969j797790L594208N066223o59714j765976r0561R56879K13623
$$ 819594345 819747314 817949524 821543732 826609955 825950241 824184265 824093704 825050583 825264206
3032.1H25264206n09567J039886q84628m728089j733779O05926J905975M84772l997040
$$ 825264206 824754639 825794525 824909897 820181808 818448029 819053955 820959930 821444702 817447662
3036.5H17447662M058991K419967j684799Q43277r66186j766587j38626j503372l228988
$$ 817447662 821506653 823926620 822241821 823085098 822118912 820352325 820213699 818710327 815481339
3040.8H15481339l544159l46375M150848J222916o190567m870453K215576J64643l61557
$$ 815481339 811937180 811590805 815741653 816964569 810774002 805903549 808119125 808283768 807922211
3045.1H07922211Q44574j047974J03531J764297r63897j970139K456360J969452J26800
$$ 807922211 808766785 807718811 807822342 809586639 808622742 806652603 809108963 811078415 811205215
3049.5H11205215j097564J708526K565918n79528N02014L466720q39386l996048J352539
$$ 811205215 810107651 811816177 814382095 813802567 814304581 817771301 816931915 812935867 814288406
3053.8H14288406K377320J87988J032791J013718n341j115341K358398L79792l263321
$$ 814288406 816665726 816853714 817886505 818900223 818894882 817779541 820137939 820517731 817254410
3058.2H17254410l369370J769867N50385m07410m99573q84170J84250q22678k81677
$$ 817254410 813885040 815654907 816205292 815797882 815298309 814414139 814598389 813775711 813494034
3062.5H13494034k337647k498169J551209j201782m868393m976578k948685n8899j879959
$$ 813494034 811156387 808658218 810209427 809007645 804139252 799162674 796213989 796155090 794275131
3066.8G94275131k798843l141861o728058n346222k784347J110076K319642l322373
$$ 794275131 791476288 788334427 781606369 776260147 773475800 774585876 776905518 773583145
3070.7G73583145o671905l783112j04446K088623o19660Q43811J989594j495590J737594
$$ 773583145 766911240 763128128 763023682 765112305 764492645 765336456 767326050 765830460 767568054
3075G67568054L386841Q41675J938629J820297m59976K719345o12488m477768j562347
$$ 767568054 770954895 771796570 773735199 775555496 775095520 777814865 777202377 772724609 771162262
3079.4G71162262P63626j912003k405395j574097j595459j62582j288605m729919l647080
$$ 771162262 771925888 770013885 767608490 766034393 764438934 764276352 762987747 758257828 754610748
3083.7G54610748l15017L415145J304398o60400j040192L471909P128677Q774872N340271
$$ 754610748 754295731 757710876 759015274 758354874 757314682 760786591 767915268 776690140 782030411
3088.1G82030411R48105M054565N177689K833099N755081L384247L264542L106537
$$ 782030411 782978516 787033081 792210770 795043869 800798950 804183197 807447739 810554276
3091.9H10554276J620788K368393O386185M883270J358185Q28323j94702N41687Q77304
$$ 810554276 812175064 814543457 820929642 825812912 827171097 827999420 827804718 828346405 829223709
3096.3H29223709J236191R23309r23233K560883M632187M76837l29056M157867j870498
$$ 829223709 830459900 831383209 830459976 833020859 837653046 838129883 837800827 841958694 840088196
3100.6H40088196o124878R31167O118775L122558j996459j926270J326218K33154k044296
$$ 840088196 833963318 834894485 841013260 844135818 842139359 840213089 841539307 841772461 839728165
3104.9H39728165K96478M914780J942825n54047J025391N92651M4556R22089j021729
$$ 839728165 840024643 844939423 846882248 846328201 847353592 847946243 847990799 848912888 847891159
3109.3H47891159j912613j080093k409592j188888N51528L097992J939164k547913
$$ 847891159 845978546 844898453 842488861 841299973 841851501 844949493 846888657 844340744
3113.1H44340744j119080N465546J663742n21164M72107J82114L96805k49176k097321
$$ 844340744 843221664 848687210 850350952 849829788 850301895 850484009 850880814 850631638 848534317
3117.5H48534317l488770j477890J615754M289627K295761J816253j885528j533585
$$ 848534317 845045547 843567657 845183411 849473038 851768799 853585052 851699524 850165939
3121.3H50165939M48838R38797k07291k336197L322678M616012r97543m17862j750946
$$ 850165939 850614777 851553574 851346283 849010086 852332764 856948776 855951233 855533371 853782425
3125.7H53782425K66266j003266L366242k730484l004837N480957M421158j721268
$$ 853782425 854048691 853045425 856411667 853681183 850676346 856157303 860578461 858857193
3129.5H58857193p585297l865127L137359L292466n93110j9226o23245K22931p55463
$$ 858857193 851271896 847406769 850544128 853836594 853243484 853224258 852601013 852823944 852068481
3133.9H52068481l260269J411972J155091J078720R39178j369247K90298L097916l051682
$$ 852068481 848808212 850220184 851375275 852453995 853393173 852023926 852314224 855412140 852360458
3138.2H52360458m487762K420959J387864J436843J98136k316513m86374K113800L234024
$$ 852360458 847872696 850293655 851681519 853118362 853316498 850999985 850513611 852627411 855861435
3142.5H55861435K34070o055374l962708M413910P101669j559295m265366m324188
$$ 855861435 856095505 850040131 846077423 850491333 857593002 856033707 851768341 847444153
3146.4H47444153K169494K075959j942444J111755P16324J13602K320175O41708j857528
$$ 847444153 849613647 851689606 849747162 850858917 851575241 851688843 854009018 854650726 852793198
3150.7H52793198k26822k141724j558380J510239L269195j596527k340622j45569K430725
$$ 852793198 852566376 850424652 848866272 850376511 853645706 852049179 849708557 849562988 851993713
3155.1H51993713N262604J250534n917663r32084K527161o20956n035324j336899K630310
$$ 851993713 857256317 858506851 852589188 851657104 854184265 853563309 848527985 847191086 849821396
3159.4H49821396L31268J84632P96279j040573J011734L06931j947403P49512M762497
$$ 849821396 850152664 850337296 851133575 850093002 851104736 851411667 849464264 850213776 854976273
3163.8H54976273K697677j830749j085739j397400j07041j870804k321319P04956M47311
$$ 854976273 857673950 855843201 854757462 853360062 853253021 851382217 849060898 849765854 850213165
3168.1H50213165j83410j861496n3101J868897Q0413K004929L250656l3798k457733
$$ 850213165 850029755 848168259 848115158 849984055 850064468 852069397 855320053 855286255 852828522
3172.4H52828522k543946P09076l55835k8305j844177l583679k213K753296Q37555
$$ 852828522 850284576 850993652 850637817 850609512 848765335 845181656 845179443 847932739 848770294
3176.8H48770294J752472R75800q95691K028427K245560O68945l503494l364869K938233
$$ 848770294 850522766 851498566 850602875 852631302 854876862 855545807 852042313 848677444 851615677
3181.1H51615677J518860k53601j498108m140778k392273L744889M37393k698593L049926
$$ 851615677 853134537 852880936 851382828 847242050 844849777 848594666 849032059 846333466 849383392
3185.5H49383392L903809P10220P82089L69568k024231k899170o365356M3106P472153
$$ 849383392 853287201 853997421 854779510 855149078 853124847 850225677 843860321 843903427 851375580
3189.8H51375580L021087m236297k017670L670960J647644K67105q26416J166153l951035
$$ 851375580 854396667 850160370 848142700 851813660 853461304 853728409 852901993 854068146 850117111
3194.1H50117111J545410L211670l480606r72824L425827K603455K156219l069687
$$ 850117111 851662521 854874191 851393585 850420761 853846588 856450043 858606262 855536575
3198H55536575q156814m762192K651596K902603K275086K864456l050461K55203M042130
$$ 855536575 847379761 842617569 845269165 848171768 850446854 853311310 850260849 850516052 854558182
3202.3H54558182k975846o581115l53775J779403L032380r49326L020935O25153k804490
$$ 854558182 851582336 845001221 844647446 846426849 849459229 848509903 851530838 852155991 849351501
3206.7H49351501M00010j227951K355346r49783K86713N444488n417l716278m451980
$$ 849351501 849751511 848523560 850878906 849929123 850215836 855660324 855654907 851938629 847486649
3211H47486649K961120N923462k031403l393936M35181j894455m434280N4779N220947
$$ 847486649 850447769 856371231 854339828 850945892 851381073 849486618 845052338 845107117 850328064
3215.4H50328064k08664K190475J377259j849594l370743k906418J922379M178619
$$ 850328064 850119400 852309875 853687134 851837540 848466797 845560379 847482758 851661377
3219.2H51661377m088135l791656J95465L24173J991119K328034J558914j201554k00424
$$ 851661377 847573242 843781586 843977051 844301224 846292343 848620377 850179291 848977737 848777313
3223.6H48777313J884613l098678l903275j179123K309342R23767o24466m106674k13700
$$ 848777313 850661926 847563248 843659973 842480850 844790192 845713959 845089493 840982819 840769119
3227.9H40769119N615464J524581l304596M144288n15519m712600J249084L700104
$$ 840769119 846384583 847909164 844604568 848748856 848233337 843520737 844769821 848469925
3231.8H48469925j23825k357407k74124M116898J040497l040848l951111K21481K633591
$$ 848469925 848346100 845988693 845714569 849831467 850871964 847831116 843880005 844101486 846735077
3236.1H46735077N93719p62252o11725J489029p73011j725692Q39920l39279L021621
$$ 846735077 847328796 846566544 845954819 847443848 846670837 844945145 845785065 845445786 848467407
3240.4H48467407J697235k485504Q04825l210831o002197K112579M092484L403854
$$ 848467407 850164642 847679138 848483963 845273132 839270935 841383514 845475998 848879852
3244.3H48879852j373596m395676k519836K154770P285843R70535n476990l246688
$$ 848879852 847506256 843110580 840590744 842745514 850031357 851001892 845524902 842278214
3248.2H42278214j649094O34460J954575K562179o78024k037735o80389O28280L270874
$$ 842278214 840629120 841263580 843218155 845780334 845102310 843064575 842384186 843012466 846283340
3252.5H46283340M364472k40555j524582j968994k783127j829529M622040J772232
$$ 846283340 850647812 850407257 848882675 846913681 844130554 842301025 846923065 848695297
3256.4H48695297k114334m158096p24335J930390M74395M95987K8000N78690L52478
$$ 848695297 846580963 842422867 841698532 843628922 844103317 844599304 844627304 845205994 845558472
3260.7H45558472m18015j531372M150162P44552q082656k636109L330689K404327k895737
$$ 845558472 845140457 843609085 847759247 848503799 840421143 837785034 841115723 843520050 840624313
3265H40624313r46960j06201K412491j560822l085175J493989J149139o64902L740921
$$ 840624313 839677353 839571152 841983643 840422821 837337646 838831635 839980774 839315872 843056793
3269.4H43056793J300736k805405k456741j878281J656342M89425L54233L01285P64847
$$ 843056793 844357529 841552124 839095383 837217102 838873444 839362869 839717102 840018387 840783234
3273.7H40783234j142960n257568M008407M358444N53284m020920k850952K589798
$$ 840783234 839640274 834382706 838391113 842749557 843302841 839281921 836430969 839020767
3277.6H39020767K560425m405060j92261L793869k223205J059952O727829k788391
$$ 839020767 841581192 837176132 836983871 840777740 838554535 839614487 846342316 843553925
3281.4H43553925m802857L31574k412262J942062N057068k221756m638214L026657
$$ 843553925 838751068 839082642 836670380 838612442 843669510 841447754 836809540 839836197
3285.3H39836197L298721K79770M48914M404525j142044j74102k01874n189972n174332
$$ 839836197 843134918 843414688 843863602 848268127 847126083 846951981 846750107 841560135 836385803
3289.6H36385803R06983J39236L803711k314224Q59527l385238j602173N087509J062775
$$ 836385803 837292786 837432022 841235733 838921509 839781036 836395798 834793625 839881134 840943909
3294H40943909m9668j061706m242554k453461N361634J463699m90417K946777L3264
$$ 840943909 840894241 839832535 835589981 833136520 838498154 839961853 839471436 842418213 842451477
3298.3H42451477m214554m054794J770630J730270j472015r76715L893890L595963
$$ 842451477 838236923 834182129 835952759 837683029 836211014 835234299 839128189 842724152
3302.2H42724152r06601l998337m094467P73239L286590M854889J272889n144120J587754
$$ 842724152 841817551 837819214 833724747 834497986 837784576 842639465 843912354 838768234 840355988
3306.5H40355988M266815k853546n1880J530227k512664n372620M84695p2784J778717
$$ 840355988 844622803 841769257 841717377 843247604 840734940 835362320 835847015 835774231 837552948
3310.8H37552948J042252L972168k51389m656372k012634M137420n60455k418060K238311
$$ 837552948 838595200 842567368 842315979 837659607 835646973 839784393 839223938 836805878 839044189
3315.2H39044189m88739l440246L088302J635437l718185r9335R58176J171494J123352
$$ 839044189 838555450 835115204 838203506 839838943 836120758 836021423 836979599 838151093 839274445
3319.5H39274445k967225J01471N443802K584763j506806q36639M97665L497010l128052
$$ 839274445 836307220 836408691 841852493 844437256 842930450 842093811 842591476 846088486 842960434
3323.9H42960434o666107k548828N37414P140656K626495p574692l936996K396164
$$ 842960434 836294327 833745499 834282913 841423569 844050064 836475372 832538376 834934540
3327.7H34934540o24619K38495J863480O97403J925354r35974o336213K636414N009613
$$ 834934540 834309921 834548416 836411896 837109299 839034653 838098679 831762466 834398880 839408493
3332.1H39408493o120605l420105K947387N586548k139587j247177k422181J39542
$$ 839408493 833287888 829867783 832815170 838401718 836262131 835014954 832592773 832732315
3335.9H32732315N355835j53122k045669M051742P55844o408920R7504M030075m45938
$$ 832732315 838088150 837935028 835889359 839941101 840696945 834288025 834385529 838415604 837969666
3340.3H37969666J67694j265488J129074J047821n548630L14789N776138r48638n443345
$$ 837969666 838137360 836871872 838000946 839048767 833500137 833814926 839591064 838642426 833199081
3344.6H33199081l505935M887771M525910p68128n089721l811875Q18711R63745j850281
$$ 833199081 829693146 834580917 839106827 838338699 833248978 829437103 830255814 831219559 829369278
3348.9H29369278o16226L857956K893982k102204K305146M337463O28281J597976l215408
$$ 829369278 828753052 832611008 835504990 833402786 835707932 840045395 840673676 842271652 839056244
3353.3H39056244l525848k282868p725449k268371O845627M961700j61209L09219m34417
$$ 839056244 835530396 833247528 825522079 823253708 830099335 835061035 834899826 835209045 834774628
3357.6H34774628j900940l323212j316833P824783M65698n463867J01166K155533J690521
$$ 834774628 832873688 829550476 828233643 836058426 836524124 831060257 831161423 833316956 835007477
3362H35007477J58462R31855M239959Q34656l026886j326446K824401j303939k505265
$$ 835007477 835165939 836097794 840337753 841172409 838145523 836819077 839643478 838339539 835834274
3366.3H35834274N94712M027023j45950N48553m260025n439377K831116l768463l977509
$$ 835834274 836428986 840456009 840310059 840858612 836598587 831159210 833990326 830221863 826244354
3370.6H26244354O502991K406998p42264q82645J883927J000213j14059l288803r58786
$$ 826244354 832747345 835154343 834412079 833529434 835413361 836413574 836299515 833010712 832051926
3375H32051926o77567K195740k98233L851852O427613m229355m464569j072541n69763
$$ 832051926 831374359 833570099 833271866 837123718 843551331 839321976 834857407 833784866 833215103
3379.3H33215103J617432M272232K584381l206482k105713n734253j83716L563691
$$ 833215103 834832535 839104767 841689148 838482666 836376953 830642700 830458984 834022675
3383.2H34022675K527771j201249Q27790J373977l26156N23987l943329m837647k03399
$$ 834022675 836550446 835349197 836176987 837550964 837224808 837748795 833805466 828967819 828764420
3387.5H28764420K224426N621338K055969j61285o5461k947158m158326N45273L726502
$$ 828764420 830988846 836610184 838666153 838504868 838439407 835492249 831333923 831879196 835605698
3391.9H35605698j691742L43933Q20846l535080r84726J542435P3700k030792K218704
$$ 835605698 833913956 834257889 835078735 831543655 830558929 832101364 832175064 830144272 832362976
3396.2H32362976J955185P81250j138458Q85315Q51593o99005p30133L92913O602784
$$ 832362976 834318161 835099411 833960953 834846268 835697861 834998856 834268723 834661636 841264420
3400.5H41264420j158143p516174M21219K096405j096191k759858m508285K41318O647415
$$ 841264420 840106277 832590103 833011322 835107727 834011536 831251678 826743393 826984711 833632126
3404.9H33632126M656372N75943j878128k828903j152573J495590j32904l312225n18265
$$ 833632126 838288498 838864441 836986313 834157410 833004837 834500427 834367523 831055298 830537033
3409.2H30537033N17044M250565J06659j669770l846206L314743N541229j373596j732941
$$ 830537033 831054077 835304642 835411301 833741531 829895325 833210068 838751297 837377701 835644760
3413.6H35644760k494812J852265K147064j796875J419067l20969n524063l67584K879639
$$ 835644760 833149948 835002213 837149277 835352402 836771469 836450500 830926437 830558853 833438492
3417.9H33438492j384354j596222L527832m41894j922989J793747M36477k79998o74210
$$ 833438492 832054138 830457916 833985748 833543854 831620865 833414612 833851089 833571091 832896881
3422.2H32896881J190872m10614p852096K539749Q411331j328735k586136N42068J452942
$$ 832896881 834087753 833677139 825825043 828364792 836776123 835447388 832861252 833403320 834856262
3426.6H34856262J042557k113037k122879M070740N693664k325592L1281M047546k836151
$$ 834856262 835898819 833785782 831662903 835733643 841427307 839101715 839132996 843180542 840344391
3430.9H40344391k827377K58941J086121J411133l437195P49359l39432k482071l73535
$$ 840344391 837517014 837775955 838862076 840273209 836836014 837585373 837245941 834763870 834390335
3435.2H34390335J818009k609101j289825J800003K674255k398910m88739L667755
$$ 834390335 836208344 833599243 832309418 834109421 836783676 834384766 833896027 837563782
3439.1H37563782L412704m169998o145554J676789L775635M99191L722153L151016
$$ 837563782 840976486 836806488 830660934 832337723 836113358 836612549 840334702 843485718
3443H43485718j362458m621658p782M476624l449631k390137L419876O6986n345535
$$ 843485718 842123260 837501602 837493820 841970444 838520813 836130676 839550552 839617538 834272003
3447.3H34272003q27865m22669Q16269P09610j760483K589722K325134P71942Q90961
$$ 834272003 833444138 833021469 833837738 834547348 832786865 835376587 837701721 838473663 839364624
3451.6H39364624K308960m2419j186982J419220N28183l928909m702377R90905J510849
$$ 839364624 841673584 841631165 840444183 841863403 842391586 838462677 833760300 834751205 836262054
3456H36262054N78919J907501k573089j898346k281800L79486M046784k319565o74210
$$ 836262054 836840973 838748474 836175385 834277039 831995239 832374725 836421509 834101944 833427734
3460.3H33427734M932175M389114j866531M50592M93012m709855k273330J945038n22919
$$ 833427734 838359909 842749023 840882492 841333084 841826096 837116241 834842911 836787949 836265030
3464.7H36265030K703094M54026l720017M479065L253861K518310j031113l931274
$$ 836265030 838968124 839422150 835702133 840181198 843435059 845953369 844922256 840990982
3468.5H40990982k355576J447831L091430j021881K504730R86329j587143m809037
$$ 840990982 838635406 840083237 843174667 842152786 844657516 845643845 844056702 839247665
3472.4H39247665K786484J98822L195191l196488n178757L197861K593842J969146
$$ 839247665 842034149 842232971 845428162 842231674 837052917 840250778 842844620 844813766
3476.2H44813766n85937l137741J853409j265412j575927M20913l146515n75409R25141
$$ 844813766 844227829 841090088 842943497 841678085 840102158 840523071 837376556 836801147 837726288
3480.6H37726288J739960N408477N42450n242920j309890J66626r65271J256027N84488
$$ 837726288 839466248 844874725 845417175 840174255 838864365 839030991 838065720 839321747 839906235
3484.9H39906235K533645O03257l015061o021805Q46100O709900j590423J738891K321854
$$ 839906235 842439880 843043137 840028076 834006271 834852371 841562271 839971848 841710739 844032593
3489.3H44032593l262635K909012J393891J251297N768661j602478n526962l794785
$$ 844032593 840769958 843678970 845072861 846324158 852092819 850490341 844963379 841168594
3493.1H41168594J751252j23520j422272M671249k34527m031754j442718N29251p95365
$$ 841168594 842919846 842796326 841374054 846045303 845810776 841779022 840336304 840865555 840070190
3497.5H40070190Q27027K807083k491989n226822K283935L979569o90308r58481J266022
$$ 840070190 840897217 843704300 841212311 835985489 838269424 842248993 841558685 840600204 841866226
3501.8H41866226M868698J958390j310730n038300m017792L410874M255371l7842J714630
$$ 841866226 846734924 848693314 847382584 842344284 838326492 841737366 845992737 845954895 847669525
3506.1H47669525L628082k233047m894028L107910M403153M9286k059403j463775m611130
$$ 847669525 851297607 849064560 844170532 847278442 851681595 851730881 849671478 848207703 843596573
3510.5H43596573j934128j34888O86951P269135P600631k500381n414276k580872J676178
$$ 843596573 841662445 841527557 842214508 849483643 857084274 854583893 849169617 846588745 848264923
3514.8H48264923O36520n83038L447189k570419m039078m22973L177566q73108j684188
$$ 848264923 848901443 848318405 851765594 849195175 845156097 844733124 847910690 847037582 845353394
3519.2H45353394L328399l83911r74808K179032j093521K257690j617508j850281K154618
$$ 845353394 848681793 848297882 847323074 849502106 848408585 850666275 849048767 847198486 849353104
3523.5H49353104p23801l688431K802124L445282l715591k851029O466980J213837
$$ 849353104 848629303 844940872 847742996 851188278 847472687 844621658 851088638 852302475
3527.4H52302475l959198L170166Q344498j238327o378556m121933k567520M20990
$$ 852302475 848343277 851513443 859857941 858619614 852241058 848119125 845551605 845972595
3531.2H45972595L850174k246475l698807m97970J554794K608032M585571j961898
$$ 845972595 849822769 847576294 843877487 843379517 844934311 847542343 852127914 850166016
3535.1H50166016k912903n89371K218018l730240L312835M362412j590729k672500
$$ 850166016 847253113 846663742 848881760 845151520 848464355 852826767 851236038 848563538
3538.9H48563538j354981K403946K76642k129440K101287K038956j083069l162536
$$ 848563538 847208557 849612503 849889145 847759705 849860992 851899948 850816879 847654343
3542.8H47654343j645127M031296L069916L76892k152252J865463L916702l572616
$$ 847654343 846009216 850040512 853110428 853487320 851335068 853200531 857117233 853544617
3546.6H53544617m563523k688598J935653L636780J973419j542129K254028O037064
$$ 853544617 848981094 846292496 848228149 851864929 853838348 852296219 854550247 860587311
3550.5H60587311o87p470627o419449J755295L692169m101562k082291K576447L839340
$$ 860587311 860586624 853115997 846696548 848451843 852144012 848042450 845960159 848536606 852375946
3554.8H52375946L4790n152893J569366L177414j107635K874527L604355l232422l94440
$$ 852375946 852410736 847257843 848827209 852004623 850896988 853771515 857375870 854143448 853749008
3559.2H53749008n08880l631592k774277l044052J553726O919556N688324K329712
$$ 853749008 853240128 849608536 846834259 843790207 845343933 852263489 857951813 860281525
3563H60281525L30047n108337j950760N741043N252762k43607j0346374m678192N000076
$$ 860281525 860611572 855503235 853552475 859293518 864546280 864302673 853956299 849278107 854278183
3567.4H54278183M317551l424607j471023J766586J929550K56272k163239k112808
$$ 854278183 858595734 855171127 853700104 855466690 857396240 857652512 855489273 853376465
3571.2H53376465L13110K402954L262635l15552K969894K439575j786041m315033J836777
$$ 853376465 853689575 856092529 859355164 859039612 862009506 864449081 862663040 858348007 860184784
3575.6H60184784J055527l247528L179931q95157p791214j97296N419922q45871m126663
$$ 860184784 861240311 857992783 861172714 860277557 852486343 852289047 857708969 856863098 852736435
3579.9H52736435n97076n43595L646698J819763j826248K210007k95334k048340K030945
$$ 852736435 852139359 851595764 855242462 857062225 855235977 857445984 857150650 855102310 857133255
3584.3H57133255m580536j720352O156616j119385l999862n43976r9945J053390M492646
$$ 857133255 852552719 850832367 856988983 855869598 851869736 851325760 851225815 852279205 856771851
3588.6H56771851j407242m386292J445084K729797Q08029K073212N422363L873063
$$ 856771851 855364609 850978317 852423401 855153198 855961227 858034439 863456802 867329865
3592.4H67329865k390671l673096l407364N585251L221054j0261383j02386Q353347
$$ 867329865 864939194 861266098 857858734 863443985 866665039 856403656 856301270 864654617
3596.3H64654617M51126n588989M115982N875931J007690m226379m084625l822937
$$ 864654617 865105743 859516754 863632736 869508667 870516357 866289978 862205353 858382416
3600.2H58382416l778763N310364O168518l183212k975007l209686r93423L123245
$$ 858382416 854603653 859914017 866082535 862899323 859924316 856714630 855721207 858844452
3604H58844452M505310J053390q3694j987000K971879K142257m909897K601014N685958
$$ 858844452 863349762 864403152 864319458 862332458 865304337 867446594 862536697 865137711 870823669
3608.4H70823669m247665m924316k090683m820099M404220P395554Q45032j497422
$$ 870823669 866576004 861651688 859561005 854740906 859145126 866540680 867385712 865888290
3612.2H65888290j662368j392060O43158K458191j997146k465973j148758M02069R84268
$$ 865888290 864225922 862833862 863477020 865935211 863938065 861472092 860323334 860725403 861709671
3616.6H61709671o41251M880066Q405152p401m412384p166595m396057n078049L185119
$$ 861709671 861068420 865948486 874353638 874346237 869933853 862767258 858371201 853293152 856478271
3620.9H56478271L555756K66876L283463j079788j275559r97162Q72116O599274k962189
$$ 856478271 860034027 860300903 863584366 862504578 861229019 860231857 861103973 867703247 864741058
3625.2H64741058l416214J197968L293152J976318o20422M502487J907959j5614700
$$ 864741058 861324844 862522812 865815964 867792282 867171860 871674347 873582306 857967606
3629.1H57967606l698121J883469J303101K451858k223358K693787K016143m106216
$$ 857967606 854269485 856152954 857456055 859907913 857684555 860378342 862394485 858288269
3633H58288269j884003k393798p42798l062744J159133O613541J826782k546692k315902
$$ 858288269 856404266 854010468 853267670 850204926 851364059 857977600 859804382 857257690 854941788
3637.3H54941788J512375L316269K359313L5859k785797j458512j408233M891052j560288
$$ 854941788 856454163 859770432 862129745 862165604 859379807 857921295 856513062 861404114 859843826
3641.6H59843826m741974K406388R97467J564102K427978j623992k697449j64871M223480
$$ 859843826 855101852 857508240 858505707 860069809 862497787 860873795 858176346 858011475 862234955
3646H62234955P429733M664765n580826p193756j207047N643921K359161n163345J336212
$$ 862234955 869664688 874329453 868748627 861554871 860347824 865991745 868350906 863187561 864523773
3650.3H64523773k713928j3500061N38788P173843J335297M93011K033463R74808r70459
$$ 864523773 861809845 848309784 848848572 856022415 857357712 857850723 859884186 860858994 859888535
3654.7H59888535k442K475510k424774r851075J30692Q913040J374512l718415Q4153
$$ 859888535 859886093 862361603 859936829 850085754 850216446 859129486 860503998 856785583 856869736
3659H56869736L424453j205215k862396L935776L202972k841873o19126K084580j888657
$$ 856869736 860294189 859088974 856226578 860162354 863365326 860523453 859904327 861988907 860100250
3663.3H60100250j688232k851944o55670Q30307K295608M205857R51461O22864O089020
$$ 860100250 858412018 855560074 854904404 855734711 858030319 862236176 863187637 863810501 869899521
3667.7H69899521M416199r70612l370666m826279K811050l875961j4204025n200653
$$ 869899521 874315720 873345108 869974442 865148163 867959213 864083252 849879227 844678574
3671.5H44678574P639694R908905J0142059L189240M616775j262283p083130M71115
$$ 844678574 852318268 862227173 872369232 875558472 880175247 878912964 871829834 872300949
3675.4H72300949j1003799j4599915Q594742J2921066L249588o445465l879089j885605
$$ 872300949 861297150 846697235 855291977 868213043 871462631 865017166 861138077 859252472
3679.2H59252472m45099J283951L444900M716568j994934m429016J016007M91027k536239
$$ 859252472 858807373 860091324 863536224 868252792 866257858 861828842 862844849 863335876 860799637
3683.6H60799637j490402K470626K485581o69861J874542R100113q21304q31375N177459
$$ 860799637 859309235 861779861 864265442 863595581 865470123 874570236 873748932 872917557 878095016
3687.9H78095016j1281051j1391602P055054O197891P48291l561249k993240K838974
$$ 878095016 866813965 855422363 862477417 868675308 869423599 865862350 862869110 865708084
3691.8H65708084l895569j578674O308746P621842j721192o608734n681305j14212
$$ 865708084 861812515 860233841 866542587 874164429 872443237 865834503 860153198 860038986
3695.6H60038986L199158K864227m900589o267776J650238P841034O344299j617203
$$ 860038986 863238144 866102371 861201782 854934006 856584244 864425278 870769577 869152374
3699.5H69152374l58581k498703l811493J36337J418915j720963J22605K749862k050171
$$ 869152374 868793793 866295090 862483597 862619934 864038849 862317886 862440491 865190353 863140182
3703.8H63140182n13534L10516l22799P755050M266053j086350l347626m661865L139496
$$ 863140182 862626648 862937164 862614365 870369415 874635468 873549118 870201492 865539627 868679123
3708.2H68679123O300888o83670l166199m751358j002197Q990860J1243057n058594
$$ 868679123 874980011 874296341 871130142 866378784 865376587 874367447 885610504 880551910
3712H80551910j1524353j0997467J770325M309235k256470L224411L521194k140731
$$ 880551910 869027557 858030090 859800415 864109650 861853180 865077591 868598785 866458054
3715.9H66458054j569291n4779o10199J720276J216812K306443l059235n608978O416855
$$ 866458054 864888763 864833984 864223785 865944061 867160873 869467316 866408081 860799103 867215958
3720.2H67215958N085449k173920J114731m95605r31168J540604K51922o5002K393875
$$ 867215958 872301407 870127487 871242218 870746613 869815445 871356049 871607971 871542969 873936844
3724.6H73936844q56476K021179k267227o286392j981888L31116M989090J674347n383301
$$ 873936844 873080368 875101547 872834320 866547928 864566040 864897156 869886246 871560593 866177292
3728.9H66177292M62189O815948j219711j568222L043670k270355J773071j281204
$$ 866177292 866639481 873455429 872235718 870667496 873711166 871440811 873213882 871932678
3732.8H71932678j911621N757828O810455n045547j4739151P421951J24741j328049
$$ 871932678 870021057 875778885 882589340 877543793 862804642 870226593 870351334 869023285
3736.6H69023285O821213r815522j438446O03104l833237K239075O678467j515122
$$ 869023285 875844498 866028976 864590530 865193634 861360397 863599472 870277939 868762817
3740.5H68762817j811752j024551n958634K41089P760849R042587J5515366N57861
$$ 868762817 866951065 865926514 859967880 860208969 867969818 877012405 892527771 893085632
3744.3H93085632k5660934q881073l529358J115265Q776169Q040847Q474961r167633
$$ 893085632 867424698 858543625 855014267 856129532 864905701 872946548 881421509 872253876
3748.2H72253876K13928Q083954j8797836m349518J1415100K155762r503251p970123
$$ 872253876 872467804 880551758 861753922 857404404 868819504 870975266 861472015 853501892
3752.1H53501892j276932J655884K763977O059189K232056m493180k279892N423737
$$ 853501892 852224960 853880844 856644821 862704010 864936066 860442886 858162994 863586731
3755.9H63586731J385879R97162k54669k569427L588867N242843j081695q964310n709839
$$ 863586731 864972610 865969772 865715103 863145676 866734543 871977386 870895691 861931381 856221542
3760.3H56221542J592865O673127N939712J28403n590439k146072L6468J211319N637817
$$ 856221542 857814407 864487534 870427246 870555649 864965210 862819138 862855606 864066925 869704742
3764.6H69704742k252578m499283K07596k451630N244370P77969m458695J163483N400925
$$ 869704742 867452164 862952881 863160477 860708847 865953217 866731186 862272491 863435974 868836899
3768.9H68836899J466827m645614j4364243n750351R913559N083771l754959l667832
$$ 868836899 870303726 865658112 851293869 845543518 855457077 860540848 856785889 853118057
3772.8H53118057J353073Q855973O030655j021576l206864j314926j936569l278427
$$ 853118057 854471130 863327103 869357758 868336182 865129318 863814392 861877823 858599396
3776.7H58599396J436767R67560J695099K689896n25055N19104K879104k527694r04847
$$ 858599396 860036163 861003723 862698822 865388718 864863663 865382767 868261871 865734177 864829330
3781H64829330j63726L532028O85882m873809l8681M209060m163055n322495J885758
$$ 864829330 864665604 868197632 868883514 864009705 863971024 868180084 864017029 858694534 860580292
3785.3H60580292L679504k505874l893738K682419K353820L355942j505966l638764
$$ 860580292 864259796 861753922 857860184 860542603 862896423 866252365 864746399 861107635
3789.2H61107635l505096j336746L895645K186890j005021K223664J567612K401504
$$ 861107635 857602539 856265793 860161438 862348328 861343307 863566971 865134583 867536087
3793H67536087n835800k907562J069259K615433K468491K801971N026169j020355p077790
$$ 867536087 861700287 858792725 859861984 862477417 864945908 867747879 872774048 871753693 864675903
3797.4H64675903k300796M126434n365829o348114J974868P169419R644089N60073
$$ 864675903 862375107 866501541 861135712 854787598 856762466 863931885 873575974 874136047
3801.2H74136047k1608886j0245514J1994400J1261215Q19855k689286N86167j886673
$$ 874136047 852527161 842281647 854276047 865537262 866357117 863667831 864253998 862367325
3805.1H62367325N053406P737274m855576r516525q159332Q8730O867523K109222m3869
$$ 862367325 867420731 875158005 870302429 860785904 852626572 852715302 859582825 861692047 861648178
3809.4H61648178j183700L672561J845322m795380n161056Q85162O62460K478333P87201
$$ 861648178 860464478 864137039 865982361 861186981 856025925 856911087 857573547 860051880 860839081
3813.8H60839081J271286L728256M604950k864838l488617j2144928m808044P912216
$$ 860839081 862110367 865838623 870443573 867578735 864090118 851945190 847137146 855049362
3817.6H55049362L746796K014160J0124283N68008q322525n109558R9564k817307n549316
$$ 855049362 858796158 860810318 870934601 871502609 863180084 858070526 858170090 855352783 849803467
3822H49803467K031936P05643P748490M04663P92541K569580j55563L31650k770310
$$ 849803467 851835403 852541046 860289536 860694199 861486740 864056320 863900757 864232407 861462097
3826.3H61462097m482498k670670l7689O619492L459015j546250M825898j427002k186890
$$ 861462097 856979599 854308929 854271240 860890732 864349747 862803497 867629395 866202393 864015503
3830.7H64015503j025086p033004K930984J602936J386490r14383m33960J1318588
$$ 864015503 862990417 855957413 858888397 860491333 861877823 860963440 860529480 871848068
3834.5H71848068M927902j2459793l574829P047196M632721K272491j0469665j4812317
$$ 871848068 876775970 864316177 860741348 867788544 872421265 874693756 864224091 849411774
3838.4H49411774K877807P992859N147934P02210j832047k458267l825073K178268
$$ 849411774 852289581 860282440 865430374 866132584 864300537 861842270 858017197 860195465
3842.2H60195465M860916K63977K559967m528808n087662l70255K526017O812896L78876
$$ 860195465 865056381 865320358 867880325 863351517 858263855 857893600 860419617 867232513 867611389
3846.6H67611389o017914j584701M363479N171128n65110l229599J215592P80868l411788
$$ 867611389 861593475 860008774 864372253 869543381 868978271 865748672 866964264 867745132 864333344
3850.9H64333344K532348M319458k099533K988129j759568n457687j4851379q666611
$$ 864333344 866865692 871185150 869085617 872073746 870314178 864856491 850005112 841338501
3854.8H41338501R928436M930878J828384M807740M01382j353073n10025J089859k539368
$$ 841338501 851266937 856197815 858026199 862833939 863235321 861882248 861372223 862462082 859922714
3859.1H59922714J583939N097351j112061n106659l238372R539337N505676o163559
$$ 859922714 861506653 866604004 865491943 860385284 857146912 866686249 872191925 866028366
3863H66028366M01764J435318m67682q136749j0474701Q125229P436371L205795q34808
$$ 866028366 866430130 867865448 867397766 859261017 848786316 856911545 864347916 867553711 866718903
3867.3H66718903j978836K167816L914261L793716k797241j2551880r158859L761367
$$ 866718903 864740067 866907883 870822144 874615860 871818619 859266739 850107880 853869247
3871.2H53869247O841584K215500N648040J249390k760162m684220n787964j486892
$$ 853869247 860710831 862926331 868574371 869823761 867063599 862379379 856591415 855104523
3875H55104523J558304O282730L178634m544906j807785j079712P975464M544754K045593
$$ 855104523 856662827 862945557 866124191 861579285 859771500 858691788 866667252 871212006 873257599
3879.4H73257599o400681j0206451q650208k953338Q588485M517594M143371M495469
$$ 873257599 866856918 856650467 848000259 845046921 853635406 858153000 862296371 866791840
3883.2H66791840n263901r56650Q711548R46960q838195o656418J275634J526490L026581
$$ 866791840 861527939 860571289 869282837 870229797 861391602 854735184 856010818 857537308 860563889
3887.6H60563889J688919n20249M505921K757949J669159K356797o358033j2925872
$$ 860563889 862252808 861732559 866238480 868996429 870665588 873022385 866664352 853738480
3891.4H53738480m621506K13776O494445Q406220q66013o994171n87006M478150J905289
$$ 853738480 849116974 849330750 855825195 864231415 863365402 856371231 855784225 860262375 862167664
3895.8H62167664l7613l74832J639175K470856p54776j226502k218475L442993n818634
$$ 862167664 862130051 861755219 863394394 865865250 865110474 863883972 861665497 865108490 859289856
3900.1H59289856j823731M259339k00272n288162n141449N832214P288590P64007r804992
$$ 859289856 857466125 861725464 861525192 856237030 851095581 856927795 864216385 864980392 855175400
3904.4H55175400m656754L636627M882813j366806N77087M90723m90112K338104O361389
$$ 855175400 850518646 854155273 859038086 857671280 858248367 858739090 858248978 860587082 866948471
3908.8H66948471m317169m182892N34363K438354p26623n77774K240600q42437k006302
$$ 866948471 862631302 858448410 858982773 861421127 860694504 860116730 862357330 861514893 859508591
3913.1H59508591P67440M79355l491668k304306J858673j076737R49555L787765M878769
$$ 859508591 860276031 860755386 857263718 854959412 856818085 855741348 856690903 860478668 865357437
3917.5H65357437K527390p710114q122558J831817M851990l52860k484436K007447
$$ 865357437 867884827 860174713 852052155 853883972 858735962 858383102 855898666 857906113
3921.3H57906113O50863l682174p48825M535980N347976l7536n205002l104935k034073
$$ 857906113 858556976 854874802 854125977 858661957 864009933 863972397 858767395 855662460 853628387
3925.7H53628387j24588L880158N127411l55072J802673n74493n38025k902451m597473
$$ 853628387 853503799 857383957 862511368 862156296 863958969 863384476 862846451 859944000 855346527
3930H55346527J179733N733490K411423m092026n029297M635163J034393k500381J286392
$$ 855346527 856526260 862259750 864671173 860579147 855549850 860185013 861219406 858719025 860005417
3934.3H60005417J946716K507019K562180m860001m562836K78245n59617l752288L22265
$$ 860005417 861952133 864459152 867021332 862161331 857598495 857876740 857317123 853564835 853887100
3938.7H53887100o71463K589417J702881k9374R8267j86310N036j699753j02158J535111
$$ 853887100 853215637 855805054 857507935 857478561 857576828 857390518 857395554 855695801 855593643 857128754
3943.5H57128754K243118n7526n808181k929993p44095R207840R350128k965240o423951
$$ 857128754 859371872 859314346 853506165 850576172 849832077 859039917 868390045 865424805 859000854
3947.8H59000854j211700K52533k392960p302017m116516K639999L631745M559479
$$ 859000854 857789154 858041687 855648727 848346710 844230194 846870193 850501938 855061417
3951.7H55061417M339523N428925L432540m220352j463012m265061m281921j873169
$$ 855061417 859400940 864829865 868262405 864042053 862579041 858313980 854032059 852158890
3955.6H52158890L373718M119110l668289n482864K602768L653564k913132l65066
$$ 852158890 855532608 859651718 855983429 850500565 853103333 856756897 853843765 853478699
3959.4H53478699K312622l73841K634507M144516K587585m903869j814652K579117
$$ 853478699 855791321 855417480 858051987 862196503 864784088 859880219 858065567 860644684
3963.3H60644684J350250r65958m338531l241425k477264J799393M991607j56707j384278
$$ 860644684 861994934 861028976 856690445 853449020 850971756 852771149 857762756 857606049 856221771
3967.6H56221771K864151l076172j194839k150345K831879N102310j43280o92444n297241
$$ 856221771 859085922 856009750 854814911 852664566 855496445 860598755 860455475 859763031 854465790
3971.9H54465790l338394J587753Q1253n50385P475129J154785m225769p85828j974563
$$ 854465790 851127396 852715149 852796402 852246017 859721146 860875931 856650162 855864334 853889771
3976.3H53889771K19192J107864j459350l12729j053848m234696O45676N336914K429810
$$ 853889771 854108963 855216827 853757477 853444748 852390900 848156204 848801880 854138794 856568604
3980.6H56568604k050858l385620M71802N021057o61545J8845L91235O344833J59302
$$ 856568604 854517746 851132126 851603928 856624985 855963440 855982285 856373520 862718353 862877655
3985H62877655j513214M760513k120209n914306n851288R79233K245483J391831K645797
$$ 862877655 861364441 866124954 864004745 858090439 852239151 853218384 855463867 856855698 859501495
3989.3H59501495L814469j710282l471069n655441J73492M563294j409836K077637
$$ 859501495 863315964 861605682 858134613 852479172 852652664 857215958 855806122 857883759
3993.2H57883759K840271o168366j850738P918777J402588j964264p011948J722336
$$ 857883759 860724030 854555664 852704926 860623703 862026291 860062027 853050079 854772415
3997H54772415L690567L396225M64401j142959k689285n958405K031708
$$ 854772415 858462982 861859207 862323608 861180649 858491364 852532959 854564667
4000.4H54564667
$$ 854564667
##END=$$ End of the data block
