##TITLE= 5,8-Dihydro-6,13-dimethylcarbazolo[2,3-b]carbazole
##JCAMP-DX=   5.00   $$ Varian Associates, Inc., VNMR Software
$$ VNMR Version 5.1 Revision A, March 1, 1995
$$ Wed Jun  3 11:45:07 MET DST 1998
$$ svsj version 5.1, 97/1/14
##DATA TYPE=  NMR SPECTRUM
##DATA CLASS= XYDATA
##ORIGIN=     varian
##OWNER=      haider
##SPECTROMETER/DATA SYSTEM=   Varian UNITYplus-300
##.OBSERVE FREQUENCY= 299.9503529
##.OBSERVE NUCLEUS=   ^1H
##.SOLVENT REFERENCE= 2.490        $$ solvent=dmso
##.FIELD=             7.04         $$ Tesla
##.ACQUISITION TIME=  3.7388536    $$ seconds
##.AVERAGES=          16           $$ number of transients
##RESOLUTION=         0.183        $$ digital resolution in Hz
##.PHASE 0=           -41.3        $$ zero order phase correction (left edge)
##.PHASE 1=           0.011231     $$ first order phase correction, deg/Hz
##$REFERENCE_POINT=   929.936      $$ Referencing label
$$ Varian specific parameters
$$ --------------------------
##$acqstatus=    (0..1)  101 0
##$alfa=         19.9999923706     $$ usec
##$alock=        <n>
##$array=        <>
##$arraydim=     1
##$arrayelemts=  0
##$at=           3.7388536
##$bs=           16
##$celem=        1
##$cp=           <y>
##$ct=           16
##$d1=           2                 $$ sec
##$d2=           0                 $$ sec
##$date=         <Nov 13 97>
##$dfrq=         299.9493529       $$ Hz
##$dm=           <nnn>
##$dmf=          200
##$dmm=          <c>
##$dn=           <H1>
##$dod=          0.00999999977648  $$ sec
##$dof=          0                 $$ Hz
##$dp=           <y>
##$dpwr=         30
##$exppath=      </export/home/varian/haider/vnmrsys/exp1/acqfil>
##$fb=           3400
##$file=         </export/home/varian/haider/jk2>
##$filter=       54.0999984741
##$fn1=          1024
##$gain=         44
##$homo=         <n>
##$hs=           <nn>
##$hst=          0.00800000037998  $$ sec
##$il=           <n>
##$in=           <n>
##$lb1=          0.318309992552
##$load=         <n>
##$loc=          0
##$math=         <f>
##$method=       <z1z2>
##$np=           44864
##$nt=           16
##$p1=           0                 $$ usec
##$pad=          0.5               $$ sec
##$parversion=   4.3
##$pmode=        <partial>
##$priority=     5
##$proc1=        <ft>
##$proc=         <ft>
##$pslabel=      <std1h>
##$pw90=         16.8              $$ usec
##$pw=           10                $$ usec
##$rfband=       <ch>
##$rof1=         10                $$ usec
##$rof2=         9.9999961853      $$ usec
##$seqfil=       <s2pul>
##$sfrq=         299.9503529
##$sn=           0
##$solvent=      <dmso>
##$ss=           0
##$sw=           5999.700015
##$temp=         28
##$tin=          <n>
##$tn=           <H1>
##$tof=          1000              $$ Hz
##$tpwr=         57
##$vtc=          25
##$vtwait=       300               $$ sec
##$wbs=          <>
##$werr=         <>
##$wexp=         <>
##$wnt=          <>
##$wshim=        <n>
##$wtfile1=      <>
##$wtfile=       <>
##$x1=           -103
##$x2y2=         327
##$x3=           123
##$xy=           335
##$xz2=          0
##$xz=           62
##$y1=           22
##$y3=           -137
##$yz2=          0
##$yz=           -40
##$z1=           -2047
##$z1c=          -71
##$z2=           -1264
##$z2c=          212
##$z2x2y2=       0
##$z2x3=         0
##$z2xy=         0
##$z2y3=         0
##$z3=           78
##$z3c=          0
##$z3x2y2=       0
##$z3x3=         0
##$z3x=          0
##$z3xy=         0
##$z3y3=         0
##$z3y=          0
##$z4=           -96
##$z4c=          0
##$z4x2y2=       0
##$z4x=          0
##$z4xy=         0
##$z4y=          0
##$z5=           0
##$z5x=          0
##$z5y=          0
##$z6=           0
##$z7=           0
##$z8=           0
##$zx2y2=        0
##$zx3=          0
##$zxy=          0
##$zy3=          0
##$rp=           26.1
##$lp=           -67.4
##$rfl=          1676.8
##$rfp=          746.9
##$axis=         <p>
##$sp=           -30.0
##$wp=           3959.2
##$cr=           2703.1
##$delta=        723.4
$$ End of Varian specific parameters
$$ ---------------------------------
$$ Y-values stored with standard (16-bit) integer precision
##DELTAX= -0.0006104221
##XUNITS=        PPM
##YUNITS=        ARBITRARY UNITS      $$ (mm on paper)
##XFACTOR= 1.0000000000
##YFACTOR=       0.021606900
##FIRSTX= 16.9014000806
##LASTX= -3.1002997363
##MAXY=          707.993287
##MINY=          -0.216069
##NPOINTS=       32768
##FIRSTY=        0.216069
##XYDATA=        (X++(Y..Y))
$$ plain form
16.90140 10 4 8 6 5 6 7 4 9 4 6 5 8 7 10 4 5 11 9 11 13 4 6 6 7 9 10 6 6 5 14 4 7 7 6 7 7 5 6 10 10 7 4 7 5 6 3 7 5 8 11 9 7 6 5 12 9 4 9 8 8 11 5 4 7 9 6 9 8 10 13
16.85867 13 8 8 11 6 7 4 10 7 4 14 8 12 10 8 7 7 6 8 4 13 6 9 6 7 9 6 4 7 6 10 5 6 12 8 9 8 6 6 6 7 7 10 8 4 6 6 10 4 9 9 9 9 7 11 5 6 8 6 11 6 6 10 9 3 8 9 11 9 5 9 5
16.81533 5 6 8 5 6 9 11 6 6 12 8 7 8 6 11 1 5 3 7 6 7 13 7 8 12 6 10 7 10 7 4 10 9 9 13 8 5 12 5 7 8 4 10 11 6 9 14 7 10 2 10 2 8 4 8 9 6 9 6 9 10 6 4 2 10 9 8 7 7 12 7 7 8 9
16.77077 9 7 6 6 10 10 5 6 4 9 9 8 3 6 6 3 6 9 4 13 5 10 5 7 11 5 8 10 6 9 5 1 9 8 4 7 9 7 10 5 3 9 7 6 7 3 8 10 5 9 7 6 8 5 5 12 6 4 9 7 5 6 5 5 7 7 9 4 2 5 11 6 9
16.72682 9 6 7 8 6 8 7 6 8 10 4 5 8 7 6 6 5 3 8 10 5 4 9 6 8 5 5 9 9 0 9 7 7 8 5 7 7 8 10 6 11 7 6 15 5 7 10 8 7 7 7 9 5 4 8 11 2 9 5 6 10 5 10 11 7 7 8 9 2 9 7 5
16.68348 5 12 5 5 7 10 2 11 2 6 6 5 6 5 5 10 3 9 7 7 5 7 10 6 11 6 6 3 5 5 5 4 9 11 7 6 6 2 4 5 8 10 7 3 7 6 9 3 10 10 7 6 2 6 5 3 8 4 4 9 2 12 5 10 4 11 5 11 5 5 8 10
16.64014 10 7 9 7 5 7 6 5 8 3 5 8 5 6 6 7 4 7 8 2 7 5 8 9 3 11 7 4 4 11 9 4 8 6 4 7 7 7 7 7 1 7 7 5 7 3 3 7 6 5 4 12 7 11 3 12 2 5 12 3 9 7 6 10 5 7 4 9 8 5 10 6 13
16.59619 13 3 8 6 7 2 4 8 7 6 8 10 4 7 12 2 9 9 7 12 3 4 6 7 7 4 5 10 8 6 7 4 5 8 1 11 7 3 8 9 6 6 13 5 8 8 7 9 5 8 9 2 8 6 7 5 4 8 7 2 6 7 5 10 6 7 2 6 7
$$ packed form
16.90140A0oMkjJTlNnKjLjLoJOkKTrK%JKJm%jRj0L%jJ%kJM%lTLkJlMkLTkTjTPlnNj%LojLKlLjKL
16.85867A3n%LnJlOlTJ0oMkTj%jKmRpLlJKlkLjMnJOmJjk%TJ%LkmK%MoN%UkMoJKkNn%MjoNJKkmMm
16.81533EJKlJLKn%OmjJkNj0MkMjJOoJMoMlLlTOj%MnlPpKJmOJnLNpLqQqOmMJlLlLJmkTQjU%Nn%JT
16.77077Ikj%M%nJkN%jnL%lLTnRqNnKMoLKmLmTQjmLKkLnkOkjJmNKnMkjKl%PokNkTJj%K%KnkLOnL
16.72682IlJTkKjTKToJLjT%jkNKnjNlKl%M%rRk%JlK%JKmNmjRj0KLkj%TKmjMLrPmJMnNJm%JTpPkT
16.68348EPp%KLqRrM%jJj%NpOk%kKLmNn%lK%TjNKmj%mKJLKlmMjLoP%ljmMjkNm%NpJ0pNoPoOo%LK
16.64014A0lKkTKjTLnKLlJ%JlLJoNkLJoQml%PknMkTL%VoO%kKm%MjUQnMqRj0LPrOkjMnKlNjlNmP
16.59619A3j0NkJnKMjTKToLNj0P%kNrJKJ%lJNkTJlJLpJ0mTNJl%PqL%jKmLJpOkJkjMjnMJkNmJnMJ
$$ plain form
16.55468 7 10 7 10 7 7 7 5 7 11 9 5 8 5 7 8 9 4 12 8 8 4 7 7 7 6 6 6 7 4 8 12 5 6 6 2 9 1 5 7 4 5 6 7 6 4 4 8 4 9 9 5 9 8 7 10 6 9 5 5 5 5 10 9 7 5 6 8 10 5 9 3 8 4 10
16.50951 10 9 7 8 6 5 3 4 9 9 3 6 7 11 5 7 8 5 4 6 2 7 9 8 6 7 4 6 3 6 2 5 8 2 4 9 6 11 4 0 6 5 5 6 7 6 8 9 3 6 7 6 6 11 2 5 8 3 7 4 7 11 1 6 9 2 6 8 8 9 7
16.46678 7 6 7 8 5 7 1 10 2 10 5 8 6 10 3 5 11 1 9 4 2 6 5 7 9 6 4 9 6 1 9 6 6 6 10 8 7 10 4 4 5 8 5 7 7 4 5 10 5 8 6 6 7 8 -1 6 5 8 8 6 7 9 8 6 3 6 0 11 7 6 5
16.42405 5 6 8 5 6 3 7 5 8 8 9 5 8 7 4 6 6 2 3 8 3 7 2 5 7 3 6 10 4 6 2 5 9 7 10 5 5 6 8 3 8 5 6 4 8 5 5 6 4 8 10 9 7 6 5 10 10 7 5 5 6 3 5 4 8 8 10 4 11 2 5 6 6
16.38010 6 4 7 4 7 9 3 5 8 5 7 9 4 9 7 4 4 3 3 5 4 7 5 8 5 7 7 4 10 11 5 5 4 4 5 6 2 6 9 9 3 13 0 10 6 4 8 5 8 6 6 9 2 6 3 4 14 6 7 3 5 8 5 6 4 5 8 5 9
16.33859 9 2 9 7 5 5 7 3 8 7 4 7 5 4 4 5 6 3 13 -1 11 5 3 5 12 4 6 5 5 3 6 4 9 5 9 2 7 1 6 3 13 4 8 7 8 7 8 -1 8 4 8 3 10 8 9 8 6 7 6 2 6 8 0 5 7 8 7 6 4
16.29708 4 7 7 8 9 3 3 10 4 5 5 1 8 6 4 6 6 2 10 11 1 9 3 3 8 7 3 10 4 7 7 6 9 5 7 3 6 4 4 2 7 4 8 5 5 5 7 4 5 0 8 7 6 7 -1 7 1 8 3 7 4 6 7 6 3 5 5 6 8 8 7 3
16.25374 3 3 6 6 9 4 6 10 1 9 8 8 7 7 2 7 7 5 4 7 5 6 5 3 7 6 5 10 6 1 9 4 5 5 5 5 6 8 2 8 5 8 7 6 7 7 5 5 4 9 8 8 6 4 3 8 7 5 7 2 9 9 9 5 7 5 6 4 3 8 5 4 9 7
$$ packed form
16.55468GLlLl%TkKMkmLlKJTnQm%mL%Tj%TJlMTpJ%mPqMKlJUjk%MmN%mMjTLmLm%UNjkTJKTnMoNmO
16.50951A0jkJkjkJN%oLJMoKJljKmNKjkJlKlLmLToKNlNpmOj%JTjKJoLJj%NrLTnMlLMj0NLpMK%Jk
16.46678GjJTlKoRqQnLkMpKOj0QnkMjKTlkNlnQl%TMkjLo%JLlK%lJNnLk%JTrPjL%kJKjklLoJ1mjT
16.42405EJKlJlMkL%JmLjlK%mJNnMnLKmLMoKmLMkLn%JKnNlJkMl%JkMKjkjTN%lk%JlKjM%KoPrLJ%
16.38010FkLlLKoKLlKTnNkl%j%KjLkLlK%lOJo%j%JTmML%oJ0j3J0mkMlLk%LpMlJJ0qJmKLlJkJLlM
16.33859IpPkT%KmNjlLkj%JTlJ0j4J2okKPqKj%kLkNmMpNoNlJ0rMjJjJrRmMnPkJjkJjmMKqNKJjTk
16.29708DL%JTo%PoJ%mPkTK%mQJj0Qo%NjmPoL%jLmKmLk%kNlMl%TKlJnQjTJqQoPnMlKJjlK%JK%jm
16.25374C%L%LnKMrQj%j%nN%kjLkJjkMjTNmnQnJ%UJKoOlLjTJ%k%jNj%kTjNjkKnP%TmKkJkjNljNk
$$ plain form
16.20918 7 9 6 4 7 4 8 2 6 4 3 1 1 9 10 4 4 7 6 7 9 5 8 3 4 5 5 7 3 9 2 7 6 5 4 5 7 6 7 4 5 4 2 6 6 4 5 2 5 2 6 7 6 6 7 2 7 5 5 6 3 9 8 8 8 8 10 3 6 5 5 7 2 7 4
16.16401 4 6 5 -1 6 8 0 5 6 7 8 7 0 6 6 5 10 0 12 6 7 5 6 5 5 11 10 4 4 4 8 3 6 7 5 8 1 5 6 6 4 4 8 5 6 4 9 2 8 10 2 6 6 3 11 2 8 4 4 4 6 7 1 4 6 3 6 4 12 3 9 1
16.12067 1 11 3 6 9 0 8 5 4 11 3 9 2 4 4 7 7 8 4 9 6 7 3 9 -1 10 -1 4 2 5 4 3 5 8 4 6 7 5 6 4 6 9 5 3 6 3 5 4 4 4 3 8 4 8 6 2 10 7 5 10 2 -1 6 3 2 7 2 6 4
16.07916 4 7 1 2 6 4 5 6 0 9 4 8 2 5 5 3 4 4 4 3 2 5 5 4 7 4 7 5 5 1 5 2 6 6 6 3 7 1 10 3 8 0 7 3 7 3 3 8 5 7 4 3 4 4 0 8 5 10 5 6 6 6 7 10 2 4 6 4 5 6 4 4 8
16.03521 8 6 3 2 11 4 7 4 3 2 7 5 13 4 10 3 4 2 4 3 6 4 9 7 6 4 1 6 3 7 2 7 8 7 1 8 3 7 2 6 4 1 7 4 2 10 1 4 7 4 7 5 7 8 6 8 7 5 6 0 5 10 4 3 4 0 9 4 4 6 1 4 2
15.99126 2 8 2 4 8 2 5 6 5 2 4 4 5 3 8 4 3 8 1 8 2 6 5 3 6 0 6 7 4 3 1 0 4 9 3 5 4 7 6 5 6 8 5 3 5 1 5 5 4 6 9 6 5 3 4 7 3 3 5 5 0 7 3 3 2 6 4 5 2 8 9 6 0
15.94731 0 8 4 3 11 0 5 7 5 10 5 8 3 3 6 4 1 8 1 6 6 5 2 8 7 10 5 4 6 2 4 7 5 0 6 0 9 4 1 8 4 5 4 8 3 4 6 2 4 6 8 1 5 2 6 4 0 6 8 5 6 9 5 0 7 3 2 4 3 6 5 5 7
15.90336 7 2 0 8 1 0 6 5 6 6 5 1 6 2 6 9 1 6 5 0 5 2 5 3 10 2 6 4 3 9 5 3 3 5 9 8 6 7 6 6 4 3 5 11 2 9 7 2 5 6 3 4 7 1 3 1 5 3 8 6 0 9 1 1 7 5 4 4 5 5 8 5 4 3
$$ packed form
16.20918GKlkLlMoMkjk%QJo%LjJKmLnJT%KmOpNjUJKjJlJjkM%kJlLlMJj%JnNk%JlOj%UKpLj%KnNl
16.16401DKjoPKqNJUjpO%jNj0J2oJkJj%Ojo%TMnLJkLpMJ%k%MlJkNpOKqM%lQrOm%TKJoLKlLkQrOq
16.12067AJ0qLTrQljPqOpK%L%JmNlJmOj0J1j1NkLjTKLmKJkJkKLmkLlKj%TjNmMkmQlkNqlPljNnMk
16.07916DLoJMkJToRnMoL%kJ%TjTL%jLlLk%mMlM%TlMoRpNqPmMm%NlKljJ%mQlNnJ%TJLqKTkJTk%M
16.03521HkljRpLljTNkQrOpJkKjLkNkjklNlMnNJjoPnMnMklOlkQrLTlLkKJkKjkJoNTojJmRn%KnLk
15.99126BOoKMoLJjlK%JkNmjNpPoMjkLoOJljkjMNoKjLjTJKlkKmM%jKLljkJLm%K%nPm%jMkJlOJlo
15.94731@QmjQj1NKkNnLn%LklPpN%jlOjLnjKmKLknOoRnlPmJjMnJKmKUpMlMkmOKlJLmnPmjKjLj%K
15.90336GnkQpjOjJ%jmNmMLqNjnNlLkPqMkjOmk%KMjkJj%kjKOrPknLJlJLoKkMkNkoRq%Okj%J%LljT
$$ plain form
15.85880 3 5 6 5 3 5 0 7 0 5 5 4 3 0 7 8 6 10 3 4 5 8 4 5 1 6 5 6 6 0 1 5 2 3 4 1 6 5 5 6 2 5 2 8 2 5 5 1 9 6 7 7 8 6 3 6 2 8 2 6 2 2 2 4 7 3 8 5 2 6 3 7 2
15.81485 2 5 9 3 6 5 3 6 4 3 6 6 3 6 3 3 7 0 7 -1 6 7 3 5 4 6 8 -1 8 4 3 7 1 4 7 3 6 4 0 7 4 9 0 8 5 3 3 3 2 5 10 3 7 5 0 8 6 4 5 0 5 4 3 4 2 2 10 6 5 6 2 7 8
15.77090 8 3 3 6 6 0 4 9 2 7 6 2 5 0 5 5 3 2 7 8 4 11 4 3 6 3 1 11 5 3 5 5 4 3 4 3 8 3 5 1 7 4 4 5 2 2 2 4 3 3 5 5 3 3 6 1 5 7 3 1 5 5 6 3 7 5 2 7 3 7 2 6
15.72756 6 6 6 3 3 0 2 6 4 4 8 2 4 4 2 4 6 2 1 6 -1 3 1 5 5 6 5 0 6 8 6 5 4 6 7 1 7 2 4 5 6 4 4 1 3 2 8 0 8 3 4 6 3 1 9 0 7 6 8 7 5 1 5 6 1 5 0 3 2 3 2 7 7
15.68361 7 2 7 2 6 3 0 10 2 5 5 3 10 4 3 1 5 3 3 9 7 1 6 5 1 6 2 0 4 5 6 7 2 4 9 4 6 7 0 4 5 -1 4 2 3 3 4 3 6 7 5 5 7 5 0 5 3 3 3 5 1 7 2 0 4 4 5 -1 8 0 2 6 3
15.63966 3 4 5 4 1 10 1 7 0 3 8 2 8 3 4 6 1 1 4 8 4 6 2 4 5 3 8 8 8 2 4 0 4 4 2 2 5 2 6 0 4 3 4 3 6 5 3 3 5 4 3 6 1 8 2 3 1 9 3 11 5 2 4 3 8 5 4 1 4 3 5 2 6
15.59571 6 -2 4 5 0 7 4 7 2 1 4 5 -2 12 8 5 5 2 4 10 1 6 3 4 3 2 4 5 4 5 5 7 1 3 0 6 1 8 1 4 8 1 11 -1 1 1 -2 3 6 3 7 2 5 6 5 3 5 6 0 5 5 2 7 8 0 6 6 1 2 7
15.55359 7 4 4 3 3 1 3 2 3 5 2 1 0 2 6 7 7 6 5 3 6 6 6 0 4 3 5 4 3 6 3 6 1 6 5 6 2 6 0 5 3 9 2 5 4 6 4 4 5 -1 4 8 0 10 2 0 1 1 7 7 4 6 -3 8 0 4 4 3 0 8 3
$$ packed form
15.85880CKJjkKnPpN%jTlPJkMpJTLmJmNjJ%oJMlJTlNj%JmLlOoL%mQlJ%JklLmOoMm%TKLmNlTMlMn
15.81485BLMoLjkLkjL%lLl%MpPqPJmKjKTrRmjMoLTmLkmPlNrQlk%TjLNpMknQkTJnNjTJk%QmjJmNJ
15.77090Hn%L%oMNpNjmLnN%kjNJmPpjLlkJ0okK%jTJjNnKmOl%Jl%TKj%K%k%LnMKmkM%JlMklNmMnM
15.72756F%Tl%lKMk%MoK%kKTmjNpMkM%JjnOKkjTKJoOnKJTk%lKjOqQnJKlkQrPjKjkmMJnMnLjJjN%
15.68361GnNnMlTJ0qL%kPojkMk%OkoNjmNmkMJUnKNnKJpMJoNkJ%JjLJk%KknNk%TKmOnkM%JoRqKMl
15.63966CJTjlRrOpLNoOnJKn%LMmKmKJkN%ToKmM%k%LlMoMjJjLjk%KjTLnPoJkQoQolKjNljlLjKlM
15.59571FqOJnPlLnjLJpJ4ml%lKOrNlJjTKJjJ%KoKlOnPpLMpJ0j2K%lNLlMnLJjkKJoN%lNJqO%nJN
15.55359Gl%j%kKjJKljTKMJ%jTkL%ToMjKjTLlLnNjJmMoNkOpLjKk%JoNMqJ0qkJ%O%lKrJ1qM%jlQn
$$ plain form
15.51086 3 4 9 6 6 7 1 7 4 3 4 2 4 0 6 6 5 5 0 2 4 4 2 6 4 0 5 3 2 4 0 7 1 3 8 1 9 5 6 2 4 7 2 2 6 1 3 4 -1 10 1 4 4 5 3 6 5 0 0 3 -1 2 4 0 5 0 7 1 2 1 7 5
15.46752 5 0 4 8 5 5 1 4 3 5 5 5 1 8 3 2 3 6 3 6 0 3 1 6 4 3 1 6 0 6 2 1 5 3 3 3 2 4 5 4 2 4 2 2 2 2 10 2 5 3 4 7 2 7 -1 4 3 5 5 0 1 6 1 0 5 -2 2 2 1 3 0 4 3 6
15.42296 6 0 7 4 2 4 3 7 6 1 4 6 5 4 2 3 4 6 7 1 5 4 2 1 6 2 0 5 4 8 4 7 2 3 5 3 4 4 8 3 1 7 2 9 3 6 4 6 2 3 3 6 5 6 6 8 0 6 0 3 6 0 0 4 1 3 3 0 2 1 5 2 3
15.37901 3 1 2 4 -1 1 5 1 3 2 6 6 3 6 2 3 2 3 4 3 2 3 2 4 3 3 7 2 6 6 3 8 0 3 2 2 3 1 0 0 5 6 5 9 4 4 3 0 6 1 6 6 2 4 6 4 1 1 0 0 5 7 2 1 6 1 1 6 5 3 7 -1 4
15.33506 4 6 4 4 3 9 0 1 8 4 3 0 1 3 2 5 1 6 2 6 2 8 2 2 6 6 0 5 3 0 5 4 4 0 3 6 4 1 2 5 2 2 3 3 4 4 4 0 6 4 3 7 0 6 5 5 5 1 0 0 3 4 2 3 8 -1 3 -1 2 8 2 2 5
15.29111 5 7 0 1 5 1 8 1 5 2 3 5 0 7 2 1 3 2 0 6 4 3 4 4 3 0 0 4 4 3 4 3 0 5 4 3 3 4 2 4 4 1 4 2 5 3 1 5 2 5 0 5 -1 -1 2 4 0 5 4 4 1 5 4 1 4 -1 10 1 5 4 2 1
15.24777 1 4 5 0 5 7 3 6 2 5 1 7 0 7 3 1 5 3 5 5 2 2 6 6 3 2 4 2 2 2 5 4 4 0 6 2 4 2 1 1 2 1 5 6 1 5 3 3 6 2 2 7 0 10 1 5 1 4 4 2 0 0 1 0 1 3 2 6 4 4 1 2
15.20443 2 5 2 2 5 4 2 3 5 1 5 4 6 0 3 3 7 4 1 0 0 5 6 1 0 6 -3 9 1 -1 2 3 2 5 3 2 1 6 -1 4 0 1 2 1 4 3 3 0 5 4 0 7 -2 5 3 2 3 4 1 5 4 8 5 3 5 1 9 0 3 0 5 -1
$$ packed form
15.51086CJNl%JoOljJkKmO%j%nKT%kMkmNkjKmPoKNpQmJmKLn%MnKJnJ1rL%JkLjn%LmLKmNnPoJjOk
15.46752EnMTl%mLjK%TmPnjJLlLoLkNkjkNoOmjMk%TjKJjkKk%UQqLkJLnNqNjK%nJNnjNpM%jKlMjL
15.42296FoPlkKjMjnLKjTkJTKJoMjkjNmkNjMmLnJKkJ%MnkOnPoLkKmJ%LjJ%KqOoLTo%MlK%lKjMlJ
15.37901CkJKnKMmKjM%lLmJjJTjTJjKj%MnM%lNqLj%Jkj%NJjMn%jlOnN%mKTkl%j%NKnjNn%NjkMqN
15.33506DKk%jOrJPmjlJKjLmNmMmOo%M%oNklNj%mLTklJLl%J%J%TmOkjMpOj%Tmj%LJkJNrMmLOo%L
15.29111EKpJMmPpMlJKnPnjKjkOkjJ%jl%M%jJjlNjT%JkK%lLkLkTMlLnNo%LKmNj%lMjlLnJ1rMjkj
15.24777ALJnNKmLmLmOpPmkMkK%l%M%ljKk%TLj%mOmKkj%JjMJnMk%Lm%NpJ0rMmL%kT%JjJKjMk%lJ
15.20443BLl%LjkJKmMjKoL%MlTj%NJnjOrJ2qkLJjLkjTNpNmJTjLj%lNjmPrPkjJTlMjMlkKmQrLlNo
$$ plain form
15.16109 -1 7 5 6 3 1 4 0 5 3 1 5 1 0 4 0 6 2 7 2 4 4 -1 8 2 0 1 1 0 5 2 0 5 4 0 6 4 2 3 1 5 0 2 6 0 6 2 3 0 3 2 1 5 3 2 4 -1 5 3 3 5 7 4 3 5 -2 3 1 0 3 -1 3 4
15.11714 4 4 2 2 1 6 3 2 6 2 5 5 2 4 1 9 -1 6 2 4 0 3 -1 4 2 0 6 2 2 8 4 2 3 3 1 0 1 6 4 0 1 3 2 3 5 -1 3 5 2 6 6 0 2 1 -1 3 2 2 7 0 6 4 2 2 2 5 5 3 5 0 7 0
15.07380 0 4 5 1 4 0 4 3 4 4 0 2 3 0 1 -1 1 4 -5 6 1 1 8 2 7 2 1 0 1 0 0 6 0 1 2 2 8 0 5 0 7 2 4 3 0 1 4 0 6 0 2 2 5 2 9 -1 4 3 0 4 1 2 5 3 0 6 1 4 4 1 0
15.03107 0 3 0 1 4 5 1 3 1 3 2 1 4 3 2 5 3 2 5 3 4 1 4 5 5 3 2 2 4 4 3 3 5 4 5 4 2 1 1 4 4 -1 1 5 4 5 1 3 0 3 2 6 0 1 -1 2 1 5 6 3 2 3 4 4 5 -2 3 4 0 4 2 4 5
14.98712 5 1 -1 1 0 2 3 2 4 6 3 2 3 5 4 4 -1 5 0 2 5 2 0 2 6 3 4 3 2 1 3 3 0 4 0 5 5 0 2 2 0 3 2 0 1 5 3 1 6 2 5 2 1 3 3 0 4 1 1 4 0 5 0 3 5 2 6 3 0 0 4 -2 1 2
14.94256 2 6 5 0 3 3 0 5 0 7 3 0 0 2 2 3 1 7 0 1 2 0 5 3 -1 0 0 1 0 0 3 3 0 4 0 6 2 4 1 0 4 1 3 2 3 7 3 2 3 0 2 4 2 2 2 5 2 0 6 2 1 5 1 5 6 2 0 4 0 5 1 3 2
14.89861 2 6 3 0 6 5 2 4 0 4 3 4 3 -1 -3 6 0 1 5 -1 4 1 4 3 3 1 5 1 0 0 3 0 7 4 3 2 1 1 9 2 0 6 3 4 -1 -2 0 0 1 3 2 1 3 0 6 2 2 1 -2 1 1 1 4 4 2 1 1 2 2 1 2 4 2 3
14.85404 3 1 5 0 3 0 0 6 3 0 4 2 4 5 1 5 1 3 3 5 1 5 3 -1 6 -1 4 2 3 2 6 0 3 1 4 2 4 0 0 2 1 2 4 2 1 2 1 -1 4 0 2 1 5 1 5 1 0 1 0 6 0 5 -1 5 2 2 2 2 1 2 5 2 0 2
$$ packed form
15.16109aQkJlkLmNkTMmjMmOmNnK%nRokJ%jNlkNjmOkTJkMnKMoOmJlLjTMkjKnOk%KTljKpNkjLmMJ
15.11714D%k%jNljMmL%lKlQj0PmKmLmNkTOm%OmkJ%kjJNkmJKjJKoMKlM%oKjkMj%NpOkT%TL%kKnPp
15.07380@MJmLmMjJ%mKJlJkKLrJ1n%PoNnjTJj%OoJT%OqNnPnKjlJLmOoK%LlPj0NjlMlJLklOnL%lj
15.03107@LlJLJmKkKjTLjTLkjLkJlLJ%kj%K%j%KjJjkj%L%nKMjJmKlLjMoJkLjMJljJT%JpNJmMkKJ
14.98712EmkKjKJjKTljJKj%nOnKLlkKMlJjUK%lMmN%nK%kLjkJMkTNmLljK%lMl%LmNnLKlMlT%MoLJ
14.94256BMjnL%lNnPml%K%JkOpJTkNkmJ%Jj%L%lMmOmKljMlKjJMmjJlKTk%TLlkOmjMmMJmkMmNmKj
14.89861BMlTOjlKmMjJjmkRoJMoNlLj%kMmj%LlPljU%QpkOlJnjK%JKjTKlOm%jlL%TL%kj%J%jJKkJ
14.85404CkMnLl%OlTMkKJmMmK%KmMkmPpNkJjMoLkLkKm%KjJKkjJjkNmKjMmMmjJjOoNoOl%UjJLlkK
$$ plain form
14.80948 2 3 4 0 0 0 1 2 1 5 2 2 1 1 4 0 2 0 5 2 -4 5 2 2 1 5 -2 -1 5 6 7 3 0 7 0 3 5 1 -1 2 3 4 0 2 1 1 4 1 0 6 0 3 0 0 1 3 1 2 0 2 4 4 -1 1 -5 4 2 0 6 7 -1 2 -1
14.76553 -1 2 4 6 0 2 4 0 2 2 0 3 5 5 0 3 3 0 5 -1 0 7 2 3 6 -2 5 3 3 7 -2 2 1 -1 1 2 5 0 0 5 3 4 -3 7 2 0 2 0 2 -2 3 0 2 5 0 1 4 0 2 2 1 4 1 1 1 1 0 3 2 2 -1 0 3
14.72158 3 3 0 1 5 2 4 4 0 3 0 3 2 3 2 1 0 0 1 0 0 0 5 -2 0 2 0 6 1 1 0 2 3 0 3 0 0 0 0 1 5 0 1 -2 0 1 0 -3 2 4 2 3 1 2 1 1 3 0 3 -1 1 -2 4 0 1 1 1 3 -1 8 -2 7 0 1
14.67702 1 5 2 1 1 0 3 3 0 3 -1 5 1 3 -2 -1 -1 4 2 0 -3 3 3 0 3 3 3 2 -2 5 -2 3 4 0 3 0 4 1 4 3 2 3 0 2 0 5 1 4 0 5 2 1 0 -2 5 3 2 2 2 4 4 1 4 6 -2 2 2 4 0 0 4 1 3
14.63307 3 4 2 5 0 2 4 1 4 2 2 0 8 3 0 2 -2 0 0 -2 6 -2 6 -2 2 0 5 3 5 0 3 4 0 4 0 1 5 0 3 0 6 3 1 3 1 0 5 0 4 -1 0 1 -2 2 5 0 0 -2 3 2 1 3 2 2 -1 4 2 0 1 0 0 0 3
14.58912 3 3 7 -5 1 0 2 5 0 0 -1 3 1 1 2 -1 -3 0 1 5 4 3 -2 3 1 2 2 3 -1 6 -2 4 0 2 0 0 1 1 2 0 0 0 0 3 0 0 4 4 1 5 3 0 1 0 1 0 -1 4 0 6 1 5 2 1 1 3 -1 0 1 6 0 5 3
14.54517 3 6 4 0 0 0 1 -1 4 0 -1 2 0 1 0 4 -4 1 1 0 3 1 1 -1 0 3 1 3 -1 0 0 6 5 3 0 7 2 3 -1 1 3 0 2 -1 -1 0 3 4 2 2 3 0 5 -1 0 2 0 0 0 1 6 0 2 5 4 0 1 2 0 3 -1 1 1
14.50122 1 4 0 3 0 2 2 -1 3 5 0 1 0 1 0 3 1 -4 6 2 4 1 2 1 2 1 0 4 2 -1 7 2 5 2 -1 3 0 4 -2 0 4 -1 0 1 0 4 0 0 1 6 2 1 6 0 0 3 0 0 1 0 0 0 1 4 0 5 5 4 5 4 1 4
$$ packed form
14.80948BJTm%TJTjMl%j%LmKkNloRl%jMpJOJTmlPpLKmkLJTmKj%LljOoLl%JKkJkKT%nKoRkTOJqLl
14.76553aLKToKTmK%kLK%nL%lNoJPnJLqPk%MrMjkKJLn%NkJpJ0nkKkKmNlKLnJLmK%jLl%UjLj%lJL
14.72158C%lJMlK%mLlLjJjU%Jj%TNpKTkOn%jKJlLl%UJMnJlKJjlNKkJkJj%KlLmKlOmJ%TKmRj0RpJ
14.67702AMlj%jL%lLmOmKnJ%NkTlO%lL%TjmPpNJmLlMlLjTJlKkNmLmNljTkPkj%TK%lLKqM%Km%MlK
14.63307CJkLnKTlLk%kQnlKmK%kQqQqMkNkKnLJmMmJMnLlOlkKkjNnMnJTlMLn%kNjTKj%lNkTJj%TL
14.58912C%Mj2OjKLn%jMk%JlkLJMjTnNkJ%JmPqOmKk%J%Jk%ULl%M%lMklJjJjTNmOnMlj%KmJTNoNk
14.54517CLkm%TJkNmjLkJjMqN%jLk%kJLkKmJ%OjklPnJmKTlKl%JLJk%JlNoJKk%TJNoKLjmJTkLmK%
14.50122ALmLlK%lMKnJjJjLknJ0mKlJjJjTMklQnLlTMlMoKMnJTjMm%JNmjNo%Ll%Jj%TJLmN%jJjlL
$$ plain form
14.45788 4 4 3 4 3 2 0 1 -2 0 3 0 1 3 4 -1 5 -2 0 3 -1 5 0 1 0 0 4 0 -1 4 1 5 3 1 3 -3 2 2 3 5 -3 4 3 6 1 2 3 0 7 -1 4 7 2 1 2 0 4 1 2 1 5 3 0 2 1 2 -1 8 1 0 0 2 1
14.41393 1 3 2 0 5 -2 5 4 3 -2 3 2 2 3 0 0 2 0 5 2 6 0 1 8 0 1 2 0 4 0 0 1 13 0 2 3 0 5 -1 0 2 0 3 2 -1 1 1 0 5 -3 1 -1 0 4 0 0 1 1 1 1 0 3 0 1 5 0 2 3 1 2 -2 6
14.37059 6 -2 4 0 3 4 2 0 3 0 3 2 0 0 2 0 1 6 0 1 -1 2 2 2 0 0 0 0 0 5 0 3 5 0 0 5 -1 4 4 2 3 5 0 2 4 0 6 1 3 0 0 0 2 3 2 0 6 0 6 5 0 0 2 0 5 3 5 5 -4 0 1 1 -2 3 0
14.32542 0 -1 3 1 3 4 0 1 -2 4 2 5 -2 5 0 3 -1 3 0 6 2 5 3 1 2 0 2 3 1 0 8 1 0 5 -3 1 3 2 0 -1 -1 3 2 1 5 4 -1 0 -2 1 -2 2 2 2 3 0 1 2 0 1 -1 3 1 2 3 0 1 0 0 2 0 3 3
14.28147 3 2 4 3 -1 3 0 0 0 0 2 0 5 0 -1 2 0 1 1 -1 -2 2 3 0 3 4 2 2 1 3 -2 3 2 2 2 0 3 1 1 0 4 -2 1 2 3 1 0 2 2 2 0 0 1 1 3 -2 5 6 -3 0 -2 1 3 0 1 0 0 0 6 0 0 2 0 3
14.23691 3 2 2 0 5 3 -1 -1 0 0 3 0 -1 6 4 -1 3 1 0 -1 0 2 0 -1 1 4 -1 0 0 0 1 -3 0 2 0 -1 4 -1 1 2 0 0 1 1 4 -2 0 8 0 1 -1 5 1 5 0 3 5 1 -2 3 3 1 4 4 2 1 0 1 1 -4 3 2 -1
14.19296 -1 2 0 1 1 2 0 7 2 2 2 2 2 2 3 3 4 -1 2 0 3 0 3 1 0 0 0 0 3 0 3 1 1 0 3 0 3 0 2 2 2 0 1 1 0 2 1 4 -1 -3 3 0 2 5 1 6 -1 -4 0 0 1 0 0 0 4 3 1 1 1 1 -1 6 2 4 3 2 1 3 3
14.14534 3 1 1 1 0 3 7 -5 2 1 -5 3 -1 -1 2 3 0 0 0 -4 6 0 4 0 2 -1 2 2 4 2 2 6 0 1 0 2 3 0 3 -2 0 0 2 5 -1 -1 0 0 0 3 3 0 -1 3 0 0 2 2 -1 0 0 -2 0 1 0 2 1 0 2 0 1
$$ packed form
14.45788D%jJjTkJlKLlJKJnOpKLmOnJj%MmjNlMkTKoN%JKqPjLnJTlPqNLnjJkMlJjMklKjJlRpj%Kj
14.41393AKjkNpPjTnNj%Jl%KkNlMoJPqJTkMm%JJ2j3KJlNoJKkLjlK%jNqMkJMm%J%UjLlJMnKJkJmQ
14.37059FqOmLJkTLlLjk%KkJNoJkL%Tk%VNnLKn%NoN%kJKnKTmOnKl%TKJjkOoOjn%KkNkK%rMJ%lNl
14.32542@jMkKJmJlOkLpPnLmMlOmLkTJkKJkjQpjNqMKjkj%MjTMjnJkLlM%TJlJTkJkMkJTlJj%KkL%
14.28147CjKjmMl%UKkNnjLkJ%kjMJlLJk%jKnNj%TkLk%jMoLJTkjK%Tk%J%KnPJrLkLKlJj%TOo%KkL
14.23691Cj%kNkm%J%LljPknMkjTJKkjKLnJ%TJmLKkjNnKJk%J%LoKQqJkOmMnLKmlN%kL%kjTJ%nPjl
14.19296aLkJ%JkPn%WJ%JnLkLlLkj%ULlLk%jLlLlK%TkJ%jKjLnkOlKLmNplM%Jj%TMjk%UkPmKjUK%
14.14534Ck%TjLMj2PjoQm%LJl%TmJ0oMmKlL%Kk%MoJjKJlLnK%KLo%J%TL%ljMl%K%lJ%kKJjKjTKkJ
$$ plain form
14.10261 1 5 1 0 0 3 0 2 3 0 0 1 1 -1 4 3 0 2 -1 3 2 2 3 2 2 1 2 1 2 2 -2 4 0 0 4 -1 -2 1 0 0 5 0 5 0 -1 6 -1 1 1 0 4 0 1 0 0 3 1 0 0 4 -2 3 2 0 3 1 0 3 3 -1 0 1 -5
14.05866 -5 4 -1 -2 1 -1 3 2 1 -2 -2 0 1 0 0 -3 1 2 3 4 -1 1 2 1 1 8 -3 2 2 1 1 0 0 -1 3 -1 0 0 3 -1 -1 0 -4 1 2 -1 0 -1 6 2 1 -1 1 4 0 0 0 1 5 0 4 1 2 4 2 -2 0 -3 0 0 2 2 -3
14.01471 -3 4 0 2 2 -1 1 2 0 0 -1 -2 -4 0 1 0 4 -3 3 0 -3 2 0 -1 2 -2 0 0 -2 3 6 5 0 2 -2 -1 4 2 -3 3 3 0 4 1 1 2 1 5 0 3 0 2 2 0 0 -4 0 2 0 5 0 1 1 -1 4 1 0 4 4 0 2 0 3
13.97076 3 -1 5 3 1 4 1 2 -2 -3 4 2 0 0 0 4 0 2 3 2 3 -2 3 1 2 1 0 8 0 -1 1 -3 0 2 2 3 2 3 1 -3 1 2 -1 3 1 -4 1 -2 1 1 0 0 -1 0 1 0 -1 0 0 -4 0 1 2 0 1 0 -1 1 2 3 2 -2 0
13.92681 0 0 -1 0 0 2 0 3 2 2 2 0 3 1 0 1 3 0 4 -2 0 -2 5 -2 3 0 0 5 0 1 0 0 1 4 1 1 1 4 2 0 5 -1 0 0 4 -1 0 2 3 1 5 1 0 2 0 1 2 0 1 -1 2 1 1 -1 2 -1 4 0 0 -4 0 0 0
13.88286 0 1 1 3 1 1 3 -2 3 0 0 0 -4 6 -2 4 0 0 0 3 1 0 0 0 2 2 2 1 0 3 1 0 4 -5 2 -4 1 0 0 0 -3 3 0 0 1 -1 0 2 0 2 1 0 0 3 1 -2 0 0 0 3 1 1 0 -3 4 -3 0 1 1 -2 2 0
13.83952 0 0 4 -2 2 2 -1 1 0 2 0 1 0 0 0 0 0 -3 -1 0 1 -1 4 2 5 1 3 -1 2 0 1 0 -4 4 1 2 1 4 1 5 3 0 -1 0 3 -5 0 0 4 -4 4 -2 0 0 3 -2 5 -2 1 0 5 -2 0 0 4 0 2 1 2 1 1 -4 2 -1 -2
13.79435 -2 0 -1 3 0 1 -3 5 -3 2 0 1 -3 5 1 0 2 -2 -1 0 0 -1 0 0 -1 5 1 -1 1 0 1 3 -2 -4 2 2 -1 1 -1 -1 1 -3 0 5 -1 2 1 3 2 2 1 0 3 -1 1 0 5 6 -1 2 1 0 0 1 1 0 5 1 0 -3 0 3 -4
$$ packed form
14.10261AMmj%LlKJl%J%kNjlKlMj%Jj%jJjJ%mOm%MnjLj%NnNnjPpK%jMmJj%Lkj%MoNjkLkjL%mJTo
14.05866eRnjLkMjTl%KJj%lMJUnKJj%Pj1N%j%j%jMmJ%Lm%JmNJlJjPmjkKLm%TJMnMlJKkmKlL%K%n
14.01471cPmK%lKJk%jTkMJjMpOlTNkjLmK%kNLjnKmJNknO%lMl%JjMnLlK%k%mMKkNnJ%kNljM%mKkL
13.97076CmOkTLlJmjPkT%TMmKJjJnNkJjTQqjKmLK%JjJkmMJlMknNlL%j%jJTjTJ%mMJTkJjTKJTjmK
13.92681@%jJ%KkLj%TkLkjJKlMoKkPpNl%NnJj%JLl%TLkTNoJ%MnJKJkMmjKkJTkJkLj%kLlNm%mM%T
13.88286@J%Kk%KnNl%TmJ0qOm%TLkj%TK%TjTLkjMrPoNj%TlOl%JkJKkKjT%LklK%TLk%jlPpLJ%lMk
13.83952@%MoM%lKjKkJj%VlKJTkNkLmKmLkJjmQlJjLlMkljJLqN%MqQoK%LnPpLjNpK%MmKjJj%nOlj
13.79435bKjMlJmQqNkJmQmjKmJT%jJ%jOmkKjJKnkO%lKk%KmLNoLjKj%jTLmKjNJpLjT%J%jNmjlLTp
$$ plain form
13.75040 -4 0 1 1 -1 7 0 0 0 0 0 0 2 4 5 -3 3 0 0 6 4 -1 5 -2 -1 2 0 3 -2 0 0 1 0 -1 1 -1 2 0 4 -2 0 -1 0 1 1 2 0 1 0 -2 0 3 -3 2 -3 3 0 -5 -1 -4 1 1 2 1 3 -1 0 -2 2 3 1 1 1 -2 2 0
13.70462 0 0 0 -2 2 0 4 4 2 2 0 1 0 2 0 3 -3 1 0 0 3 -1 0 0 -1 1 0 1 3 0 1 0 2 1 3 4 -2 -1 2 -1 0 -1 -1 0 1 3 0 -1 0 -1 0 0 2 2 -3 2 1 1 0 6 -1 4 -2 4 1 -2 4 3 0 -1 2 0 1
13.66067 1 -1 1 1 2 2 -1 2 2 3 0 5 0 0 0 3 1 -1 2 2 1 0 -2 0 0 0 -1 3 -4 1 2 0 0 2 1 0 0 0 3 -3 0 1 2 0 1 3 0 2 -2 3 0 4 0 1 -1 1 0 3 -2 4 -1 0 0 -3 2 -1 2 2 3 -1 1 0 0
13.61672 0 2 0 -2 1 3 0 -1 4 0 2 0 5 -1 -1 1 0 -2 2 1 5 1 5 3 0 0 0 -1 2 0 2 -1 -1 0 0 -1 4 0 1 0 0 0 2 0 0 -1 4 -1 6 0 0 1 -1 3 -3 -1 3 -1 3 1 1 -1 0 -1 0 0 -2 1 3 -4 3 1 0
13.57277 0 0 4 -1 7 1 3 0 3 -2 3 -1 -2 2 1 0 5 1 0 -5 3 0 0 2 -2 4 -3 0 -1 4 2 1 1 0 3 2 -1 1 -2 3 -5 1 0 2 0 -1 2 2 3 0 0 0 -1 -1 1 -1 1 -1 3 0 3 1 0 0 4 2 3 1 0 6 0 3 -2
13.52882 -2 -3 0 0 -3 -1 5 0 1 -2 5 3 -2 1 -1 2 2 2 0 6 3 1 1 -3 0 1 -2 3 0 1 0 4 -1 0 5 0 -3 2 -1 4 0 0 0 -2 -1 4 0 1 0 3 -1 0 0 3 0 0 1 -4 2 2 1 0 0 1 2 0 4 2 -1 0 0 7 4
13.48487 4 2 2 0 2 1 2 -2 0 -1 0 0 0 2 -3 -2 0 0 1 1 0 0 2 -4 0 0 1 0 0 0 1 -4 0 0 2 3 0 -1 3 -1 2 0 -1 -2 -2 3 0 1 1 -5 2 -4 0 0 4 -1 0 2 -2 3 2 -1 -2 2 0 0 2 3 4 -1 1 0 0
13.44092 0 2 0 0 -2 0 -2 0 0 1 3 -1 -2 0 -1 0 -1 1 2 0 0 1 -4 -2 0 0 1 -1 -2 2 1 2 -1 3 -2 0 0 4 -3 0 -1 2 2 0 -2 2 -1 0 0 0 3 3 0 -1 0 -1 1 2 0 2 -3 2 -2 0 0 3 -1 0 1 3 4 -1 1
$$ packed form
13.75040dMJ%kQp%WKTJqOl%OknOpJLkLnK%JjTKkLkMoKjJT%JkJjkKLoNnOlnMlN%JjKmJkMJk%TlMk
13.70462@%TkMkM%k%kJjKkLoMj%LmJ%jKjJKlJjKjKJoJLlJj%JTKljJjJ%K%nNj%jOpNoOlTOjljLkJ
13.66067AkK%J%lL%JlNn%TLkTL%jTkK%TjMpNJk%KjT%TLoLJTkJKlKmNlMmJkKjLnOnJ%lNlL%JmKj%
13.61672@KkTLKljNmKkNo%KjkMjMmMkl%TjLkKl%J%jNmJj%TKk%jNnPo%JkMoKMmMk%kJjJ%kLKpPkj
13.57277@%MnQoKlLnNmjMjTNmjnQl%KmOpLjNkj%jLjlKlNqOjKkjL%Jl%Tj%KkKkMlLkj%MkJkjOoLn
13.52882bjL%lKOnJlPknLkL%TkOlk%mLJlNlJjMnJNnlNlNm%TkJNmJjLmJ%Ll%JnO%jT%JTkMklJ%Pl
13.48487Dk%kKjJmKjJ%TKnJK%J%j%KoM%Jj%TJnM%KJljMmLkjT%NlJ%oPoM%MnJKmNjljMk%KJTnKj%
13.44092@Kk%kKkK%JKmjKjJjKJk%JnKT%JkjMjJlMnK%MpLjL%kTMlJ%TL%ljJjKJkKnNmK%LmJTKJnK
$$ plain form
13.39697 1 -4 2 -1 2 2 0 -1 -3 3 4 0 0 1 2 2 1 2 -3 0 1 1 -5 2 0 1 1 -2 4 2 -1 -2 0 0 5 6 0 5 0 -2 -1 0 1 0 0 1 -2 0 2 3 1 0 -1 0 1 -2 0 -1 1 2 2 -1 1 1 0 0 0 -2 0 1 -1 -2 0 0 0
13.35180 0 -1 0 -2 -2 3 1 0 1 -2 2 -2 1 -1 0 0 1 0 0 -1 0 0 0 2 0 3 -1 0 0 0 -4 -1 3 -2 2 -1 -1 3 0 1 3 -4 -2 1 -2 -1 0 0 3 -2 0 2 0 1 -1 1 -2 0 -3 0 1 0 0 2 -2 3 0 -4 1 -1 -2 4 1
13.30785 1 4 -2 2 -4 0 -2 2 -2 -1 2 2 -4 0 0 -3 4 -1 0 0 -2 -7 -1 0 1 -2 0 0 -2 0 0 5 0 6 2 3 -3 -3 3 -2 1 0 5 -3 2 0 3 -2 0 -2 -1 2 -1 -1 3 -5 2 2 0 1 3 2 -3 0 -1 2 -1 3 0 0 0 3 0
13.26389 0 1 2 1 0 -2 -1 5 0 -3 0 2 -2 2 -5 2 -1 -1 1 0 2 0 1 2 0 -2 2 3 0 2 1 2 -1 2 -2 3 -1 -8 3 0 -1 4 0 1 -1 0 0 0 0 -1 0 1 2 -2 4 0 -2 -4 3 3 -2 3 -2 4 1 -1 3 -3 4 -2 -1 0 1 1 -1
13.21872 -1 0 0 -1 1 0 0 5 0 -3 0 0 -1 1 -1 3 0 0 -1 1 2 -3 0 1 0 1 -4 0 1 0 1 -2 0 2 -4 0 3 0 0 0 -1 -1 -1 4 -1 1 1 0 2 0 -2 -2 -3 -5 0 0 -2 -3 3 -7 -2 0 2 -2 -1 1 -4 1 -2 -3 1 2
13.17538 2 -1 0 3 2 0 1 -5 2 0 0 -1 -2 -4 0 0 1 2 -1 -1 0 0 1 1 0 0 3 0 0 -3 2 3 -1 0 -3 1 0 0 -4 -1 -2 -2 0 -2 0 -1 -1 3 -2 -1 0 0 0 -1 1 -2 -1 -1 4 2 0 2 -5 0 0 -2 1 -3 0 0 0 -1 -3
13.13143 -3 0 -4 3 1 -1 2 1 -4 5 0 0 1 0 -1 -1 0 0 -1 1 -1 2 0 -1 0 0 -3 2 -1 -2 0 0 0 -1 6 -2 0 2 -3 2 -2 0 0 3 -6 4 -2 0 1 -3 -2 -1 1 0 -2 -2 1 0 3 -1 0 -1 1 1 2 0 3 -2 2 -1 0 -3
13.08809 -3 5 -1 2 0 1 -3 -2 -5 1 1 -2 1 -3 3 -1 6 0 4 0 1 -4 0 -1 -1 1 1 -3 -1 -2 0 0 -5 2 -1 3 0 0 -2 0 -1 0 -2 0 0 0 0 -1 1 0 2 3 1 3 2 2 -2 0 0 2 -1 1 -1 0 2 -1 0 -3 3 0 1 0 1 -1
$$ packed form
13.39697AnOlL%kjkOJm%JT%jJnLJ%oPkJ%lOkljK%NJoNnkJUj%JlKTJkjTJTlKjKJ%lK%j%TkKJkjK%T
13.35180@jJk%NkjJlMmLkJ%Jj%jJ%TKkLmJ%TmLMnMl%MlJKpKLlJT%LnKTkJkKlKlLJj%KmNlmNkjOl
13.30785ALoMoMkMmJL%oM%lPnJ%knOJTlK%kK%NnOmJo%OnLjNqNkLnKkJLl%MqP%kJKjnLjLlMl%TLl
13.26389@JTjTkJOnlLKmMpPl%KjKkJTkTMJlKjJlLmNmpJ1ljNmJkJ%UjJUmOmkTP%nNnOlkMoPoJU%k
13.21872aJ%jKj%NnlL%jKkMl%jKJnLJjJnMJjJlKToMLl%Tj%TNnK%jKkT%jkN%kjOj0NKTmJKnNljMJ
13.17538BlJLjkJoPk%jTkM%JTl%J%J%j%Ll%lNJmJlMj%mLj%KkKj%MnJT%TjKlJ%NkTKpN%kLmL%Tjk
13.13143cLmPkTLjnRn%JjT%J%jKkLkjJ%lNljK%TjPqKTnNmK%LrJ0oKJmJTKjk%LjLmJjK%JkLnMlJl
13.08809cQoLkJmJlO%lLmOmPoMmJnMj%K%mKjK%nPlMl%kKjJkK%UjKjKJkKj%mK%KlKkJKlJlOlJjJk
$$ plain form
13.04353 -1 -2 0 -4 0 -1 4 3 4 0 4 0 4 1 -4 1 2 0 3 -5 1 0 0 -1 0 0 -2 0 0 -4 1 0 0 -3 -3 0 0 3 -1 0 -1 0 0 1 3 -1 1 0 0 -1 1 0 1 -2 1 2 0 0 0 -1 0 0 1 0 0 -2 0 -3 -2 -1 1 0 -1
12.99958 -1 2 -4 -1 0 -2 0 2 0 0 0 -3 -4 2 1 0 0 1 3 -3 0 4 0 -1 0 -2 0 3 0 -4 1 0 1 2 -5 1 -1 0 2 0 -1 2 -4 0 -1 1 -1 1 -3 2 2 -1 1 3 2 1 2 -1 2 -1 -3 -1 0 -1 0 -1 0 -1 -3 1 -5 -1 0
12.95563 0 -2 0 0 4 -1 -3 -3 0 -1 2 0 1 0 0 2 1 0 0 -2 4 0 1 -2 -3 -1 2 1 5 0 -6 2 0 0 -4 2 0 5 0 2 -1 0 -1 -1 -3 5 0 1 -1 0 0 -1 0 1 1 -3 0 0 4 1 0 4 -6 -1 1 -1 -1 2 -4 0 0 4
12.91229 4 1 -4 0 2 -2 2 0 4 -2 0 1 1 0 0 0 0 0 0 0 1 4 0 -1 5 0 -2 1 -2 2 -1 0 0 -1 0 -2 1 -2 2 -1 0 1 -2 0 -2 1 0 0 -2 -1 -2 4 1 -4 -2 -3 0 -1 -1 3 -2 2 0 0 -1 0 0 1 -1 0 -1 3 1 0 -4 -2 -4
12.86590 -4 1 0 0 2 -2 -4 1 0 -1 -1 0 0 0 -2 2 0 -2 1 1 -2 0 0 -1 0 3 1 -1 -1 0 0 0 -2 -4 3 -3 1 1 0 0 -2 -1 0 0 -1 0 -4 5 -3 -2 -3 2 -1 3 0 -1 3 0 -1 2 -2 2 0 0 2 -1 -2 0 0 -1 -2 0 1
12.82195 1 0 -1 -1 0 -5 2 0 -2 4 -1 5 -2 0 -2 0 -2 2 0 0 -1 0 0 -1 -1 0 -1 -1 0 -1 1 0 -1 -3 -1 5 0 0 2 -2 0 -1 -2 0 0 1 2 -3 0 0 2 0 -2 -1 -4 -1 0 0 -1 0 -3 0 1 -1 2 -2 1 2 0 2 0 4 -2
12.77800 -2 0 1 0 2 0 -4 0 0 -1 -1 0 -2 0 0 -5 -3 -2 0 3 0 0 -1 -3 -1 -1 1 2 -2 -5 1 -2 2 0 5 2 -1 0 5 1 -3 -1 0 0 0 0 2 0 0 2 1 -1 2 -4 0 2 0 0 1 -4 0 0 0 -3 2 0 2 2 2 -3 0 -2 -1 0
12.73344 0 -1 2 0 -1 -4 0 -1 0 0 -2 0 4 0 0 -3 -2 1 0 -3 0 1 2 -1 0 -4 1 -2 -2 -1 0 -1 5 0 3 -2 -1 -1 -2 0 0 -4 -3 -1 1 0 -2 -2 0 1 -4 2 0 1 -1 0 0 -3 0 -2 0 0 0 -1 0 0 -1 0 0 0 -1 2 -1
$$ packed form
13.04353ajKmMjNjJmMmMlnNJkLqOj%jJ%kK%mNj%l%L%LmJjJ%JKmKj%jKjJlLJk%TjJ%Jj%kKlJTKjT
12.99958aLoLJkKTk%TljOjT%JKoLMmjJkKLlmNjJTpOkJKkjLoMjKkKmN%lKTjTJlLlkKJjJjJjkMoMJ
12.95563@kK%Mnk%LjLkJj%KjT%kOmJljKLjMnoQk%mOkNnKlJj%kQnJkJ%jJT%mL%MljMj0NKk%LoM%M
12.91229DlnMKmMkMoKJ%j%XJLmjOnkLlMlJ%jJkLlMlJTlKkLj%kJjOlnKjLj%MnMk%jJ%JkJjMkjmKk
12.86590dNj%KmkNjT%J%TkMkTL%lK%jJLkT%J%TkTPoM%j%kJT%jJmRqJjNlMljMljLmMk%KljK%jTKJ
12.82195AjT%JnPkTOnOpKkKkMk%jJ%j%Jj%JjKjTkKOn%KmKjTK%JTnL%KkTJlLJ%jJlLJkLmLJkKkMo
12.77800bKJjKkmM%j%JkK%nKJKLl%jkK%KJmlOlMkNlTJNmTKJ%UKk%KjkLoMKk%JnM%TlNkK%TnLkJT
12.73344@jLkjlMjJ%kKMm%lJLjlLJTlJmNl%JTjOnLnJ%jK%mJKTjk%KJnOkJkJ%lLkK%TjJ%jJ%TjLl
$$ plain form
12.68949 -1 0 0 -2 -1 0 -2 2 -4 0 -2 1 1 2 0 -2 0 -2 0 2 -2 -2 2 -3 4 0 0 2 -2 1 -2 0 1 -1 -1 0 0 -1 -2 -2 1 0 -2 -3 3 3 -2 -3 -6 1 -1 1 -2 0 0 -2 -4 0 -4 3 0 4 -1 3 -3 0 -1 2 0 -3 0 -1 2
12.64554 2 -4 -2 0 0 2 0 -1 2 0 0 1 0 -4 -3 0 0 2 -2 1 2 0 0 4 0 -3 6 -4 0 5 2 1 1 -3 6 1 -1 -2 -1 -2 3 -1 0 5 0 2 0 -5 2 -5 -4 0 2 0 0 2 -2 1 -2 -3 0 -1 -3 3 0 -2 0 1 -1 -1 0 -5
12.60220 -5 -1 1 0 0 -1 -2 -2 2 -2 0 1 -4 0 -1 2 0 -1 2 -5 1 -1 2 2 -3 1 -1 4 -2 0 5 -3 2 2 0 -3 -1 0 -1 1 0 0 -1 0 -4 0 2 -2 0 1 -2 5 -2 -1 -1 0 -1 1 -1 -1 3 -2 2 -3 0 -1 -4 2 1 -2 -2 1 0
12.55825 0 0 -1 -2 1 -2 0 2 -1 2 -1 -1 2 -4 7 0 -2 -1 2 -2 6 -3 2 -1 -1 -2 2 1 -4 2 -1 5 -3 3 2 0 2 -2 4 -2 -1 4 -2 0 0 -1 1 0 2 -3 0 2 -3 -2 1 0 -1 -2 -2 1 0 2 0 1 0 3 0 3 1 1 2 1 0
12.51430 0 0 -3 1 -2 1 0 -3 -1 4 2 0 2 -2 2 -1 2 1 -1 4 0 -1 -1 -1 2 1 -1 -3 -3 -2 -2 4 0 1 -1 0 1 -1 3 0 -3 0 1 2 -1 2 1 0 -1 -1 3 1 1 0 2 0 3 -2 2 0 2 1 -1 0 -1 2 0 2 5 0 1 2 -2 -1 0
12.46913 0 -1 3 0 -4 -1 -1 2 0 0 3 -2 0 4 -1 2 -5 0 -3 -3 0 -1 1 0 0 2 0 2 1 0 0 0 3 -1 1 -3 2 -2 0 0 1 -2 0 -1 2 0 3 0 -2 1 0 -4 2 -2 0 0 0 0 0 0 5 0 0 -1 -2 3 -1 0 0 1 4 -1 0 0 0 0 -1
12.42273 -1 6 0 -1 2 1 -1 -2 -5 -3 0 2 -1 -1 0 -1 2 -3 1 -1 4 1 0 -4 4 0 1 0 1 0 0 0 0 1 0 -5 0 -4 2 -2 2 1 -2 2 -2 2 -2 0 -4 -2 -1 1 -1 2 2 -1 2 2 -5 3 -6 3 0 -1 -1 4 0 0 -2 1 -1 0 0 -4
12.37817 -4 2 0 1 3 0 -5 1 -4 -4 1 0 -1 -2 -6 2 -1 1 1 -2 2 4 4 0 2 0 0 3 2 0 2 -1 -2 2 1 0 2 2 -1 2 -5 3 -3 3 -4 0 0 1 3 -1 6 -1 6 2 -1 3 1 -2 4 3 3 3 0 3 -1 -1 2 -1 1 0 4 0 0 3
$$ packed form
12.68949aJ%kJTkMoMkL%JkTKkKTm%MnPm%KmLlKJk%J%jT%LjkjO%njlPkKlK%kTMmPlMnMoLjLklLjL
12.64554BoKT%KkjLk%JjmJL%KmLJk%MmlRj0MNlj%mRnkjJjNmJNnKknPpJMKk%KmLljLjkOlkKJk%Jn
12.60220eMKj%jT%MmKJnMjLkjLpOkL%nMkNoKNqN%klKJjKj%jJmMKmKJlPpJ%JjKk%MnMnLjlOjl%Lj
12.55825@%jTLlKTlLl%LoJ1pkJLmQrNl%jMjnOlOqOjkKmOoJNoK%jKjKnLKnJLjU%LjKkJjLlLk%JjT
12.51430@%lMlLjlKNkTKmMlLjkNmj%TLjkT%J%OmJkJTkMlTLJTlLjU%Mk%jKkLnMkKjkJjLkKLnJTmJT
12.46913@jMlmL%Lk%LnKMnLpNl%LjKj%KkKjT%TLmKmNmK%JlKjLkLlkLjmOmK%WNn%jTNmJ%JLnJ%Uj
12.42273aPojLjkjlKLKl%JjLnMkNljmQmJjJj%UJjnNmOmMjlMmMmKmKJKkL%lL%pQrRlj%Nm%kLkJ%m
12.37817dOkJKlnOn%NjUmQlK%lMK%mKk%LjkKljMjTK%lLpQoOpM%JKmPpPmlMklOj%TlLm%LlKjMm%L
$$ plain form
12.33361 3 0 3 -1 -3 1 -6 1 3 0 2 0 -1 1 2 0 1 0 0 2 2 0 -1 6 1 -3 2 2 0 0 -1 1 -1 2 0 3 0 -1 1 -3 0 3 0 -3 1 2 5 -1 3 -4 0 0 -3 5 0 -1 0 0 0 -2 3 2 1 3 0 1 0 -1 3 0 0 1 1
12.28966 1 -5 3 0 -2 -4 2 0 2 -1 0 1 1 0 1 0 -1 -1 1 1 -2 -1 2 -3 2 -1 2 0 4 0 0 0 -1 0 0 -5 2 1 1 0 0 0 1 -3 1 3 -1 -2 1 1 -1 3 2 2 -2 2 3 0 2 0 -1 2 0 -3 3 -2 -1 4 0 4 2 0 -1
12.24571 -1 0 3 1 -2 1 -2 0 1 0 0 4 0 0 0 2 -1 2 0 -2 4 0 3 4 4 3 0 0 2 0 7 0 5 1 1 1 1 0 2 0 2 0 3 3 -2 -1 3 0 0 1 3 3 0 -2 3 0 -2 1 0 0 0 1 0 4 3 0 1 2 0 5 1 -1 -2 3
12.20115 3 1 0 0 -2 -1 0 -1 5 -2 3 0 -3 3 1 -1 7 3 1 1 2 3 0 4 5 3 2 4 0 2 0 -1 2 0 -3 3 2 -2 5 2 2 2 1 2 4 0 4 4 2 4 0 4 3 8 3 7 1 4 3 3 3 4 4 1 2 0 2 -1 4 2 5 3 4
12.15720 4 2 2 -4 8 -1 6 1 0 2 5 2 1 3 2 2 2 1 0 4 5 0 5 0 7 7 4 6 5 5 5 4 6 8 5 8 3 4 8 6 10 3 8 7 5 1 7 1 7 7 9 7 11 2 2 5 7 10 5 5 7 6 10 9 8 12 7 9 10 12 10 10 10
12.11325 10 6 8 12 8 11 9 11 7 13 11 10 15 13 11 16 13 16 22 14 17 17 18 21 20 20 21 20 22 27 30 26 26 28 30 32 33 36 33 38 41 45 46 48 51 56 58 64 62 69 75 80 87 95 102 113 118 129 144 157 173 187 204 225
12.07479 225 251 279 312 350 389 440 497 560 627 694 758 814 857 876 885 868 837 783 723 657 599 527 470 412 366 323 285 256 224 204 182 165 143 135 124 110 102
12.05221 102 95 86 76 76 64 68 58 56 53 50 46 42 43 40 40 31 35 30 30 29 25 24 26 26 24 22 23 26 24 22 25 25 24 21 23 21 24 20 19 20 21 20 17 14 16 16 18 14 13 17 15 11 12 8 13 16 4 11 6 8 9 6 9 7 9 11
$$ packed form
12.33361ClLmkMpPKlKkjKJkJj%K%kjPnmN%k%jKkLkLljKmLTlTMJLoMpM%lQnjJ%TkNjTKlJjTMl%J%
12.28966AoQlkTOkKlJT%jJjT%K%lJLnNlLkMm%TjJ%nPj%j%TJmMKmjL%kMj%mMJlKkjLklOnJNmMkTj
12.24571aJLklLlKJj%Mm%TKlLkTOmLJ%jl%KkPpNm%UjKkKkL%nJMl%JK%lkNlkLj%TJjMjlJTkNmkjN
12.20115Ckj%kJTjOpNlTOkTQmk%JTlMJkjKmKkjLklOjmPl%TjJKmM%kKmMjNnMoLj%TJ%lJkKlNkLkJ
12.15720Dk%oJ2rPnjKLljKj%TjTMJnNnP%lKj%TjKTlLnJMkMpNjkmOoO%KkMr%LKLn%KjMjTMnKJKk%T
12.11325A0mKMmLkKmOkjNkTNlLOqL%JLj%JjKNLm%KUJLlNLMJKLNKOkPONPQPJ1NJ1J5J3J6J4J7K1
12.07479B25K6K8L3L8L9N1N7O3O7TO4N6M3J9Rj7l1n4o0o6n8p2n7n8m6m3l8k9l2k0k2j7k2qj1j4q
12.05221A02prj0%j2Mj0klTmTJl%rMn%jmjK%kTJLkTL%jlKkLmjJTjlTK%KmjMkmJmNLj2PnKJlLkKT
$$ plain form
12.01192 11 4 6 9 6 10 6 6 6 4 5 4 8 6 8 7 6 6 5 8 6 7 11 8 10 5 9 3 3 7 2 11 7 4 6 4 3 3 8 5 0 6 3 5 8 5 4 7 5 2 3 12 2 10 7 7 8 10 8 6 11 8 10 13 5 9 9 6 3 6 8
11.96919 8 9 9 7 5 4 4 8 4 5 4 0 6 5 1 2 2 1 4 3 -1 0 5 1 1 4 3 5 4 -1 1 4 2 3 4 0 5 0 1 3 4 3 2 1 5 0 0 0 3 4 4 4 0 7 1 4 1 2 5 3 2 8 5 0 0 1 4 4 4 0 1 9 0 0
11.92463 0 5 -3 2 7 0 2 2 -3 3 2 0 0 7 1 4 6 4 1 3 3 1 6 1 4 5 4 0 7 -1 4 3 7 1 4 5 0 2 6 -2 5 5 4 -1 4 1 1 2 3 0 3 -2 1 0 0 3 0 0 -2 1 1 2 0 0 4 -4 1 0 2 2 -1 3 -1
11.88068 -1 -1 2 0 0 4 0 5 2 -3 0 1 -2 0 0 1 0 0 1 1 5 -2 3 0 1 0 5 -6 1 0 1 1 4 1 0 3 0 3 3 0 0 0 -4 4 1 3 3 0 0 2 -1 5 1 3 3 0 -1 3 1 2 5 0 1 2 0 1 1 2 2 0 1 -3
11.83734 -3 5 2 1 2 6 1 3 3 4 0 0 2 1 0 6 0 4 -1 2 0 4 0 3 3 3 2 4 5 1 4 1 5 1 3 0 5 0 1 3 0 0 5 -1 4 3 4 5 3 1 0 5 4 3 6 2 3 0 4 0 2 1 0 6 1 -1 0 0 1 1 1 1 2 4
11.79278 4 1 4 1 3 0 2 2 0 2 3 3 0 2 4 0 4 -2 2 1 1 3 0 2 -1 0 2 0 7 -2 5 1 4 1 3 5 3 1 3 1 2 0 3 -2 2 4 4 5 0 2 5 1 2 5 1 3 1 4 4 2 3 1 5 1 0 6 0 6 5 7 0 5 2
11.74883 2 3 -1 0 5 5 0 3 2 2 5 1 1 3 1 6 2 1 4 6 3 3 4 5 4 4 4 4 1 5 0 7 1 7 5 7 3 6 3 4 5 3 3 4 1 11 7 4 6 6 2 9 6 7 6 4 4 0 12 3 8 11 5 9 7 8 8 8 3 6 8 8
11.70549 8 9 9 8 7 14 8 12 13 11 13 10 14 13 17 19 14 17 24 22 21 22 18 17 20 18 21 19 25 18 22 17 16 19 20 20 20 21 14 24 18 22 23 24 23 20 29 22 24 28 29 27 34 34 34 34 41 37 49 43 48 51 52 56 59 68 68 73 79 88 88
$$ packed form
12.01192A1pKLlMm%TkJjMkKjT%jLkJMlKnMo%MnRmlKkj%NlnOlKLljLklJRj0Ql%JKkTNlKLqM%lTLK
11.96919HJ%kTj%MmJjmOjmJ%jLjmJNm%LjKjnKLkJTmNnJKJjUMn%TLJ%TmPoLlJLkjOln%JL%TmJQr%
11.92463@NqNTpK%nOjk%PoLKklK%kNnLJjmPqNjMoLJnKMqP%jnNl%JTlLnLj%Ll%kL%Jk%MqNjK%lMm
11.88068a%Lk%MmNlnLJlK%Jj%J%MpNlJjNj1PjJ%LljLlL%l%TmQlK%l%KlOmK%ljMkJLnJTkJ%J%kJm
11.83734cQljJMnK%Jm%KjTOoMnLkMmL%TjKJmLlMmKlNnJKl%NoNjJTkTjNjTLmJlMmKjTOnkJ%J%UJK
11.79278DlLlKlK%kKJ%lKTmMoMj%KlKlJKkPrPmLlKTkTKkJkLnMK%JnKLmJLmKkL%kJkMmjOoOjKpNl
11.74883BJmJN%nLj%Lm%KkNmjLKl%JTj%UlMnPoOkKmLlJTk%JlJ0mlK%mPlJjk%mJ2rNLoMkJ%TnLK%
11.70549HJ%jTPoMJkKlMjMKnLPkjJmjLkLkOpMnjLJ%TJpJ0oMJTjlRpKMJkP%UPmJ2oNLJMLR%NOR%
$$ plain form
11.66276 88 106 108 122 132 144 151 171 187 202 227 242 274 304 338 375 425 476 540 597 670 734 796 843 875 884 868 845 800 745 683 617 555 493 437 384 341 301
11.64017 301 265 239 212 194 175 154 147 130 117 112 100 91 84 77 70 66 66 57 56 56 49 49 42 41 38 36 34 33 30 28 27 31 21 26 24 23 23 19 19 19 24 19 22 18 18 22 14 11 15 15 12 16 13 9 9 11 13 12 14 10 7
11.60294 7 10 14 11 11 6 9 12 7 7 7 8 8 8 10 10 10 9 10 4 10 6 9 6 10 4 6 12 7 10 10 13 11 8 7 6 9 10 8 10 7 8 4 6 3 3 9 8 7 8 4 7 6 8 2 3 6 1 5 2 5 6 2 6 1 4 6 1 6 6 4 4 2
11.55899 2 4 9 3 1 7 3 6 2 4 3 1 4 7 5 2 1 4 0 1 3 4 1 3 5 5 2 4 4 0 0 5 5 3 6 2 2 4 6 6 3 1 2 5 3 0 3 2 2 4 0 1 1 0 3 5 -1 4 -2 3 2 1 4 5 2 0 0 6 1 3 0 0 3
11.51504 3 4 -3 4 5 3 0 0 1 3 4 3 4 2 2 4 6 -2 7 4 0 3 3 3 0 4 2 3 0 3 0 2 2 2 4 0 0 5 2 2 -1 7 3 6 2 4 4 7 6 2 3 1 6 2 7 0 7 7 0 2 4 -1 3 1 1 2 2 1 0 1 1 2 5
11.47109 5 4 3 1 5 6 2 7 -1 5 8 4 8 7 8 10 8 9 8 7 9 6 6 5 6 1 4 0 8 3 4 3 6 1 1 5 1 1 4 -1 3 3 -2 5 -1 -4 5 0 -1 3 6 3 -1 3 1 0 0 0 0 0 0 3 -2 0 -1 0 0 0 1 4 1 3 3 2 7 0
11.42530 0 0 -1 -2 3 1 0 3 2 1 0 1 -3 0 3 3 0 -1 2 1 1 2 0 -1 2 1 0 4 0 2 1 2 0 0 1 -1 2 3 4 3 0 2 3 0 0 -4 1 0 -2 4 -2 0 2 0 -6 3 1 0 0 -5 2 3 1 1 2 -5 0 3 4 0 2 -2 2 2 2
11.38013 2 0 0 0 1 1 1 0 1 0 4 -2 1 -1 3 2 -2 3 0 0 3 -2 3 1 -3 5 -3 0 2 0 1 0 2 1 -1 3 0 -4 5 -2 5 0 1 0 0 -2 0 1 1 3 3 0 -1 5 1 -1 2 -4 4 0 0 0 4 0 1 7 0 5 1 1 0 3 2
$$ packed form
11.66276H8J8KJ4J0J2PK0J6J5K5J5L2L0L4L7N0N1O4N7P3O4O2M7L2Rj6k3m5n5o2o6o2Tn6n3m3m0
11.64017C01l6k6k7j8j9k1pj7j3nj2rpUm%rj%p%pjlkTjlkjMj0Nkj%m%TNnLm%MqlM%lMlm%KTjKml
11.60294GLMl%nLTn%TJ%TK%TjJoOmLlMoKOnL%LkljTLJkKlJmKl%OjTJmLjKoJLnMlLJmMnLKnN%k%k
11.55899BKNokOmLmKjkLTkljLmJKJlKT%lK%m%N%kLm%KT%lkJLklLj%KmJ%jLKoNoNjTLJlk%OnKl%L
11.51504CJpPJkl%JKJjJk%KTqRlmL%TlMkJlLlK%TKm%Nl%lQmLmK%LjmJkNmNpP%pKTnMk%J%jTJ%JL
11.47109EjTkMJmNqOLmMjJKkJjTKl%jJnLmQnJjLn%Mm%LnM%nPolRnjMLlmMkj%WLnKjJ%TJLlK%jNp
11.42530@%jTNkjLjUJmLT%ljLj%JkjLjTMmKjJk%JkLJTjlKJl%mNjkOoKTkoRkj%nPJk%JpNLJmKmM%T
11.38013Bk%TJ%TjJjMoLkMjmNl%LnNkmQqLKkJjKjkMlmRpPnJj%kKJ%K%ljOmkLoQm%TMmJOpNm%jLj
$$ plain form
11.33618 2 0 3 -4 6 6 0 1 0 3 1 3 0 3 1 -1 0 0 2 2 3 0 0 2 0 0 3 0 3 0 1 0 4 1 1 0 2 0 2 1 -4 2 -2 0 -3 0 0 -1 0 0 0 0 0 1 2 0 0 3 0 3 8 0 1 3 0 0 0 0 2 7 -3 1 3 -3
11.29162 -3 3 3 0 2 4 1 3 3 2 0 1 0 1 3 -2 0 3 -1 2 2 0 4 0 2 2 2 0 1 1 -2 -1 2 1 0 1 2 2 4 2 0 4 0 1 0 2 0 1 0 1 3 -1 3 0 3 0 5 3 1 2 0 1 1 5 2 0 4 5 1 0 0 1 0
11.24767 0 3 1 1 0 1 3 0 1 2 -1 0 1 1 3 -1 0 4 0 7 0 0 0 1 0 0 -2 1 2 0 3 4 -3 2 1 2 0 2 0 6 2 3 4 4 1 -1 0 1 2 0 3 3 1 3 2 0 -1 3 2 3 2 1 6 5 0 4 2 2 0 2 4 1 2 1 0
11.20250 0 1 1 2 0 2 -3 3 0 6 0 0 3 -1 2 1 5 -1 0 0 0 1 0 6 -1 1 -2 3 2 7 0 0 0 0 3 -2 5 0 4 1 7 0 3 2 0 -3 -1 0 2 4 0 4 0 0 2 2 0 1 0 -3 5 -3 0 -1 0 -1 -2 3 2 2 3 -3 1 0
11.15794 0 0 0 0 2 -3 -1 2 -1 -1 2 4 0 2 0 4 0 0 -3 4 1 0 3 0 2 1 -3 6 3 -1 4 -1 5 1 2 0 1 -2 1 1 0 2 1 0 1 0 0 2 0 3 -1 -3 0 2 2 1 -2 3 2 0 -3 1 2 1 3 3 4 0 3 -1 0 1 2 0 1
11.11277 1 0 -1 2 1 2 4 0 -1 2 0 0 3 3 -1 2 4 2 -2 3 0 1 1 1 0 0 1 1 -1 0 -1 -2 0 3 -3 5 -3 0 1 0 -1 0 2 -2 0 0 1 1 -2 1 2 0 1 2 -1 3 -2 0 3 -1 -1 0 2 1 4 0 0 0 3 1 0 2 3
11.06882 3 1 4 5 -3 1 4 0 0 3 0 -3 -2 0 0 3 -3 0 0 1 0 -2 4 -1 0 -3 2 0 -1 -1 3 -3 2 0 -1 0 3 -4 0 0 -5 2 -3 1 -3 0 -1 1 3 0 1 -2 0 -2 0 -2 4 0 -1 0 2 0 -1 0 0 -2 1 -4 2 -3 2 -2 3
11.02487 3 0 -3 5 -3 -3 2 0 1 0 -1 1 -1 0 -1 0 -1 -1 -1 0 2 -2 2 -1 2 1 1 -3 -3 -1 2 -4 -1 -2 0 5 1 0 2 -2 4 -2 0 1 2 0 -2 0 3 -2 1 0 2 0 0 5 -4 0 -5 1 0 1 -1 0 -1 0 4 2 1 0 -1 -1 1 0
$$ packed form
11.33618BkLpJ0%oJjLkKlLkTJ%K%Jl%Kk%LlLlJjMl%jKkKjnOmKlL%jJ%VJTk%LlLNqJKl%UKNj0MKo
11.29162cO%lKTlK%jkJjJKnKLmL%kMmK%TkJ%lJLjTJT%KkTMmJjKkJjJKmMlLlNkTJkJ%MlkMJmj%Jj
11.24767@Lk%jJKlJTlJT%KmJMmPp%TJj%kLJkLJpNjJkKkOmJT%lkJUkL%kKjkjMjJjTNjnMk%kKTlJjT
11.20250@J%JkKnOlOo%LmLjMoJ%TJjOpKlNjNp%ULnPnMlOpLjklKJKTmMm%K%kJjlQqLjJjTNj%JoMj
11.15794@%UKnKLl%LKmKkMm%lPljLlKjmRlmNnOmJkJlL%jKjTJj%KkLmkLK%jlNjklMJjK%JmLmJUkJ
11.11277AjTLjJKmjLk%L%mLKkmNlJ%Tj%J%kJjTKLoQqLJjTJKmK%J%lLJkJTlMnKLm%JKjLm%TLkjKJ
11.06882CkLJqMLm%LlTJK%LoL%JjkOnJlNkj%MoNkjJLpM%nPnMmLjKTlJlKkKkOmjJKkjJ%kLnOnNmN
11.02487ClTQq%NkJjTKkJjJj%TJKmMlLj%m%KLoLjKNmjKmOoKJTkTKLnLjKk%NrMnOjJkJjJMkjU%Kj
$$ plain form
10.98031 0 0 0 3 0 1 0 1 0 2 -2 -2 -2 0 0 1 0 -2 -2 -1 0 2 -2 1 -2 0 -1 -2 5 0 0 -1 -1 1 0 0 0 0 0 -2 0 3 0 -2 0 0 -4 1 0 1 -3 2 -3 1 -1 2 1 -1 -3 1 -1 0 1 3 0 -1 1 -1 0 0 -1 3 2 0 -2
10.93513 -2 2 1 3 -4 -2 1 -5 0 0 0 -4 0 0 0 -1 -1 1 0 2 -2 3 0 -3 0 0 -1 -3 1 -1 0 -1 -4 -2 0 -2 0 0 0 -4 0 1 -3 2 -4 3 0 0 -2 -1 -1 1 -4 2 -5 1 2 0 -5 0 1 0 0 -1 2 1 0 -4 3 -3 -2 -2 -4
10.89118 -4 -2 5 -2 3 0 -2 -1 -2 -4 2 0 4 -7 0 -5 -3 -4 0 -5 5 1 1 1 0 -3 2 -1 -3 -1 -6 5 -4 1 -1 0 -5 -4 1 -6 2 -5 -3 -3 0 0 3 -2 4 1 -1 2 -2 -2 -2 -6 0 -1 -3 0 -3 1 -2 -1 -2 2 2 0 0 -1
10.84907 -1 0 -1 -1 -1 0 -3 1 -4 2 -2 -4 3 -1 0 0 3 -2 -1 -2 -2 1 -3 1 -1 -1 1 -5 0 0 2 0 -3 -3 -1 -1 0 -1 0 0 0 2 0 -4 0 -3 0 -3 -2 -3 -1 0 0 -1 0 -4 -2 -1 -2 -4 1 -3 -4 0 1 1 -2 -2 3 -2 0 1 -1
10.80511 -1 0 1 -2 0 0 -1 -5 0 0 -2 0 0 -1 0 3 -3 -4 1 -2 0 -5 0 -1 -3 1 -3 2 -1 -2 0 0 -3 1 -2 -1 -3 0 0 0 -1 -5 0 0 0 0 -1 -1 0 0 0 -1 -2 1 -2 -3 -1 -2 0 0 1 0 -1 0 0 2 -4 2 -3 0 -1 0 0 -2
10.76055 -2 -2 3 -3 1 -5 0 -2 3 0 1 -1 -3 -1 -1 0 -1 0 2 0 1 0 0 -2 -1 -2 -2 -2 1 -2 4 -1 -3 6 -2 0 0 -1 -2 0 -1 -2 0 -3 1 -3 4 -2 0 -2 0 -1 -2 0 0 -1 0 0 3 -3 4 -1 1 -1 -1 0 0 0 1 0 0 -2 0
10.71660 0 -2 0 0 0 -2 0 -4 -1 0 0 0 -2 4 -1 2 0 0 -2 1 -8 2 -3 2 -2 -2 0 0 1 4 -5 4 0 1 0 -2 0 0 0 1 2 -1 -2 -3 -1 -3 -4 0 1 0 -6 3 0 -3 -2 1 -1 -2 -1 2 -1 2 -2 3 0 0 -3 -1 -6 0 -1 0
10.67326 0 0 -3 -2 2 -3 0 -2 0 0 -2 -1 2 -4 1 0 -1 0 0 1 2 -6 -1 -3 0 0 -3 -1 1 1 0 -3 1 -3 -1 -2 0 -2 -2 -3 1 -4 2 0 -3 -1 -1 0 -1 -4 -1 -1 -2 0 0 -2 -1 -5 3 -1 -1 4 -3 -4 -1 -4 -1 1 0 -8 2 -2
$$ packed form
10.98031@%TLlJjJjKm%TK%Jjk%JTKmLlKjTPn%j%Kj%VkKLlkK%mNjJmNnMkLjkTMkJTKljKkJ%jMjkT
10.93513bMjKpKLoN%TmM%Tj%KjKmNlTL%jkMkJjlKTkK%TmMJmNoPl%kJ%KnOpOJknNJj%jLjTmPoJ%k
10.89118dKPpNlkJjkOkMj1PnKjMnJ0m%TjlNlkKnJ1rNkJnJNpQpK%L%LnOlkLm%TmOjkLlMlJjM%k%j
10.84907aJj%TJlMnOmkPmJ%LnJj%LmMk%KoN%Kkl%K%JjJ%TKkmMlLlJjKJ%jJmKJjkNmjMJ%l%NnKJk
10.80511aJTlK%jmN%kK%jJLojNlKnNjkMmNljK%lMlJkL%TjmN%Uj%J%TjTLljKjK%JjTJ%KoOnLjJ%k
10.76055b%NoMoNkNlJkTK%JjJKkJj%kJj%TLlOnkRqK%jTKjTKlMmPoKkKjTK%jJ%LoPnKk%J%TJj%kK
10.71660@kK%TkKmLJ%TkOnLk%kLrJ0nNm%K%JLrRmJjkK%TJTljTKkjMJjoRlTJLkjJLlLmNl%lKnOjJ
10.67326@%lJMnLkK%kJLoNjTJ%JTqNkL%lKT%jlMmKjKk%jMnOklK%JjlL%jK%kJmQm%NpjLlLKjqJ0m
$$ plain form
10.62992 -2 -2 1 -3 0 -3 0 1 -5 0 -2 -2 -1 -2 -4 -1 -3 -2 -3 -1 -3 -4 -5 -3 -1 0 -2 2 -1 -4 1 -3 -3 -1 -2 1 0 0 -1 0 -2 1 1 0 0 0 1 1 -4 -3 -2 -1 -1 1 1 -1 0 0 -5 -1 -2 -2 -1 1 0 -1 0 -2 0 0 0 0 1 0 -2
10.58475 -2 -2 -1 1 -3 0 0 -3 -1 -2 -2 2 0 -2 0 -1 -2 -1 0 -1 -2 0 0 -2 -2 -2 0 0 1 -3 -2 0 1 2 -1 -4 1 0 1 -3 -2 -1 -2 -3 -3 -2 0 2 0 0 1 1 -4 0 -1 2 0 -3 0 4 -1 0 0 -2 -4 3 -4 -4 2 -3 -4 0 -2
10.54080 -2 -2 0 -3 3 0 -2 -3 -3 2 -2 0 -2 -4 -3 -1 -5 2 1 -3 -1 -5 1 -1 -3 -5 -2 -3 -1 -4 2 -1 1 -1 0 -3 -3 -1 -2 -2 -1 -3 -2 -1 -2 0 0 0 0 -3 1 -3 -1 0 -2 0 -1 0 -3 5 -7 5 0 0 -5 -2 0 -4 -1 -5 -1 -1 -1
10.49685 -1 0 3 -3 -1 2 -1 0 -1 -1 -1 0 -3 0 0 1 0 -1 0 -5 -1 -2 -5 -3 -6 -2 -1 -4 1 -6 -1 -1 -2 -8 -4 -2 -3 1 -2 -5 -2 0 -3 2 -3 -3 0 -3 3 0 -1 0 0 2 0 -1 1 -5 0 -2 -1 -5 -3 -5 -6 -9 -5 -2 -2 0 -1 -1 0
10.45290 0 0 0 2 -4 0 -5 -1 0 -3 -2 0 -3 -1 3 -2 -1 -1 -1 -3 -2 0 1 -2 0 2 -3 -1 -2 -7 1 1 0 -4 -4 -1 0 -4 2 0 -4 -1 -1 -3 0 -5 2 -1 0 -4 0 -4 0 -3 -2 -3 -3 0 -3 0 -3 -1 0 0 -3 -2 -1 -2 -1 -1 0 1 -3
10.40895 -3 -1 4 -3 -2 -2 -6 -1 -3 0 1 1 -1 -4 0 0 -1 -3 -3 1 3 -1 -1 -2 -3 0 0 -1 -2 -1 -1 -2 0 -5 -1 -1 -1 -1 0 -3 -2 -4 -5 2 -1 2 -5 -3 -2 -3 -2 -1 0 -2 -3 -1 -2 2 0 0 2 -4 0 -3 3 -2 -2 0 0 0 -4 -3 -2 0 -2
10.36378 -2 -5 2 0 -1 -1 0 -2 0 0 0 0 -1 -2 1 -4 -2 1 -1 -1 1 -6 -3 0 0 -3 -1 0 0 0 1 -3 0 -1 -1 -3 -4 -1 -1 0 -1 0 -2 0 2 1 -3 2 -3 0 0 -1 -5 -1 -2 1 -1 -1 -1 -3 2 0 -3 -2 -2 -2 1 -6 -5 0 0 -2 -1 -1
10.31922 -1 0 -3 2 -1 -1 -4 -1 -1 -3 -1 0 -2 -4 -2 0 -2 -1 -3 -1 0 -3 -2 -4 1 -4 -1 0 -1 -2 -1 -3 3 -2 -1 -1 -1 -1 -5 1 -3 0 0 -2 -1 0 -3 2 0 -1 -3 0 0 -5 -1 -6 2 0 2 0 -2 -1 0 -1 -4 -1 2 0 -4 -1 -2 0 3 -3
$$ packed form
10.62992b%LmLlLJoNk%JjkLkJjKkjTKTJkMlTNm%KjLj%jJkL%j%TJ%nJU%K%kJ%nMj%JKjTJkK%UJjk
10.58475b%JKmL%lKj%MkTKjTJTjTK%k%TK%JmJKJTlTNjJmJTjT%JKTk%J%nMjLklLMnJ%kTPp%OnjMk
10.54080b%KlOlkj%NmKkTJKmPjmKmOkULjKlOlKkJl%Kj%JkJTjK%UlMmKJkKjJlQj2J2n%nLKmLmM%T
10.49685aJLoKLlJj%TJlL%JjTJnMjlKlMJlNpN%joMKjMlTLKlNn%LlOljJ%KkjKoNkJmKkjlML%Kj%J
10.45290@%TKoMnMJlJKlKMnJ%TkJKJlKTnKjnQ%jm%LJmOkmL%kLnPlJmMmMlJj%LlLlKJ%lJTjJ%JTm
10.40895cKNpJ%mNkLJ%klM%jk%MKm%jTL%jTJ%jKnM%UJlJkjPlLpKJjJUkjKjMk%KoMlOn%K%TmJTKk
10.36378blPkj%JkK%UjTLnKLk%KpLT%lKJ%TJmLj%kjL%JjJkKTjmNnL%jmMjLk%TkNklJ%TLpJN%kJ%
10.31922aJlNl%lL%kKJkTKTkJkKJlJkNnLJjTJkOnJ%UmOmL%kJTlNkjkL%nMnQkKkTJTjlLTkmLjKLo
$$ plain form
10.27466 -3 4 0 -3 -5 -2 -1 -1 1 -3 0 -4 2 -3 -1 -2 -1 0 1 -3 0 -1 -1 0 0 -1 1 1 0 0 -2 -1 0 0 -2 0 -5 -6 -2 0 -1 -2 -3 -5 -1 -3 -3 0 -3 -2 -2 -1 -4 0 -2 -1 0 2 -3 0 -2 -1 1 -8 0 -1 -1 -3 -4 -2 -1 -5 0 0 0 0
10.22888 0 2 -2 -2 0 -5 0 -6 3 -3 0 -1 -5 -2 -3 0 -1 -2 -5 -3 0 1 -2 -1 -3 0 -2 0 -3 -5 -3 -3 0 1 0 0 -4 0 -2 -3 -2 0 0 0 -4 1 -4 1 -1 1 -3 -1 -2 -5 -2 -1 -1 -2 -2 -1 -6 0 -2 0 -3 0 -3 -3 1 -1 -1 -1 1
10.18493 1 0 0 -3 -3 2 -5 0 -1 1 -4 0 -3 4 -4 -2 0 0 -1 -1 -3 2 -4 0 -4 -2 -1 -2 -1 -2 -5 1 -2 2 0 1 -4 -1 -6 -1 -5 1 -1 -4 1 -4 0 0 -2 1 -2 -3 0 -2 -2 -5 2 0 -1 0 -3 0 -5 0 0 -2 -5 -4 -4 0 -5 -1 -5
10.14098 -5 -3 0 -1 0 -1 -1 0 -1 -3 1 -6 0 -2 -5 1 0 -5 -2 -5 -2 2 -3 -2 -2 -3 -2 -1 0 -2 -4 0 -1 -1 -2 0 -4 -1 -1 0 -2 -1 -1 0 -4 -7 0 0 -1 0 0 -4 0 0 -2 2 -2 -2 -2 0 -1 -3 0 0 -2 -1 -4 2 0 -4 2 0 1 -2
10.09641 -2 0 -1 -2 -2 -2 -1 0 0 -1 0 0 -1 -1 -2 -1 -1 -1 0 -3 0 0 -3 -2 2 -1 0 -3 -2 0 -3 -5 -1 -2 1 -3 -1 -3 -3 -3 -3 -2 -5 0 0 -4 0 -1 -2 -3 0 -2 0 -5 0 -3 -2 -2 -1 2 -1 -2 2 1 -6 -4 0 -2 -1 0 0 -7 -1 0 0 0
10.05063 0 -2 -3 0 2 -2 5 -1 0 0 1 -7 -3 -2 -2 -2 -1 -1 0 -4 1 0 2 0 -4 -1 -1 1 1 -7 -1 -4 4 -5 -1 -2 0 -2 -2 0 -2 -2 -5 -2 -1 -4 -4 -3 -4 3 -1 -3 1 -2 -3 -2 -3 0 -1 -4 1 -2 0 0 2 -1 4 -3 1 -5 -3 -2 0
10.00668 0 -3 0 2 0 -4 0 -2 -1 0 -2 0 -2 -7 2 -4 -1 -3 -4 -4 -4 -1 0 -3 0 0 -3 -1 0 -1 -2 -3 -1 -3 -3 -5 1 -1 0 -4 1 -2 -3 0 -1 -2 -5 0 -2 -5 1 -4 -6 0 -3 -4 0 -3 -4 -1 0 -7 -1 -5 -2 -1 -1 0 -1 0 1 -1 -3 -1
9.96212 -1 -3 2 -3 1 -2 -4 3 -4 -3 -1 -3 -6 -2 -2 0 -5 0 -4 -1 -1 0 0 -4 -3 0 0 -1 0 -3 0 -3 0 -2 -2 -5 0 0 -6 1 -9 0 0 -2 0 -2 -2 -4 0 1 -2 1 -2 -3 -1 -4 0 0 0 -8 1 -7 0 0 0 -4 1 -2 -4 -5 0 -1 -2
$$ packed form
10.27466cPmlkLJ%KmLmOnKjJUmLj%J%jK%j%kJT%kKnjMKjUkMk%LlJ%JlMkJTKnLkJKrQj%kjKJmN%U
10.22888@Km%KnNoRoLjmLjLjTlKLJlJkLkKlkK%LJj%mMkjJK%TmNnNkKmKjlLJ%j%JnOkKlLl%Mk%TK
10.18493Aj%l%NpNjKnMlPqKT%j%kNoMmKJjJjlOlMkJnLnNmOklNnM%kLljLk%lPkjJlLnN%klJ%MnMm
10.14098eKLjJj%JjkMpOklOjnLlLMnJ%jJUkTMj%jKmL%JkJ%JmlP%jJ%mM%kMm%TKjkL%kJlOkmOkJl
10.09641bKjT%TJT%jJ%j%jJ%TJlL%lJMlJlJKlkMjLmKk%UJlN%mMjULkKnNlJ%JLljMjpKMkJT%pOJ%T
10.05063@kjLKmPoJ%JqMJ%TJ%JmNjKkmL%K%qOlQrMjKk%Kk%lLJl%JjPmkMljJjLjlNlK%KlNpMoKJK
10.00668@lLKkmMkJTkKknRoLkj%TLJlL%lKJjUKk%kOkJmNljLjTlNklOnkOljMljLJpOmLJ%JjJTkTK
9.96212akNnMlkPpJKklM%KnNmL%J%mJL%jJlLlLk%lN%oPj0R%kKk%kMJlLljKlM%TqRqP%TmNlkjNjT
$$ plain form
9.91817 -2 1 -5 -4 4 -2 -2 -3 -1 -2 -2 6 -1 -4 -2 -2 0 3 -2 -2 -3 -2 -4 -1 -2 -3 -2 -2 -3 -1 -4 -4 -2 -1 -2 0 -1 -3 -4 0 -3 -1 2 -3 0 1 -4 1 -1 2 -2 -3 -3 -2 -2 0 0 -2 -2 -3 1 -7 0 2 0 0 -4 0 -1 -5 -2 0 -4
9.87422 -4 -2 0 -3 -3 -5 1 -3 1 -6 -2 0 -1 1 -3 0 0 1 0 -3 0 -6 -2 -1 0 -1 -1 0 -4 -1 -1 0 -1 -4 1 -1 -5 0 -3 -1 -1 -2 -1 0 -2 -1 -3 2 -6 -2 -1 -5 1 -6 0 -4 -2 -4 -4 0 -4 -1 0 -4 -1 1 -1 -3 -2 -1 0 -4 0 4
9.82966 4 -2 -1 -4 -3 -3 -1 -2 -1 -1 -2 -1 -5 -1 -1 -4 0 -3 0 1 -3 0 -3 -3 0 -1 -2 -4 2 -1 -3 -3 0 -2 -3 0 0 -6 0 -4 0 -2 -5 -3 -1 -4 0 0 -3 0 -2 -1 0 -2 -1 -3 -3 0 -4 2 -2 -1 -5 2 -3 -3 1 -2 0 0 0 -4 0
9.78571 0 -5 -3 0 -6 0 -3 -2 -2 -5 -2 -7 1 -3 -2 0 -3 0 -2 0 -2 0 -2 -1 0 -3 -6 -2 -2 1 -2 -1 0 2 -2 -7 0 -1 -4 -1 -1 -6 1 -4 0 2 -2 -2 -2 0 0 -4 0 -4 1 0 -4 2 2 -5 0 -2 0 0 -1 0 -3 0 -4 0 0 -6 -1
9.74176 -1 0 0 -2 0 -3 -2 0 -3 0 -2 -1 0 -6 0 -4 -3 -2 -2 -3 -2 -1 -2 0 -1 -2 0 -1 0 -1 0 -1 -3 -3 -3 0 -2 -1 -1 -6 -3 -1 -4 -1 0 -5 -2 -2 0 1 0 -2 1 -2 -1 0 -4 0 2 -1 -3 0 -3 -1 0 -1 -2 0 -4 -2 -1 -4 -3
9.69781 -3 -3 -3 -1 0 -3 -3 0 -1 -5 -1 -3 1 -2 0 1 -1 1 0 -2 -3 -2 -2 -1 -4 1 -3 -2 -1 1 -3 0 0 -2 0 -5 0 0 -1 -3 3 -2 1 -3 -3 -1 0 -1 -2 -1 0 -2 -5 -4 -5 4 -7 0 -2 2 -2 -1 -3 -4 -1 0 -2 0 0 -4 -1 -1
9.65447 -1 -2 0 -1 -3 -2 1 -6 0 -4 -2 0 -1 -2 -2 0 -4 -3 -4 -5 -2 0 -3 0 -1 -2 -4 -2 -3 1 -1 -1 -5 0 -1 0 -2 1 -4 0 -1 -2 0 -2 -3 -1 -3 0 2 -3 -2 -1 -1 -3 -2 0 -2 -4 -1 0 -6 -2 0 0 0 -4 0 -3 -2 0 -1 -2 -1
9.61052 -1 -3 -1 -1 0 -3 0 0 -2 -2 -2 -5 -1 -7 -1 2 -3 -2 -1 0 -3 0 -1 0 0 -3 -1 -3 -1 -3 -1 -8 0 -2 -2 -3 0 -10 0 0 -3 0 0 -3 3 -2 0 -4 -2 -4 -2 -2 -3 0 -3 1 -1 0 0 0 0 -4 0 -1 -1 0 -1 -1 0 -5 -1 -2 0
$$ packed form
9.91817bLoJQo%jKj%QplK%KLn%jJkLjTJ%jKl%KJjKjkjMlKLnLJnNkLmj%J%K%k%jMqPKk%mMjmLKm
9.87422dKTl%kOmMpMKjKmL%JjlLoMJTj%JmL%JjlNkmNlK%jJTkJkNqMJmOpOmKk%MmLJmLKkTJUmMT
9.82966DoJlJ%KjJ%jJmM%lMlLJmLl%LjTkOlk%LkjL%oOmMklKTlM%lLkJTkJk%LmOmJmPn%MlK%TmM
9.78571@nKLoOlJ%lLnQmJKlLkKkKkJTlTM%LlJTKmnPjlL%nPnMKm%TK%mMmNjmO%pNkK%jJlLmM%oN
9.74176aJ%kKlJKlLkJToOmJT%jJTjKjTKjJjJjk%TLkJ%nLKlLJnL%KJjkLlJTmMKlkLlKJjTKmKJlJ
9.69781c%TKJl%LjmMkMlKJkKjkjJ%JlNmJTKmL%kKnN%jkOnLm%KJjTJTklJjRj1PkMmJkjLJkK%mL%
9.65447ajKjkJLpOmKTjT%KmJjTLKlLjTkKjMk%mNjJkLnMjTKkjKkLKnJT%kJKkTLJoMK%TmMlJKjTJ
9.61052akK%JlL%k%TlMoOLnJUlLjJ%lKkKkKpQk%jLj0J0%lL%lOnKmKkK%jLlMkJ%UmMj%Jj%JnMjK
$$ plain form
9.56657 0 -3 0 -1 -1 2 -3 -2 -2 0 -1 0 -3 -3 1 -2 -6 0 -3 -1 -1 -4 -2 -1 0 -3 -2 -1 0 -1 -2 0 -2 1 -4 1 -5 -2 0 -1 0 -1 0 0 1 -6 -4 -3 -3 -2 -7 0 0 -2 1 -2 -2 0 -2 0 -4 0 0 3 -3 -1 -1 -2 -1 -1 -1 -2 -3 -1
9.52201 -1 -4 -3 -3 -2 -3 0 -1 0 -1 -1 -3 -1 0 1 -3 -3 -4 -4 1 -3 0 -1 -3 -3 3 0 1 -2 -1 -1 -4 -1 -1 -2 -1 -3 -4 0 -4 -1 -4 1 -3 0 -2 -3 2 -2 0 0 -4 0 0 -6 -1 0 -5 1 -5 -5 0 -1 1 2 -1 0 -3 1 -6 0 0 -1 -2
9.47745 -2 1 -1 -1 -3 0 -1 -2 -2 -3 -3 -3 0 0 0 -2 -1 -5 -1 0 0 0 0 0 -4 -2 0 3 -2 0 -1 -4 -4 -5 0 0 -2 0 0 -2 -2 -3 -6 0 -7 2 -4 2 2 -2 2 -2 -1 1 -3 -1 2 0 -3 -5 -6 0 -3 -1 0 -1 -2 -3 -5 0 -8 0 -7 -1 -2 -2 -2 -2
9.43044 -2 0 -1 -4 -1 -1 0 -3 -5 0 -2 0 1 -1 -3 -3 -1 -1 -1 1 -2 0 -1 -1 -3 -1 -3 -1 -1 0 -7 0 0 -4 1 0 -4 0 1 -1 -3 -3 -2 0 2 -2 -2 0 -2 0 -2 0 -1 1 -1 -4 -3 1 -5 -1 -1 0 -1 -1 -4 0 0 0 -2 -2 0 -5 0
9.38649 0 -2 0 0 -4 -2 -2 -2 0 -4 0 -2 -2 0 -6 -1 0 -1 0 -1 -2 -1 3 -2 -4 0 0 -1 0 -3 -7 0 -1 0 -4 0 0 0 -2 0 0 0 0 -2 -2 -4 -2 -2 -2 0 0 -1 1 -3 0 0 -5 -2 -2 0 -2 0 -2 -1 -1 0 -4 3 -3 0 2 -4 1 -3
9.34193 -3 1 -2 2 -5 -5 -3 0 -2 -2 -2 -3 0 -1 -1 -1 -2 -2 -1 1 -3 0 -2 0 -4 0 -2 0 -1 -3 4 1 0 1 -6 5 -2 0 -3 0 1 -1 -3 0 0 2 -5 1 -4 0 -2 -2 -2 -3 2 0 -2 1 -2 0 -3 0 0 -2 2 -1 0 -1 0 -1 0 3
9.29859 3 0 0 -3 -5 0 -4 0 -2 -4 -2 2 -4 -4 0 -6 -2 1 -2 0 -4 2 -1 -6 0 -3 -2 -3 -1 0 -2 0 -1 -1 -1 0 -2 1 -1 2 -3 4 -3 -3 0 -4 0 -5 0 -2 -1 -1 -5 -1 -5 -1 2 -4 1 0 -1 1 0 -4 -3 0 0 -7 3 -1 -2 -1
9.25525 -1 -6 -2 3 -5 1 -2 0 -3 0 0 -1 -3 0 -3 -4 1 -5 -2 -1 -6 -1 0 1 1 1 -1 -2 -2 -4 0 -2 2 -1 1 -2 -4 -3 0 -2 -2 -1 -3 0 -4 -1 -3 -1 -4 -1 -1 3 -5 1 -4 0 -2 0 -4 0 -3 0 1 0 -2 -1 0 -2 -2 -3 0 -2 0
$$ packed form
9.56657@lLj%LnJ%KjJl%MlmOlK%lKJTlJUjTKkLnNoLKjJjJ%JpKJ%JnP%kLl%KkKmM%LoK%jJ%TjTK
9.52201alJ%JjLjJj%kKJTm%j%NmLjk%OlJlJ%lL%jJkjMmLlNmLkjNmK%mM%oNJnOo%NjKJlJlMpO%jT
9.47745bLk%kLjT%j%TL%TkJmMJ%VmKTLnKjl%jN%kK%k%jlOpRoO%mMmJKmKLklkjOlKJjUkNqQpOj%U
9.43044bKjlL%JlkNkKJkT%K%TKlKj%kKkK%JpP%mNjmMJkT%JKTm%KkKkKjKklJMoM%Jj%lM%Tk%KnN
9.38649@kK%mK%TKmMk%KoNJjJjTJMnkM%jJlmPjJmM%TkK%Uk%kK%TK%jKmL%nL%KkKkJ%JmPoLKoNm
9.34193cMlMp%KLk%TjLj%Tj%JKmLkKmMkKjkPljJpJ1pKlLJkTL%KpOnMk%TjNkTLlKlL%kMlJjJjJL
9.29859Cl%lkNmMkTKMo%MoMLlKmOlnOlJjKJkKj%TJkLkLnPp%LmMnNkJ%mMmMLoNjTKjmJL%pJ0mjJ
9.25525anMNqOlKlL%jkLljNoLJnNJT%Tkj%kMkMlKlkJLk%JkLmLkKlL%MqOnMkKmMlLJjkJTk%jLkK
$$ plain form
9.21130 0 -2 -3 0 0 -2 1 -1 -1 -3 -1 0 -1 0 0 -5 0 1 -4 -1 3 -5 0 0 1 0 -1 -2 -2 2 0 1 -1 -3 -2 -2 -2 -3 -3 -1 -4 1 -6 1 1 -3 -2 -1 -1 2 -3 0 0 -3 1 -1 3 -3 -1 -4 1 0 -4 -2 0 -4 -1 0 -1 -2 -3 -1 -1 -3 2
9.16613 2 -2 0 -4 1 -2 -2 -1 -4 1 0 -1 0 -2 -4 0 -1 -2 2 -3 -3 0 -3 -7 -2 -2 -2 -3 0 -5 -1 -5 -1 0 0 1 -2 -3 -1 -3 1 0 -1 -4 0 -4 -4 1 1 -2 1 -4 -1 -1 1 -3 0 2 -2 2 -7 -1 -3 -1 0 -2 -1 0 0 -1 0 0 1
9.12218 1 -3 0 5 -4 1 -4 -3 0 0 -1 1 0 -4 0 -2 -1 -2 -2 -2 -4 0 -2 -3 -1 -3 -4 0 -2 -3 -2 1 -1 -2 0 -5 1 -5 -1 0 -6 0 -2 -1 -3 0 0 -3 -3 -2 -2 -2 -3 0 -3 0 -7 -1 -5 0 -7 -1 -2 -3 -3 -4 -1 -3 -1 0 0 0 0 -2
9.07762 -2 -1 -2 -1 0 -6 0 -2 -2 0 -2 -2 0 0 -3 -1 -3 2 -2 -1 -1 -1 0 0 0 -2 -4 0 0 -1 -6 4 -5 0 -1 -1 0 -4 -4 -2 -3 6 -2 -3 0 0 0 -3 1 -4 1 -2 -1 -3 -2 -4 3 -3 -3 0 -3 2 -1 0 1 2 -2 0 -3 1 0 -3 0
9.03367 0 -1 0 -1 0 -1 -1 1 -2 0 1 -3 -3 2 0 2 0 -1 0 5 0 0 -5 3 0 -4 1 0 -1 2 -2 -1 1 -1 0 0 -1 -1 2 -2 -1 -2 1 -3 0 -3 0 0 -2 -2 -3 0 2 -4 1 1 -3 -3 0 0 -5 2 -1 1 0 -3 1 0 -3 3 -1 0 -1
8.98972 -1 -1 -1 -1 -3 -1 1 -3 0 0 -3 0 -2 4 -1 0 -3 0 0 2 0 -4 3 -1 3 0 0 1 1 -2 5 1 0 3 6 -1 3 0 -1 -1 -3 0 0 1 0 2 -3 0 4 0 0 -2 1 0 2 -3 0 0 0 -1 3 0 -1 0 3 0 2 -1 0 1 0 3 5 0
8.94516 0 0 1 1 3 3 -6 1 0 1 0 -1 -1 -4 0 0 3 0 0 -4 -2 1 -1 1 -5 0 0 -1 -5 -5 -3 0 -3 2 0 2 0 0 0 0 0 1 0 -1 1 0 -2 -2 0 -1 -1 -2 -3 -1 -2 -2 0 2 -2 -3 0 -1 0 -2 0 1 1 -5 0 0 0 3 0 -4 -2
8.89999 -2 -3 2 2 0 -1 1 1 -2 0 -1 1 2 -3 0 3 -2 0 1 -5 0 -5 1 -2 -1 3 0 2 2 -4 -1 3 1 2 1 0 0 -4 -1 6 -2 4 -2 2 0 0 0 3 1 -4 -1 -3 -2 2 1 0 3 0 -1 3 -1 -3 3 2 0 0 0 -2 1 -1 0 -2 0
$$ packed form
9.21130@kjL%kLk%kKJjJ%nNJnLMqN%JjU%MkJkTJ%Tj%KlNpP%mJT%LnL%lMkMoKlNjmKTmLJjUK%kN
9.16613BmKmNl%JlNjTJkTMjTMn%LlmN%TjLnMmMJ%JljKkMjTlMm%N%lLnL%KmLKmMrOkKJkJT%jJ%J
9.12218AmLNrNnJL%jKjmMkJj%TkMkjKkjMkjJLkjKnOoMJoOkJkL%l%J%TjLlLpOmNpOjT%jLkKJ%Uk
9.07762bJjJToOk%Kk%K%lKkNmJ%TJ%TkTM%jnJ0rNj%Jm%KjRqjL%TlMnNlJkJkPo%LlNlJUmKlMjlL
9.03367@jJjJj%KlKJm%NkKkjJNn%nQlmNjTLmJKkJ%j%LmJjLmLlL%k%jLKoN%m%L%nPlKjlMjlOmJj
8.98972a%UkKTmL%lLkOnJlL%KkmPmMl%J%lPmjLTpMlj%kL%JjKnLMm%kLjKnL%TjMljJLlKlJTjLKn
8.94516@%J%K%rPjJjT%lM%Ll%mKLkKoN%jm%KLlNkKk%VJjTKjk%Kj%jTKj%KTmjLjJkKJ%oN%TLlmK
8.89999bjN%kjK%lKjKJnLTnKJoNnOlJMlK%oLMkJjT%mLPqOoMk%TLknLkJMjTLljMmkOjk%TkLkJkK
$$ plain form
8.85604 0 -4 1 0 1 -1 2 -1 -2 7 1 0 0 0 0 0 4 0 3 -2 2 1 1 -2 -3 3 2 1 0 2 0 5 0 0 2 1 0 -2 1 0 3 2 1 -1 0 0 -1 0 -1 3 -3 -1 3 2 -1 5 1 0 1 3 0 0 1 3 2 2 0 2 1 4 -1 1 4 0 -2 6
8.81026 6 -1 4 0 1 0 3 0 2 -1 0 2 5 2 5 0 0 0 0 2 3 -3 3 1 5 0 2 -5 1 1 0 2 -1 1 2 0 2 1 0 0 0 0 1 4 3 0 4 -1 2 1 3 3 3 0 4 0 1 3 2 3 4 1 7 -4 5 3 -1 5 2 5 3 1 5 4
8.76569 4 4 2 6 0 6 4 6 2 5 5 5 5 1 8 7 4 6 4 7 0 6 6 5 5 3 9 8 6 7 7 3 13 5 6 4 9 5 10 8 7 8 12 11 7 11 5 16 9 12 14 13 14 15 16 14 18 16 26 16 26 24 25 31 27 36 35 37 42 49
8.72358 49 49 50 60 59 71 75 83 98 101 122 141 165 196 233 273 313 360 398 443 473 503 518 525 530 519 495 472 434 399 353 306 274 234 201 177 150 130 117 106 99 94 93
8.69794 93 86 87 90 93 91 98 97 105 109 122 135 151 172 203 231 266 314 356 401 447 485 512 531 547 548 540 523 504 467 427 387 339 293 249 213 176 153 128 106 91 75 67 60
8.67169 60 56 43 44 35 35 32 27 28 27 23 23 21 19 20 10 16 16 14 13 14 10 12 13 13 13 10 11 14 13 10 9 11 7 10 10 6 10 10 13 7 11 6 9 11 8 10 13 11 10 15 8 7 12 11 12 11 12 9 9 8 8 9 9 4 8 7 8 9 10 10
8.62896 10 8 9 7 7 13 9 9 13 7 12 10 9 7 10 8 7 13 4 12 11 12 7 11 13 6 10 8 5 9 8 6 6 10 2 7 6 6 7 6 7 7 11 4 4 11 5 5 9 3 6 8 6 5 8 4 5 8 8 1 1 4 3 4 2 0 2 1 0 0 5 0
8.58562 0 8 0 0 2 3 2 4 0 5 2 4 0 1 0 0 6 0 6 1 3 1 1 2 5 3 5 1 2 1 2 1 4 2 0 1 0 1 2 2 1 2 0 -2 1 -1 3 -1 1 2 6 -1 5 0 -3 0 1 3 1 2 -2 3 2 0 2 5 0 4 4 1 4 0 2
$$ packed form
8.85604@mNjJkLljRoj%VMmLnMj%ljOjUKkNn%KjTkLjLjTkJ%jJjMoKMjlOmjJKl%JKj%kKjLnKLmkQ
8.81026FpNmJjLlKlJKLlLn%UKJoOkMnKpO%jKlKJkKjT%UJLjlMnLjK%TlMmJKjJTlOj1RkmOlLkTMj
8.76569D%kMoOkKmL%UmPjlKkLpO%j%kOjkJ%mJ0qJkNmNkjJMjmMoJ1pLKjJUkMkJ0j0J0kJOmRjKNP
8.72358D9%JJ0jJ2MQJ5LK1J9K4L1L7M0TM7L8M5L0TJ5PNj1k4k3l8l5m6m7l2m0l3k4k7k0j3j1pnj
8.69794I3pJLTkPjQMJ3TJ6K1L1K8L5M8M2M5M6L8K7J9J6Jqj7j9l7m0Tm8m6m4l6l7k3k5k2j5j6qp
8.67169F0mj3Jr%lnJjm%kTJj0O%kjJmKJ%TlJLjljKmL%mM%LoMnLKlKLkjNpjNjJjJl%j%J%nMjJU%
8.62896A0kJk%Om%MoNkjkLkjOrQjJnMKpMklMjk%MqNj%JjJ%Mp%Po%MoLKkjLmJL%p%LjJkTKjT%Nn
8.58562@Qq%KJjKmNlKmJj%OoOnKk%JLkKmJjJjLkTJjJT%jJkTLkMmKJMpOnlLJKkJmNjkKLnM%lLmK
$$ plain form
8.54167 2 2 0 4 2 1 5 3 6 1 6 6 6 7 3 4 7 7 5 6 6 3 3 8 6 8 7 3 1 7 3 5 4 1 6 4 3 2 1 6 2 7 2 3 2 1 2 2 5 4 0 6 -1 4 6 2 4 8 9 4 11 3 5 14 2 8 4 4 6 6 3 4 4
8.49772 4 5 5 3 5 0 2 3 3 0 3 2 2 4 2 3 5 -1 6 2 0 5 0 7 1 2 4 0 6 8 4 7 8 6 9 12 12 14 13 6 11 11 9 6 10 3 6 7 7 7 6 3 6 4 6 4 3 7 4 7 4 2 4 3 8 1 2 4 7 0 5 0 4
8.45377 4 4 4 7 2 6 2 5 5 8 3 5 3 8 4 12 1 9 6 6 8 8 9 6 9 2 6 5 3 9 7 4 5 3 4 2 3 3 6 1 3 1 3 3 4 4 5 4 5 4 8 6 8 7 5 3 5 7 3 5 6 8 4 7 7 5 8 7 8 7 8 3
8.41043 3 5 8 6 8 8 6 7 5 7 0 13 3 6 9 1 10 3 6 7 9 7 9 8 4 8 5 7 7 5 5 10 7 9 9 5 14 11 6 10 8 10 10 8 13 9 9 12 10 7 10 10 12 12 11 11 11 11 18 12 22 19 21 16 23 20 22 23 28 22 28
8.36770 28 27 29 33 30 30 34 34 30 31 38 34 39 37 44 44 49 51 55 63 67 67 82 81 94 100 118 124 141 155 178 200 231 269 320 370 432 505 599 685 781 856 928 984 1037 1060 1071 1061
8.33901 1061 1037 993 933 852 765 677 590 511 441 371 318 265 225 187 164 142 124 110 98 85 79 74 66 61 58 51 49 44 47 40 41 38 29 36 34 33 29 32 28 25 30 24 31 25 28 30 25 24 30 28 33
8.30788 33 31 32 31 29 29 29 30 25 24 28 28 28 27 29 27 28 29 28 29 31 29 34 35 35 42 41 38 41 48 49 52 54 62 71 73 82 87 96 109 117 132 142 159 175 196 228 255 293 334 383 447 513 588 670 746
8.27431 746 814 878 942 980 1007 1017 1006 981 938 883 815 741 663 583 509 448 380 336 282 247 213 184 160 142 128 115 102 93 80 77 74 61 59 59 48 49 44 42 39 36 36 35
$$ packed form
8.54167B%kMkjMkLnN%TJmJL%kJ%l%NkKjmkOmKjlNkjUNmNnJjTJ%LjmOpNKmKMJnPqKRj2Om%K%lJ%
8.49772DJ%kKnKJ%lLj%KkJKoPmkNnPoJKmOKmLJkLT%KjpN%klMpLJ%TjlLkKkjMlLlkKjNpJKLpNnM
8.45377D%TLnMmL%LnKkNmQj1Ql%K%JlLpMjkOklJkJkJ%LnKkK%J%JjJjMkKjkTKTmKJKmL%kLjJjJn
8.41043CKLkK%kJkKpJ3j0LTqRpLJKkKjmMlK%k%NlK%mRlnMkK%kNm%LklL%K%j%UPoJ0lKnPlKJNoO
8.36770B8jKMl%M%mJPmNkP%NKMQM%J5jJ3OJ8OJ7J4K3K2L1L8N1N0O2P3R4Q6R6P5P2N6N3K3J1j0
8.33901A061k4m4o0q1q7q8q7p9p0Tn3Tm0l8k3k2j8j4j2j3onqnlpknLpJlrPkjmLmlNoPoLKnjOkN
8.30788C3kJjk%TJnjM%TjKkJTjJKkNJ%PjlLPJLKQRKRNRJ3QJ5J0J7J6K1L2K7L8M1M9O4O6P5Q2P6
8.27431G46O8O4TL8K7J0j1k5m3n5o8p4p8q0p4o1o8m4n4l5l4k9k4j8j4j3Trj3lTj3k%j1JnklT%j
$$ plain form
8.24867 35 32 30 26 31 24 27 26 28 26 29 18 22 21 26 19 23 21 17 21 16 18 21 25 19 19 23 19 22 21 20 23 21 21 25 26 23 29 25 28 27 27 33 35 34 38 39 43 42 52 53 57 63 68 74 78 86 98 104 128 148 178 216 261
8.21021 261 313 361 412 464 504 543 573 585 593 587 564 535 497 441 398 338 291 249 212 174 151 133 119 104 101 92 92 89 87 84 86 92 87 97 99 102 111 127 138 162 190 223
8.18457 223 270 325 377 435 487 535 575 597 622 615 612 587 554 518 461 412 353 299 249 209 172 141 119 99 82 75 60 60 54 46 46 39 38 40 36 31 31 33 30 27 29 23 27 23 21 22
8.15649 22 19 18 21 19 17 17 13 14 12 15 10 14 14 13 7 14 8 13 10 10 10 12 8 16 19 11 16 13 13 15 13 13 14 17 14 13 14 10 10 16 11 15 12 11 12 8 10 9 11 8 7 11 10 6 8 7 9 8 8 9 9 7 7 9 7 6 4 10 4 4 4
8.11315 4 8 9 6 7 7 9 7 5 1 5 7 5 6 4 3 6 1 9 7 5 5 5 3 4 5 5 2 6 9 0 10 9 5 2 5 4 8 4 4 3 4 7 8 7 8 9 10 1 10 7 8 9 7 7 10 10 9 7 7 11 8 14 9 7 10 12 5 10 4 8 8 6
8.06920 6 7 7 2 8 4 2 10 2 4 8 7 2 6 5 5 7 5 4 4 9 6 3 4 5 7 6 3 5 3 3 9 2 7 2 2 0 2 6 5 1 2 4 3 2 4 7 2 4 6 0 0 1 1 5 6 4 4 1 10 3 7 7 2 4 1 4 2 5 3 5 3 5
8.02525 5 5 7 0 4 4 3 8 4 4 2 0 6 6 5 6 11 8 8 6 9 6 9 6 6 9 7 10 7 8 10 7 9 6 5 8 11 5 6 2 6 6 8 6 3 1 5 3 2 6 3 3 0 4 10 3 6 3 2 9 4 5 4 6 4 4 4 5 6 4 2 5 3
7.98130 3 5 1 5 6 0 4 0 5 1 2 3 9 0 2 5 2 4 2 4 4 3 4 5 7 5 4 7 2 9 2 5 5 4 11 8 6 4 5 7 6 2 7 3 7 6 3 7 5 2 5 4 6 3 4 6 6 4 6 -1 4 8 4 6 1 7 5 4 6 9 9 7 11
$$ packed form
8.24867C5lkmNpLjKkLj1MjNpMkmMnKLMo%MmLjTLk%MJlOmLj%OKjMJMjJ0JMONOMQJ2OK4K0L0L8M5
8.21021B61N2M8N1N2M0L9L0J2Qok3k9l8n6m3o0m7m2l7l8k3j8j4j5lr%lklKOnJ0KLRJ6J1K4K8L3
8.18457B23M7N5N2N8N2M8M0K2K5plk5l3l6n7m9n9n4n0m0l7l1k2k0j7pj5%oq%pjKmn%KlTKoMmkJ
8.15649B2ljLkT%mJkLnM%joPoNl%TKmQLqNl%Kk%JLljJm%OnMljJmKjKljMjmKjKj%J%k%KkjkOo%T
8.11315DMJlJ%KkTmMKkJkjLnQkT%TkJT%lMLrJ0jmlLjMm%jJLJjJUrRlJTk%L%jk%MlOnkLKpNoM%k
8.06920FJ%nOmkQqKMjnMj%Kkj%NlTJTKjlKk%OpNn%kKMjmJKjTKLnKTo%J%MJk%lRpM%nKlLkLkKkK
8.02525E%KpM%jNm%kTO%jJNl%kLlLl%LkLlJKlKljLToJmM%KklkMkjMl%lMOpLljPnJjKk%TJTkTLk
7.98130CKmMJoMmNmJTOrKLlKkK%jJTKkjLnPpL%jPlkTJKjmNmMjlMklLjKlJK%kKpNMmKnOkjKL%kM
$$ plain form
7.93735 11 8 7 9 4 6 7 7 10 8 5 4 8 6 3 6 5 4 10 6 4 5 4 3 6 3 4 4 10 7 10 10 8 8 11 8 12 8 10 11 11 11 6 9 8 5 8 9 3 9 6 4 4 0 4 1 5 3 4 3 4 4 4 5 8 5 3 8 3 5 7 1
7.89401 1 4 4 5 7 7 7 9 4 7 7 2 5 8 7 14 12 5 3 6 6 7 6 4 8 6 1 2 7 1 6 2 0 2 3 2 8 2 2 3 6 -1 5 1 2 6 2 5 4 3 3 6 2 4 3 4 2 6 4 3 3 1 3 3 5 -1 7 0 2 3 3 2 4
7.85006 4 3 2 5 1 4 7 4 7 3 0 3 4 0 0 4 2 8 0 5 4 2 3 4 7 4 2 1 1 6 2 4 0 4 0 3 5 3 1 8 5 5 7 4 6 2 1 6 1 3 7 2 5 5 3 2 3 3 6 -1 0 6 -2 5 2 0 4 2 2 4 6 6 6 6
7.80550 6 2 5 2 5 1 3 3 4 5 6 4 4 5 4 8 2 6 4 7 4 1 1 5 1 5 5 5 4 5 7 1 7 3 0 8 8 6 8 4 4 4 3 5 5 9 5 7 4 7 4 7 10 3 6 7 5 11 5 4 6 5 5 4 12 2 9 2 1 5 3 5 7
7.76155 7 12 5 11 7 4 8 10 2 6 5 5 8 8 1 9 1 11 6 7 7 5 6 7 10 6 4 9 8 7 10 8 11 5 8 11 4 16 5 9 10 13 14 12 7 11 11 10 12 10 12 15 8 12 10 11 8 10 11 14 9 10 14 13 11 11 11 12 17 12
7.71943 12 14 14 13 21 14 17 22 16 23 18 21 26 29 28 31 29 34 36 36 46 49 49 56 59 65 69 77 79 88 102 110 125 155 190 236 300 361 413 466 517 559 582 606 608 596 571 533 467 407 341
7.68891 341 287 242 200 163 139 122 104 99 90 83 81 83 82 84 84 87 95 93 99 103 110 115 126 139 159 176 211 258 333 407 481 549 616 681 732 754 773 769 745 725 680 616 538
7.66266 538 477 419 372 342 337 333 364 404 448 488 536 586 633 657 655 637 616 579 527 459 388 334 272 231 198 162 137 120 103 100 90 86 80 79 79 77 79 81 88 90 93 95 106
$$ packed form
7.93735A1ljKnKJ%LkljMklLjTOmkJjTLlJ%OlL%k%LlMmKJ%TnLjlLJoOlk%mMlMkJjJ%TJLlkNnKTo
7.89401AL%JK%TKnL%nLTjPkpkL%JjkMknJNoNmkKJjOo%JLpOmJMmLjT%LmKjJkMkj%kK%KoQpKJ%jK
7.85006DjTLmLTlLmlLJm%MkOqNjkJTLlkj%NmKmMmLKkTPl%KlKmjNnKMnL%kjJ%LpJOqPlkMk%KT%U
7.80550FmLlLmK%JUk%JjMoMkLlT%MmM%TjJKoOmlQ%kKm%TjK%MmKlLlLTpLJkOojKj%jQj0PpjMkKT
7.76155GNpOmlMKqMj%L%pQqJ0nJ%kJTLmkNjTLkLoLTpJ2j1MJLJknM%jKkKLpMkJlKJLnJMjk%TJNn
7.71943A2K%jQpLNoPnLNLjLkNK%J0L%PLOMQKRJ4QJ5L0L5M6O4O1N2N3N1M2K3K4Kj2k5l8o6o0o6
7.68891C41n4m5m2l7k4j7j8nrpkKjK%LQkOMPNJ1J3K0J7L5M7P5P4TO8O7O5N1K2J9mk4k0m5o4p8
7.66266E38o1n8m7l0nmL1M0M4M0M8N0M7K4kj8k1l7n2o8p1n4o2m1l3l6k5j7Tlj0moj%kKTPKLKJ1
$$ plain form
7.63641 106 109 122 133 151 181 216 263 342 421 491 555 626 699 749 768 758 734 701 662 607 523 441 366 296 245 198 165 129 110 91 79 69 68 56 56 45 42 43 44
7.61261 44 37 38 35 37 28 30 34 30 31 26 27 30 34 27 33 34 34 31 32 30 27 31 26 29 25 23 23 22 24 19 25 19 22 22 23 23 24 23 24 23 26 21 28 21 25 23 25 20 24 21 22 21 19 19 18 20 18 22 14 16 18 19 17 19 15 23 17 19 16 16 20
7.56927 20 18 18 19 19 20 16 17 18 16 19 16 19 16 22 14 16 19 16 15 16 21 17 14 13 18 21 14 16 15 19 15 15 17 13 21 16 15 17 16 18 18 18 18 18 18 19 16 15 19 15 21 18 14 15 15 13 19 15 11 18 12 20 15 18 21 14 10 19 20 16 22 14 16 16
7.52410 16 18 17 19 15 21 16 20 16 21 21 21 18 20 21 21 19 20 24 15 21 17 17 19 19 18 18 16 25 17 21 19 22 17 25 22 20 20 20 23 20 20 22 22 23 19 22 24 24 22 24 23 26 22 24 25 19 24 25 23 23 27 22 24 27 25 33 26 26 30 34 31
7.48076 31 34 37 38 45 41 43 44 45 49 53 50 60 62 69 74 80 94 115 141 179 220 257 284 292 304 326 339 350 340 311 274 239 203 180 152 136 116 94 91 82 81 78 82 76 82 82 85 91 94
7.45085 94 103 101 113 122 134 154 174 209 253 315 388 452 492 519 553 598 637 644 630 589 552 519 483 443 389 332 283 240 203 175 152 132 117 106 101 93 91 91 91 88 92 92
7.42521 92 97 99 99 108 109 119 130 142 160 186 225 279 337 382 404 416 420 441 462 476 467 434 413 402 413 428 425 409 388 383 386 401 407 377 333 294 257 222 193 170 146
7.40018 146 130 114 106 101 97 96 99 91 97 94 96 100 105 104 115 122 132 140 162 183 224 275 349 418 464 494 517 560 610 644 655 626 585 556 524 500 451 389 338 284 243 214
$$ packed form
7.63641A06LJ3J1J8L0L5M7P9TP0O4P1P3N0J9j0k4l3l9n5q4q2p5p0n1m7l3l6j9Tj2j0jj2%j1lJT
7.61261D4pJlKrKMmJnJLMpOJ%lJklMnLmk%jKnOoL%J%JjJjLnPpMkKnMlJjk%jKkMqKTJkKmQoKl%M
7.56927B0k%J%JmJTkLlLlOqKLljJNmljNLpKjMm%KmQnjKjK%WJljMmOlmJ%kOmTPoQnLTpmRJmOqK%
7.52410A6KjKmOnMmN%TlKJ%kJMrOm%K%j%kRqMkLnQlk%TLl%K%JmLK%kKjLmKJoNJk%MnKLkQp%MTl
7.48076C1LTJPmKJTMTlJ0KPNOJ4K1K6L8M1L7K7QJ2K2J3J1j0k9l7l5l6k3k8j6k0k2lrjlMoO%LOL
7.45085I4RkJ2RJ2K0TL5M4O2P3O4M0K7L4M5L9Pj4m1l7l3l6m0n4n7m9m3l7k8k3k0j5j1nqk%TlM%
7.42521I2NK%RJJ0J1J2J8K6L9N4N8M5K2J2MK1TJ4rl3k1j1J1J5lj6k1nLJ5Ol0m4l9l7l5k9k3k4
7.40018A46j6TqnmjLqOlKMNjJ1PJ0QK2K1M1N1P4O9M6L0K3M3N0L4J1k9m1k9l2k4m9o2n1n4m1k9
$$ plain form
7.37454 214 184 165 145 132 123 125 118 117 115 117 119 123 124 132 135 143 149 170 187 218 251 314 386 477 573 653 687 699 706 735 766 784 761 687 600 521 450 384 321 274 228 194
7.34891 194 164 150 138 128 119 116 117 114 115 119 123 121 134 137 142 159 168 196 230 278 328 371 403 441 489 538 576 590 585 575 571 562 548 494 440 379 327 282 241 202 173 148
7.32327 148 125 112 101 90 89 87 82 83 82 77 78 80 83 84 84 93 99 113 126 145 178 213 240 258 256 260 261 275 282 274 255 222 196 163 138 123 103 89 76 66 54 50 47 40 41 38 40 38
7.29397 38 38 34 33 38 32 36 31 33 32 28 29 29 30 24 27 27 24 24 25 28 25 25 26 25 26 26 23 27 29 32 28 31 31 36 34 38 39 37 43 42 44 43 47 43 50 46 50 47 51 49 52 51 55 60 56 66 72 74 87 98 111 134 168 213
7.25490 213 275 328 360 370 378 392 422 441 428 393 342 295 258 218 194 165 133 121 107 99 91 86 82 86 81 86 85 85 93 93 103 104 111 119 136 154 176 205 256 314 377 428
7.22926 428 466 517 578 627 642 637 622 610 602 562 501 431 369 311 258 223 184 155 132 112 100 94 92 88 85 81 78 78 76 75 81 78 81 83 90 101 107 120 144 180 223 268 289 289
7.20240 289 292 298 317 329 316 286 245 209 177 151 135 105 86 73 64 55 51 45 44 40 34 35 32 30 33 27 28 28 28 29 33 33 28 31 28 27 28 28 30 27 30 24 22 22 23 19 22 21 20 20 20 22 19 23 20 15 21 18
7.16700 18 21 17 19 23 15 20 12 20 18 20 18 18 19 18 17 22 17 19 16 18 20 12 17 12 17 13 15 18 15 16 17 18 21 14 16 19 15 12 17 16 16 18 13 17 19 17 20 16 16 18 19 12 16 13 17 17 15 19 16 13 12 15 13 9 16 8 11 18 13 10 13 14
$$ packed form
7.37454B14l0j9k0j3rKpjkKTMJQLQOK1J7L1L3O3P2R1R6Q0L4J2PK9L1J8k3p4q7p9p1o6o3m7m6l4
7.34891A94l0j4j2j0rlJlJMTkJ3LNJ7RK8L4M8N0M3L2L8M8M9L8J4nj0mrj4n4To1n2m5m1l9k9k5
7.32327A48k3j3j1TjknJjnJKLJ%ROJ4J3J9L3L5K7J8kMJJ4Pqj9l3k6l3k5j5k0j4j3j0j2mlpJlKk
7.29397C8%mjNoMnKjmJ%JoL%l%JLl%JjJ%lMKLmL%NkMJkOjKjMmPmMlMkLjMNmJ0OKJ3J1J3K3L4M5
7.25490B13O2N3L2J0QJ4L0J9j3l5n1m7l7m0k4k9l2j2j4qTnmMnNj%Q%J0JPQJ7J8K2K9N1N8O3N1
7.22926D28L8N1O1M9J5nj5j2qm0o1p0o2n8n3l5l9k9k3k0j2okmlml%kjOlLKPJ1OJ3K4L6M3M5K1%
7.20240B89LOJ9J2j3l0m1l6l2k6j6l0j9j3rTmojmoJlkLoJ%TJM%nLljJ%KlLok%JmLjT%TKlMlnOl
7.16700A8LmKMqNqQkKk%JjTNnKlKTqNnNmKLlJULpKLmlNj%KnMKkLm%KJpMlM%kMlTjLkmPqLPnlLJ
$$ plain form
7.12305 14 12 11 13 12 12 15 11 17 13 8 12 14 16 11 11 12 12 13 13 15 11 13 18 10 13 11 11 13 15 12 7 9 9 11 6 13 9 13 8 6 15 10 12 15 12 11 9 14 15 18 14 12 13 10 7 16 15 11 8 10 14 10 12 13 11 12 9 9 8 13 9
7.07971 9 9 11 10 12 10 7 7 8 7 8 12 9 11 14 11 11 10 12 10 9 12 10 16 10 13 12 9 12 7 10 8 10 11 8 9 13 7 9 12 8 9 9 6 11 11 10 7 14 10 8 7 11 10 8 9 12 11 9 13 12 12 12 10 9 10 13 7 9 5 10 10 12
7.03576 12 8 8 10 8 12 9 6 5 7 8 11 6 7 7 9 9 3 8 8 6 7 6 6 4 4 3 6 4 7 9 9 5 6 7 6 9 5 8 7 5 9 6 4 7 6 6 10 7 8 10 5 7 7 7 9 8 5 5 5 5 9 6 6 6 6 6 6 5 9 0 12 7 7 3
6.99059 3 3 6 7 5 5 5 6 6 6 7 3 6 5 3 4 2 3 8 2 3 8 1 6 6 2 1 5 5 7 1 1 3 4 5 4 6 5 8 5 3 6 1 4 6 10 5 9 10 7 3 8 4 7 2 4 8 0 7 7 4 9 2 8 4 1 5 4 -1 4 3 2 5
6.94664 5 0 6 5 5 3 3 0 3 5 2 3 0 6 8 5 1 6 7 6 1 5 5 3 4 3 4 3 4 7 4 3 5 1 4 1 2 2 3 5 4 3 5 2 2 3 6 1 2 5 1 2 2 3 2 2 0 4 3 0 5 0 3 6 0 6 3 4 1 3 -1 4 2
6.90269 2 2 9 1 8 0 3 2 0 3 2 6 1 5 0 4 6 2 7 -3 4 3 7 5 -2 6 1 2 2 4 1 8 0 8 0 3 1 3 -1 4 0 5 5 -1 4 0 4 1 2 5 0 2 4 1 5 0 1 3 1 1 0 3 1 0 4 2 -1 2 5 1 0 1
6.85935 1 0 5 -2 -3 0 3 -1 2 0 1 2 0 2 -5 5 3 0 3 1 2 7 4 1 2 3 2 2 -3 4 3 2 -1 2 -1 -1 -1 0 1 -2 2 0 1 0 2 1 3 3 0 1 1 0 2 2 -3 2 2 -1 2 -2 1 -1 -3 2 -3 4 0 0 0 0 3 -2 4
6.81540 4 1 5 -4 4 0 1 0 5 1 1 0 2 0 1 1 0 -2 0 0 1 2 0 4 5 0 0 2 -1 0 0 -2 1 -1 1 3 0 1 4 0 2 2 0 0 3 -2 -1 0 2 0 0 2 0 2 0 0 5 -3 2 4 3 2 1 1 -1 2 -1 5 -2 0 0 1 0 0
$$ packed form
7.12305A4kjKj%LmOmnMKTn%J%J%KmKNqLk%KTlnK%KnPmMnkRnKLljkNJLmkJlTRjmlKMmKJkJl%jNm
7.07971I%KjKkl%JjJMlKLl%jKkjLkOoLjlLnLkKJlJMoKLmJ%lN%jlPmkjMjkJLjkMj%TkjJLoKmN%K
7.03576A2m%KkMlTjKJLnJ%K%oN%kJj%k%jLkLK%mJTjLmLjkMlkLj%MlJKnK%TKjl%UMl%WjMrJ2n%m
6.99059C%LJk%TJ%TJmLjkJkJNoJNpN%mjM%Ko%KJTjKjLlkLnLKMnMJlmNmLnKMqP%lNpOmlMjnNjTL
6.94664EnOj%k%lLKlJlOKlmNJjnM%kJjJjJLljKmLlJ%JKjTKl%JLnJLmJ%Jj%kMjlNnLToOlJlKmNk
6.90269B%PqPqLjkLjMnMnMKmNj0PjMkpQnJ%KlPqQqLkKmNmN%oNmMlJLnKTlMnJKk%jLkjMklLTmjJ
6.85935AjNpjLTmLkJTkKpJ0klLkJNlTJTj%nPjTlLl%TJTlMkJjKjK%lJ%jK%nN%lLmLkTNnPm%ULnO
6.81540DlMrQmJjNm%jKkJ%jkK%JTkMJn%KlJ%kLkKTlJLmK%k%LnJTKk%KkKk%NqNKjU%kLlOpK%Jj%
$$ plain form
6.77084 0 1 2 1 1 0 1 0 5 -2 -2 -2 0 2 -2 0 -1 2 3 2 -1 -1 0 0 2 -2 -1 0 2 1 3 -1 5 -2 0 0 0 1 0 0 0 -2 -1 0 3 3 -1 0 1 -1 3 -3 1 -1 1 -1 4 0 0 8 -3 1 1 1 0 0 0 1 0 0 0 0 0 0 -1 -2
6.72505 -2 0 -1 2 3 -2 0 0 0 2 0 1 -2 -1 0 2 0 0 3 -2 -5 -1 2 -3 0 1 0 -3 0 0 -2 -1 0 3 -2 1 1 -4 4 -6 3 0 -4 2 -3 -2 6 -3 4 -6 3 -1 -1 1 1 0 -1 -1 0 -3 0 0 0 1 2 0 3 -3 0 1 0
6.68232 0 0 -3 5 0 -4 1 0 -1 5 -1 1 3 2 0 -4 0 0 1 0 -1 -3 -1 -1 2 -2 1 0 2 -4 -1 0 0 -2 4 1 -1 1 -4 2 0 -1 -1 -1 0 0 0 0 1 -2 -4 4 -2 2 0 4 0 1 -3 0 0 0 0 -1 -3 -2 0 -1 2 1 1 -2 2 0 4
6.63715 4 -3 0 -3 2 2 1 -5 3 0 4 0 2 -1 2 0 0 1 -2 -2 1 0 1 -1 -1 1 2 2 -2 0 0 -6 5 0 -2 1 2 -3 -1 -1 0 4 -2 0 -4 0 3 -2 0 -1 -1 1 0 -1 -2 -1 -4 2 -2 2 0 -3 0 0 -1 1 2 -1 -2 1 0 0 0
6.59320 0 1 0 0 0 1 -2 0 0 1 0 -1 2 1 -2 -1 -2 0 -3 -1 1 -5 4 1 -3 3 0 -1 -3 2 -2 2 2 -1 0 -7 0 -1 1 2 -1 1 -2 -1 3 1 -1 0 1 0 0 0 0 -2 -2 1 -2 -2 -3 0 -2 3 -3 3 -4 3 -1 1 0 -2 -1 -2 0 0 0 0 0 0
6.54620 0 1 -2 1 -1 -2 3 -2 0 0 -5 -4 0 -2 -1 0 -2 2 3 -3 -1 0 1 -1 -1 0 -1 -2 -1 -1 1 0 -3 0 0 -6 -2 0 0 0 0 0 -3 0 0 0 0 -1 0 -3 1 0 4 0 0 -1 1 -2 2 -5 4 2 0 0 -1 -6 2 -6 -1 -1 0 -6 1 -3 2 -2
6.50042 -2 1 -3 0 -3 -1 2 -3 -3 1 0 -2 0 -2 0 -1 -3 -1 -1 -2 0 0 -1 -3 -1 2 4 0 0 -2 1 -1 -1 2 -3 0 -3 -3 3 -1 -4 -2 -1 -4 2 0 -4 0 -1 0 0 0 -2 4 1 -2 0 -3 0 2 -1 4 0 0 -4 -4 2 0 2 -1 -3 -5 0
6.45647 0 -4 0 0 0 2 -4 -2 -3 -2 0 -1 -5 6 1 -2 1 -1 0 0 0 -2 0 0 0 -7 -1 0 2 0 0 -3 0 0 -2 0 2 -2 -1 -4 -2 -1 -2 -2 0 -4 3 -3 0 0 1 -2 0 -1 -1 -1 -2 0 -1 0 -1 1 0 0 -2 0 0 0 -4 -1 0 1
$$ packed form
6.77084@JTj%jJjNp%TKTmKjLJjl%J%KmJTKjKmOpK%TJj%TkJTL%mJTkMoMkKkNm%Qj1M%Tj%TJj%WjT
6.72505bKjLJnK%TKkJlJTKk%LnlMLnLJjlL%kJTLnL%nQj0RlmOnJQrPj0Rm%K%jT%JlL%TJTkLoLJj
6.68232@%lQnmNjTOoKTjkmM%JjTkK%LmLjKoLJ%kOlkKnOkj%TJ%UJlkQoMkMmJmL%UjkJKjLj%lMkM
6.63715DpLlN%joQlMmKlLk%Jl%LjJk%KJ%mK%oJ1nkLJnK%JMoKmMLnKj%KjUJlOmMklL%jKJljLj%T
6.59320@Jj%TJlK%JjTLjlJjKlKToRlmOljkNmM%lJpPjKJlKlJMkTJTj%Uk%Ll%jLkNoOpPmKjkJjK%W
6.54620@JlLkjNnK%nJMkJTkMJoKJTk%JjTJ%KjlL%oMK%VlL%UjJlMjMm%jKlMpRkT%jnQqN%JoPmNm
6.50042bLmLlKLn%MjkKkKjkK%jK%jkKLKm%kLk%LnLl%OmlKJlOkmMjJ%TkOlTKlLKlNm%m%OkKlkTN
6.45647@mM%TKoKjJKjmJ1nlLkJ%TkK%TpOJKk%lL%kKTmJlKJj%KmPoL%JlKj%TjKjJjKj%kK%TmLJT
$$ plain form
6.41313 1 -3 -2 0 -2 -2 0 -2 0 0 -1 -2 0 -1 0 2 -2 3 -1 -1 -2 -2 2 -1 -4 1 -2 0 -1 0 -4 0 -2 0 -3 -2 -2 -3 1 -1 -4 -1 1 -2 -2 -2 0 -4 0 -4 0 -3 0 -6 -1 2 -3 0 -3 -2 0 -5 0 -2 -1 0 -3 0 -3 -1 -5 0 -4
6.36918 -4 -1 0 0 -3 -5 0 -1 0 -1 0 -2 -2 -2 -3 0 0 -5 1 -1 0 -2 1 0 3 -6 -3 -1 0 2 0 -2 0 0 0 -4 -3 -1 0 -1 0 0 0 -3 0 0 0 0 3 -4 -2 0 0 0 0 0 -3 0 -3 0 2 -2 0 -1 -4 0 1 -3 -3 -1 -1 -2 -2 -4 0 0
6.32340 0 -4 0 -3 -4 0 -2 0 -1 -4 0 0 0 -2 0 2 -2 -1 -2 0 -1 -5 0 -1 0 0 -1 0 0 0 0 0 0 -1 -1 -4 0 0 -2 0 -5 -1 -4 -1 0 -2 -2 2 2 -2 -2 -1 -2 -1 -1 -1 -2 -2 -4 1 -2 -1 -2 -1 -4 0 -4 -1 0 -3 -4 -1 -3 3 -3 -2
6.27761 -2 -5 -4 2 -3 0 1 -5 1 -1 0 1 0 -6 0 0 -4 -1 0 -4 3 0 -1 -1 -3 -1 -1 -4 0 0 0 0 -1 0 -2 0 -2 -3 0 -2 0 0 -9 -1 -1 -5 2 -1 -2 -3 -4 -3 0 -4 0 0 0 0 0 -3 0 -3 -3 1 -2 2 -1 0 0 -4 1 0 2 1 -2 1 -2
6.23122 -2 1 -3 1 1 0 0 0 0 -3 -1 -2 -2 -3 0 -1 -3 -1 1 -2 0 -1 -1 0 0 -1 -1 -3 -2 0 -2 0 -1 -1 -3 0 -2 -3 4 -4 1 0 -3 0 -2 -3 0 0 0 1 -2 0 0 -2 0 -5 -2 -6 -1 0 -3 0 -2 0 -1 -3 0 0 0 -1 0 -2 0 -4
6.18666 -4 -3 0 1 0 -2 0 -2 0 0 -1 0 0 0 3 -2 1 -2 5 0 -3 -2 -1 0 -3 -1 0 1 0 -3 0 -2 0 0 -1 2 -4 0 -4 0 -2 -4 0 -3 -2 -3 0 0 -1 -2 1 0 0 -4 -3 -1 -3 1 -3 -3 -2 -2 0 0 0 -1 -1 0 1 0 0 -1 -1 0
6.14210 0 -1 0 0 -3 0 -4 0 -4 0 -4 -2 2 0 -3 0 -2 1 0 -4 0 -4 0 -2 0 -5 1 -4 -2 -1 -5 3 0 -3 3 -1 3 0 0 -3 -1 0 -4 0 -5 -1 1 -2 0 -2 -2 1 -3 0 -3 4 -2 0 -1 0 0 2 -1 -3 0 -3 2 -3 2 -2 -1 -1 -2
6.09815 -2 1 0 -1 -2 0 0 0 -3 1 -1 -1 0 -3 0 -1 0 1 0 -2 0 -2 -2 0 -2 -3 2 -5 -1 -1 -3 1 0 -1 -4 0 -2 3 -2 -1 -3 0 2 -2 0 -1 0 -3 -1 -4 -1 -4 -2 0 -4 0 -2 -2 -2 -2 0 -5 2 -3 -1 0 1 0 -6 0 -3 0 -3 0 -1
$$ packed form
6.41313AmJKk%KkK%jTKjJKmNm%j%MlTNlKjJmMkKlJ%jMklLKl%TKmMmMlLoNLnLlJKnNkJTlLlKmNm
6.36918dLJ%lkNjJjJk%TjL%nOkJkLjLrLKJKkTK%TmJKJjJ%TlL%ULpKT%VlLlLKmKjlMJm%K%j%kM%
6.32340@mMljMkKjlM%TkKTmJjKjmNjJ%jJ%Wj%lM%kKnMlLJk%M%m%JjJ%Tj%kNlJjJlMmLJljLkOoJ
6.27761blJOnLJoOkJTjoO%mLJmPlj%kK%lM%UjJkKkjLkK%rQ%mPljUJLmM%VlLl%MlMlJ%mNjKjlLl
6.23122bLmM%j%UlKj%jLjkKTlKj%J%j%kJKkKj%kLkjPqNjlLkjL%TJlK%kKnLmNJlLkKjkL%TjJkKm
6.18666dJLJjkKkK%jJ%TLnLlPnlJUlKJTjlLkK%jLoMmMkTMlJjL%jTLj%mJKkMm%J%K%Tj%JTj%j%J
6.14210@jJ%lLmMmMmKMklLkLjmMmMkKnOnKJmQlTOmMl%lKJmMnMKlKk%LmLlPoKjJ%KlkLlNnNmJ%j
6.09815bLjUK%TlMk%JlLjJTjkKk%KkjNpM%kMjTlMkNnJkLKmKjJlKlLlKTmMk%UKnPnKJTjoOlLlLj
$$ plain form
6.05298 -1 -1 1 -1 -1 -2 -3 -3 -2 -2 -1 -1 -2 1 -3 1 -5 -3 5 0 1 2 -3 0 2 1 0 -5 -3 1 -4 1 0 -3 0 -2 -2 0 -5 0 -1 -1 -2 1 2 0 2 -1 2 -1 -2 0 -1 1 -2 4 -3 -1 -2 -3 1 -1 0 2 -1 -1 0 -2 3 -2 1 -1 0
6.00903 0 0 0 0 2 -3 -5 -1 -3 0 -1 -1 -3 -2 -5 -2 -3 -2 0 1 -3 -3 -3 -4 2 -1 -2 0 -1 -1 1 -3 0 -1 0 0 -1 0 0 -1 -2 3 0 1 0 0 -3 1 1 0 -2 0 -4 -2 -3 -3 1 0 -2 -2 -1 -1 0 -2 0 0 0 -3 1 0 -3 2 -1 0
5.96447 0 0 0 1 0 -1 0 -1 -5 -2 0 1 0 0 1 1 -5 0 -1 -1 -2 -2 1 -2 3 -5 -2 0 -4 -1 -1 0 -3 3 0 -3 0 -3 1 1 0 -1 -4 -2 -1 -5 -2 -4 0 -3 -2 -1 -3 -4 -1 1 -3 -3 -1 3 -2 -3 1 -1 0 0 -3 -3 -2 0 -1 0 -1
5.92052 -1 -5 0 -5 0 -3 -4 0 0 -1 -2 -2 -2 -2 1 0 1 -3 -1 0 1 -3 -1 -2 0 0 1 -1 0 -1 0 -3 -1 -3 -1 -2 -5 0 -2 1 -1 -3 -3 -2 0 -3 -1 -1 0 0 0 2 0 0 0 -2 2 0 -2 3 -2 -2 -2 -2 -4 0 0 -2 0 -3 -2 -4 0 -3 0
5.87535 0 -3 1 -3 -1 -4 0 2 -4 0 -1 -3 0 0 -1 -2 -2 0 -1 4 0 0 0 -1 -1 0 0 -2 -1 0 -1 0 -5 0 -2 -1 0 0 -1 -2 -4 -2 2 0 0 -2 0 -7 -3 -2 0 0 1 0 0 -4 0 -2 -2 0 -2 0 -1 0 -1 -2 -1 -3 -4 0 0 2 0
5.83140 0 -1 -6 -1 -1 0 -3 0 -6 1 -4 -1 -6 0 0 0 -2 1 -6 1 -3 -2 -1 -2 -3 -3 -2 -4 0 -1 -2 0 0 1 -5 2 -3 -4 1 -4 1 0 0 2 -1 -1 0 -2 1 -4 3 0 -2 3 0 1 -1 1 -2 -1 -1 -2 0 0 -10 -2 0 0 1 0 1 -3
5.78806 -3 -5 -2 -1 -4 -2 0 0 -4 0 -2 -1 -1 -2 2 -4 -2 0 0 2 -6 0 -2 -2 0 0 0 -4 1 -1 0 -2 -3 0 0 -5 0 -1 -4 0 0 -2 0 -4 2 -2 1 -3 -1 0 -1 -4 2 -1 1 1 0 0 -2 -2 0 -4 0 -1 0 0 0 0 0 1 2 0 2 9 6
5.74288 6 5 16 32 45 32 26 28 21 14 14 8 5 2 5 2 1 -1 0 0 -1 1 0 -5 4 -1 1 -2 1 0 -2 0 -5 0 0 -3 3 2 -3 -1 -1 -1 -1 0 -1 -3 -3 -1 -3 -3 1 1 0 0 -2 -1 1 -6 -1 -1 1 0 -2 -3 -3 1 -1 -3 -1 -1
$$ packed form
6.05298a%Kk%jT%J%J%jLmMoKQnJTnLKjTnKMnNjlLk%KnNj%jLJkKlLljKjKlOpKjTMkJKl%JkNnLkJ
6.00903@%UKnkMkLj%kJlLjJKJm%TjOljKj%KmLjJ%jJ%jTNlJj%lM%jkKmKj%Mjk%J%JkK%TlMjlNlJ
5.96447@%TJjTJjmLKJj%J%oNj%j%LlNqLKmL%JlOlTLlM%jTlKJmLkMlJTkjLKm%KMnjMkJ%l%JKjJj
5.92052amNnNljM%jT%ULjJmKJTmKjK%JkJjJlKkKjlNkLkT%JKlK%J%TKk%TkMkTNn%UkM%kKlJkMlL
5.87535@lMmKlMKoMjkL%jT%KjNm%Tj%J%kJTjJnNkJT%jTkKMk%kKpMJK%Jj%mMk%KkKjJjTJkjM%Kk
5.83140@jnN%JlLoPnLnO%TkLpPmJTjT%JkMjTK%JoPnjNnNj%Kl%JkLnPlkNlJkKlJ%jK%j0QK%JjJm
5.78806ckLJlKT%mMkJ%jMoKT%KqOk%K%TmNkJkjL%nNjlM%kKmOmLmKJjlOlK%j%k%KmMjJ%VJTkKPl
5.74288FjJ1J6J3j3oKpT%olTLljkJ%jKjnRnKlLjkKnN%lOjnK%UJjk%Kk%M%j%kJKpN%Kjkj%MkTK%
$$ plain form
5.70077 -1 0 -4 2 0 1 -1 0 -2 0 -2 -2 -2 -6 -1 -5 -1 -3 1 -3 1 -1 0 0 -2 3 0 -2 0 -4 -3 1 -1 0 -4 -4 2 0 0 -1 0 -3 1 -2 -4 0 -3 -1 2 -3 -4 0 -5 1 -1 -1 1 -2 -1 1 -2 0 -1 -1 1 -1 -1 -1 -1 -2 1 -4 1 -1
5.65620 -1 0 0 -3 -3 1 1 -5 0 0 -5 0 0 -1 2 -3 0 0 0 0 -1 -3 1 -2 -3 1 -3 2 0 -2 -4 -3 0 -4 -1 -2 -1 -2 0 -2 2 -5 -1 -3 0 -1 -1 0 -4 1 0 -2 0 -1 3 1 0 0 -5 0 -3 0 -1 5 -4 3 -4 -2 0 0 -4 -1 -3 -1 -1 -1
5.61042 -1 1 -3 -3 -1 0 -1 0 -4 0 -2 2 1 -5 -2 -1 1 -3 -1 0 0 -1 3 -1 -3 -1 -3 0 -4 0 -2 -4 -3 1 -3 0 -2 -1 0 -4 3 0 -2 -3 0 -1 0 1 0 -4 2 -2 0 -2 2 -5 1 -1 -8 0 0 0 -1 2 -1 0 -3 -3 -3 -2 2 0 -4
5.56647 -4 -2 -5 1 -5 2 -1 -1 -3 -1 0 0 -1 3 -5 0 -5 0 1 0 -3 0 0 -2 0 -3 -4 -1 0 -1 0 0 -3 0 -2 -2 -3 0 -1 1 -6 -2 0 -1 1 -2 1 0 -3 -2 -3 0 -1 -1 -1 -4 -2 -2 0 -1 0 -1 -1 -1 0 -1 -1 0 -5 0 0 -1 -3
5.52252 -3 0 -1 -5 0 -5 -1 -1 -2 0 0 2 -2 -2 -3 -1 -2 -1 -2 0 -3 2 1 0 1 -2 0 -3 -4 0 -5 -1 -2 -5 0 -4 1 -1 1 -2 0 -3 0 0 -1 1 -3 -3 0 0 -4 -4 -3 0 0 1 0 -1 0 -1 1 -1 0 -2 -2 -2 -5 -5 -4 0 -4 -3 -1
5.47857 -1 0 0 3 -1 -2 -2 -3 -4 0 0 -2 2 0 -2 -1 0 -2 0 0 0 -1 -2 0 0 -6 1 0 -3 0 -3 -2 -2 -4 2 -2 2 -2 -3 -1 -1 -6 0 -2 -4 -5 0 1 0 -2 -1 1 0 -4 -5 -4 -4 -1 0 -4 -2 0 0 0 -2 2 -3 -1 -3 -2 -1 -3 -5
5.43462 -5 1 0 -5 1 -2 -2 0 -2 0 -2 0 0 0 1 2 0 -1 0 0 0 0 -2 2 -1 0 0 0 0 2 -4 -2 -1 0 0 -1 -3 -1 -1 -2 0 -4 0 0 -6 -1 -3 0 0 -1 -2 -1 -1 1 -1 -1 0 -1 -1 -2 1 0 -2 -4 0 -4 1 1 1 -1 -4 2 0 2 -3
5.38945 -3 0 0 0 1 -4 0 -2 0 -3 -1 -1 -2 1 -2 -2 -1 -1 -1 -5 0 0 -1 0 -5 0 0 -5 -3 -2 0 0 0 0 0 2 -1 -3 0 -1 1 0 -4 0 -4 -3 -2 1 0 -1 -1 0 -2 0 2 0 0 0 -1 -2 2 -7 -1 -3 3 0 0 -3 0 -2 0 -1 0 -3 0
$$ packed form
5.70077aJmOkJkJkKk%TmNmMkMmMkJ%kNlkKmJMkJm%Ok%jJlMlkMlKLnjMnOk%KlJKlKj%Kk%UjLnNk
5.65620aJ%l%M%oN%nN%jLnL%UjkMljMmNkUJLmLjJjKkMpMkLj%JmNjkKjMkj%nNlLjOrPpKT%mLkK%T
5.61042aKm%KJjJmMkMjoLJKmKJ%jMmkKkLmMkTJMmLkJTmPlkjLjJTjmOmKkMpOkpQ%TjLlJl%TJMkm
5.56647dKlOoPl%kKJ%jMqNnNJjlL%kKljLJjJ%lLk%jLjKpMKjKlLjlJjLj%TlK%KjJj%TJj%JnN%jk
5.52252cLjmNnM%jK%Km%jKjJjKlNjTJlKljMnMjlNmNkKlKlL%jKm%L%m%JL%JjTJjKkJk%Tl%JMmJK
5.47857aJ%Lmj%jTM%kMkTJTkK%TjTK%oPjlLlJ%kOmMmjK%nOkTjNJjkJKjmjJ%LJmKT%TkMnKkJTkT
5.43462eOjnOl%KkKkK%TJTkjJ%UkMlJ%UKoKJT%jkK%jKmM%oNkL%jTJ%Kk%Jj%jLjkTMmN%TklOkKn
5.38945cL%TJnMkKlK%jLl%J%TmN%jJnN%nKJK%VKlkLjKjmMmJTLjT%JkKTk%TjTMrOkOl%lLkKjJlL
$$ plain form
5.34428 0 -4 1 0 -3 0 -3 0 -6 -2 -2 -1 -1 2 -1 0 1 -2 1 -2 1 -2 0 1 -1 0 -2 2 0 2 -5 1 0 -2 0 0 0 -2 -3 -1 -1 0 0 -2 0 0 0 0 0 1 0 0 0 0 -3 0 2 -3 -5 1 0 -7 2 -1 -2 -1 -1 -1 1 -2 2 0 -1 -7 1 0
5.29850 0 -4 1 -5 -1 3 -3 0 4 -5 2 0 -4 -3 -2 0 -4 -1 -4 -1 -1 2 0 -1 0 -1 0 -2 0 -1 3 -2 2 0 -5 -2 2 -3 1 2 -3 0 0 0 1 -1 -1 0 -4 3 -1 -2 0 0 -3 0 2 -1 1 -3 1 -2 -4 1 -3 3 -6 -1 0 1 -1 0 0
5.25455 0 2 0 -1 0 0 -1 0 2 0 -3 -2 -2 1 -2 0 -4 -1 -3 -3 0 -2 0 -3 2 0 -2 0 -1 -1 -1 0 -1 -2 4 -2 3 -4 -2 0 -1 -1 0 0 0 -2 5 -5 2 -3 0 0 0 -4 -1 -4 0 0 -4 0 -3 0 -4 0 -2 0 -1 0 -2 -2 -1 -1
5.21121 -1 1 -2 -1 -4 0 -2 3 0 -3 -1 -2 0 2 -2 0 0 -2 -4 0 -4 0 0 -1 0 3 -1 -1 0 -1 0 -2 -4 1 -2 -5 -3 -4 -1 -3 -1 2 -2 2 -5 1 -5 -2 -3 -5 3 -1 0 -2 0 0 1 -2 1 -1 0 1 0 0 1 -3 2 -2 -3 0 0 -3 -1
5.16726 -1 4 -6 0 -6 1 0 -2 -1 -2 -4 0 0 0 0 0 1 -1 -3 -3 -1 -5 0 0 0 0 0 -2 2 -3 0 1 -1 -3 0 0 -4 1 -5 -2 -1 0 0 -1 0 -3 -1 -2 0 0 1 -3 2 -3 -4 2 -3 -2 0 -2 0 1 3 -2 0 -1 -2 1 -2 -3 0 0 0 -3 3 -4
5.12148 -4 0 1 -2 -1 -2 0 3 -2 1 0 1 -2 -1 -1 0 0 0 -1 -2 -1 -3 0 -2 2 -1 -2 1 0 1 2 0 0 0 -1 1 1 -2 -1 -2 0 0 -2 -2 -1 0 0 -1 0 2 -1 -2 2 -5 1 0 -1 0 -3 1 0 -2 -4 2 -1 0 -3 -3 -2 -1 1 -2 5
5.07752 5 0 -5 0 -2 -1 0 -1 -3 2 -1 -3 0 -4 0 5 -5 -1 0 -2 -1 0 -3 0 -2 -3 0 0 -3 0 -3 -3 1 -4 1 -1 4 -2 0 0 -4 -3 0 1 -3 0 0 -4 -3 0 1 0 2 -2 -1 -2 -2 0 1 2 2 -1 2 -4 1 -3 -2 0 -5 -1 -1 -1
5.03418 -1 5 -3 0 1 -1 -1 1 -2 -4 -2 -5 0 -5 2 0 -2 1 -7 0 -2 0 -1 0 0 -1 -1 1 -3 0 2 3 0 0 0 0 1 -2 0 0 -3 1 0 -2 -4 0 -1 -4 -1 -2 0 -2 -1 0 0 -1 1 -1 -3 0 -5 0 -2 0 1 0 -1 0 2 0 -3 -5 -1 0
$$ packed form
5.34428@mNjlLlLoM%J%LlJTlLlLlKJkJkMkKpOjkK%TkjK%J%kK%VJj%UlLKnkOjpRljJ%TKlMkjoQj
5.29850@mNoMToLMrPkmJTKmLlL%LkjJjJkKjMnMknLMnMJnL%TJk%JmPmjK%lLKlKmMlkNmOrNJTkJ%
5.25455@KkjJ%jJKklJ%LlKmLk%LkKlNkTKj%TJjTOoNpKTj%J%TkPj0PnL%TmLlM%mMlLmMkKjJk%J%
5.21121aKlJlMkNlTKjKTmK%kTMmM%jJLm%JjJkTNlTKjLkKLmMpOoLjkQmJkK%JlLkJTj%JmNmjL%lK
5.16726aNj0OoPjkJjkM%VJkT%KmN%VkMnLJkTL%mNoLJT%jJlKjK%JmNnjOnJKkKJKnKjTLljL%TlOp
5.12148dMJlJjKLnLjJlJ%J%TjTJkLkMljLjJTk%TjK%lJjK%k%JT%jJKljMpOjTJlMjkTOlJl%JTKlP
5.07752EnTNkJTjkNlkLmMNj0MJkJTlLkjL%lLl%MnNkNoK%mJLJmL%mJLJjKmJj%KJT%lLoNmJKnM%T
5.03418aOqLJk%KlkKlNnPkTLqPkKjJ%j%KmLKJl%UJlK%lMjkTMjlLjKkJT%jKkTLnNkKJjTJKklkMJ
$$ plain form
4.98962 0 0 -1 5 -5 -1 0 2 0 -3 -2 -2 -2 0 1 -4 0 -1 -2 -3 -1 -3 2 0 2 -1 -3 1 0 0 -2 0 -3 -1 4 1 -1 0 0 0 0 -1 0 -1 -2 0 -5 2 -1 -2 0 -3 2 -2 -1 -1 0 0 -1 -1 0 -1 -2 0 2 -2 3 -4 -2 0 -3 1 -3 0
4.94506 0 -2 0 -3 -2 0 -4 1 -1 -1 -4 -3 0 -2 1 -5 0 -1 0 0 -2 -5 -5 -1 0 2 -2 -2 1 -8 2 -3 -1 -3 0 -4 0 3 -3 0 0 -1 3 0 -3 0 -3 1 0 0 0 -2 3 -4 1 -1 -4 3 3 -5 -2 -1 -2 0 1 -5 -3 0 -4 2 -1 3
4.90172 3 1 -3 1 -2 -2 1 0 -7 0 -3 -5 3 1 1 -1 -1 1 -2 0 3 -3 3 -3 1 1 -3 0 -1 0 -3 -3 1 -2 0 0 -4 1 1 -1 -1 0 -1 0 -2 3 -2 0 0 0 -1 0 -5 -2 0 0 2 -6 -2 -3 1 1 1 0 -1 1 0 0 0 0 -3 -4 -4 0
4.85716 0 -1 -3 -2 2 0 -1 0 -1 -4 -2 -1 -3 0 -2 -5 1 -2 -2 0 -1 -6 0 -4 1 -1 2 -1 0 -3 -3 -2 -1 -3 -1 -4 -2 1 -2 -1 0 -2 -2 0 0 1 0 -1 -1 -1 0 0 -2 0 0 -1 0 -3 0 -4 -2 -4 -4 -2 -2 -3 -1 -2 1 -1 -3 -3 -1
4.81321 -1 -1 -2 -4 0 -2 0 0 -1 -3 -3 0 -2 1 0 -2 0 0 0 0 1 -3 -1 1 -2 -1 -1 0 1 0 0 -2 4 3 -1 1 1 -2 0 0 -3 2 -1 -3 -2 0 -1 1 0 -2 0 3 -3 1 -1 -2 1 -2 0 4 0 0 -2 2 -1 -2 -2 0 -3 -1 -2 -2 0 0
4.76865 0 -2 2 -2 0 2 -5 2 -6 0 2 0 -2 -1 -3 -4 3 0 -4 0 -4 0 0 1 0 0 -2 1 1 0 0 3 1 3 -2 -2 0 0 -2 0 -2 0 -1 -1 2 -4 -1 -4 0 -2 1 -1 4 -2 0 -1 0 0 0 -1 -1 2 1 0 -1 -2 -2 0 -2 -3 -1 -2 -1 1 -2
4.72348 -2 -3 -2 -1 2 -3 -4 -2 -1 -1 0 0 0 0 -2 -1 0 0 0 -2 -1 0 0 -1 5 0 -1 -4 0 -6 4 -6 3 -1 -2 0 -4 0 1 -3 3 -2 2 0 -3 0 0 -2 0 -3 2 -1 -1 -1 1 -3 0 -2 0 0 0 1 -3 -6 0 -6 -1 -2 0 0 -1 1
4.68014 1 -4 0 0 -3 0 0 0 0 -3 -5 0 -3 -2 0 0 -1 0 3 -2 0 -1 0 -1 -1 0 0 -3 -3 -2 4 -7 -2 0 -4 -2 -4 0 3 -2 -5 1 0 4 -3 0 -1 2 0 1 -3 2 -3 0 -1 -2 -1 0 -2 1 -2 2 1 0 -1 1 0 0 1 -3 0 0 -1 0 1
$$ packed form
4.98962@%jOj0MJKklJ%TKJnMjUKkNkKlkMj%kKlKNlkJ%UjJjTKnPljKlNmJ%J%j%JjTKTmNpKTlMmL
4.94506@kKlJKmNk%lJLkLoNjJ%kl%MJKm%LrJ0nKkLmMLoL%jMlTLlMj%TkNpNklP%qLJjKJoKLmOlM
4.90172CkmMl%LjpPlkQk%k%KlKLoOoM%mLjJl%MlK%mN%k%JjJkNnK%TjJnLK%KqMjM%TjTKj%Ulj%M
4.85716@jkJMkjJjlKJkLklOl%KjnOmNkLlJl%JTkKlKLlJTk%K%JjT%TJ%kK%jJlLmKk%K%jKjLkT%K
4.81321a%jkMkK%jk%LkLjkK%UJmKTlJ%JTj%kOjmK%lK%lNlkJKjKjkKLoMkjLlKMm%kMlj%KlKj%K%
4.76865@kMmKTpPqOKkTJkjPlmMmM%Jj%kL%j%LkKn%K%kKkKj%LoLlMkLkNoKjJ%Tj%LjV%KkjKjJKl
4.72348bjJTLnjKJ%J%UkJT%TkJT%jOnjlMoJ0j0RmjKmMJmOnMklL%kKlNl%TKmLkK%TJmlOoNjK%jK
4.68014AnM%lL%UlkNlJK%jJLnKjJj%J%l%JOj1NKmKkMLnlOjMpLjLkJmNnLjTJTkLlMjUKj%JmL%jJT
$$ plain form
4.63497 1 -3 -1 -1 0 -1 0 -2 0 0 -3 0 0 -1 -1 -1 -3 0 -1 0 -2 0 -2 4 -6 0 0 0 -2 0 1 1 3 -7 1 0 0 -4 1 -2 1 -1 -2 0 2 -2 2 -3 1 -3 1 1 0 -2 -5 -1 0 3 2 0 1 -3 1 -5 2 -1 -2 0 -1 3 -4
4.59224 -4 -1 -1 3 -3 0 -2 2 -5 0 -1 -1 -2 2 -1 -1 -2 2 -2 0 0 3 -2 -1 0 0 -1 0 0 -2 0 0 -3 0 1 -1 5 0 0 0 0 -4 0 -2 -1 -2 0 1 -1 -4 0 2 1 -1 -1 0 -3 0 -1 -1 -2 0 0 -5 1 -3 0 0 -3 2 -2 -1 0 -1 -2
4.54707 -2 5 -3 2 0 4 -2 0 -2 -3 4 0 0 0 -3 -1 1 0 1 4 -4 0 0 0 -1 2 -2 -2 0 0 0 -2 -3 -2 -3 -1 2 0 -3 0 0 0 2 -2 2 -1 -1 -2 0 1 1 -5 0 1 -1 1 4 -1 -3 -1 -4 0 -3 2 -1 -2 2 -2 3 -3 2 -2 0
4.50312 0 0 -1 1 -2 -2 -1 -2 1 -2 2 -2 -1 1 0 -4 3 -4 -2 0 -2 -2 3 -1 -3 -3 0 -2 4 -3 -5 3 2 -1 2 -2 2 0 0 -3 0 -3 1 -1 -2 0 -1 -2 2 2 -1 0 -1 1 0 0 4 0 2 -2 -1 0 2 0 1 -2 2 -2 1 0 0 -2 -1
4.45917 -1 2 0 0 3 -1 0 -2 1 -5 5 0 1 2 1 0 2 0 2 0 0 0 -2 2 3 0 2 2 -1 0 1 -2 3 2 3 1 0 2 0 4 0 3 1 -1 1 2 2 -1 1 0 0 3 1 0 1 0 -3 5 3 -2 0 -1 0 1 1 0 2 1 0 0 -2 0
4.41583 0 0 -2 -1 0 1 1 0 0 0 0 0 -3 0 -4 -1 0 0 1 -2 -2 1 4 5 -2 -1 -3 0 -6 -2 2 -3 2 -2 0 4 -3 5 1 -5 -1 2 0 -2 1 -7 2 0 -2 0 4 -2 -1 0 0 -2 0 -2 0 1 1 2 1 0 0 -2 1 -1 3 0 2 0 0 1 0 0
4.37005 0 -1 0 0 0 -2 0 0 -2 -2 0 3 0 0 -1 -2 -2 0 -1 1 0 1 -3 -1 -3 2 -4 -1 -1 -4 1 -2 0 0 -1 1 0 -1 1 -1 0 1 -3 1 -5 -1 0 -3 5 -4 2 2 0 -2 2 0 0 -2 -2 0 1 1 -1 -1 -2 0 0 0 0 1 0 -2 0 1
4.32548 1 0 -1 0 3 -2 -7 2 -2 1 0 0 -3 1 -2 1 0 0 0 3 -2 0 0 -4 1 -1 0 -1 -2 -1 4 -1 -1 1 0 0 0 -2 3 -6 3 1 0 1 -4 0 0 0 0 -1 0 2 0 -4 1 -3 -2 -1 3 0 -1 -1 0 -2 -8 -1 0 -6 0 -5 0 0 -2 -1 0
$$ packed form
4.63497AmK%JjJkK%lL%j%TkLjJkKkOj0O%TkKJ%Kj0Qj%mNlLkjKTmMnMmM%jklMJLjkJmMoPljKjMp
4.59224dL%MoLkMpNj%jMl%jMmK%LnJT%jJ%kK%lLJkOn%UmMkJjKJklMKjk%JlLj%jK%nOmL%lNmJTjT
4.54707bPqNkMoKkjPm%TlKTjJLqM%TjLm%K%TkjJjKLklL%TKmMl%jKJ%oNJkKLnkKlMlNljMmNoNmK
4.50312@%jKl%JjLlMmJKjmPpKTk%Nmk%LkOpkQjlLmMk%lLlMkjKjTM%lJjKj%MmKmJTKkJlMmLj%kJ
4.45917aLk%LmJkLoJ0nJTjTKkKk%TkMJlK%lJTlNjJkjKkMmLkTKJ%lKj%LkjJjlQknKjJT%jKjT%kK
4.41583@%kJU%j%VlLmLJ%Jl%LTJpJkLoMTnNmKMpQmoMLkTLqRkTKMoJT%kKkKJ%JjT%kLkMlKk%Jj%
4.37005@jJ%TkK%k%KLl%jT%KjKjJmKkNoL%lNlK%jKjTKkJTmMoMJlQrO%kTMk%k%KJ%k%jK%UJjkKJ
4.32548AjTJLnTRmLj%lMlLj%TLnK%mNkJjTJNn%Kj%TkNrRkjJnM%UjJKkmNmJTMlj%JkoPJoOnN%kJT
$$ plain form
4.28031 0 0 0 1 0 1 1 0 2 -2 -1 0 -2 0 -2 0 -3 1 -2 3 0 -2 1 -1 0 -1 0 0 5 -2 -1 1 3 0 -1 -1 -1 0 2 -2 1 -4 -3 -3 -1 0 -3 1 -1 3 -2 -2 1 0 -1 1 -2 3 1 -1 -1 -2 0 -1 1 -5 2 1 1 0 0 -2 0
4.23636 0 -1 -1 3 -3 0 0 0 1 4 3 1 -1 0 0 -4 1 0 0 4 0 0 -4 0 2 0 4 -1 0 0 -2 3 0 3 -1 1 -1 2 2 1 5 1 5 3 6 5 5 2 2 2 1 2 1 0 0 1 -2 4 0 0 2 3 -3 0 -3 0 0 1 1 -2 0 -7
4.19302 -7 3 0 0 1 1 0 3 4 4 2 3 0 0 1 2 0 0 1 -1 0 0 -5 2 0 -1 0 -2 0 -1 -4 3 -2 0 0 -3 0 0 0 -2 -2 1 0 1 3 -4 1 -5 0 1 -2 0 0 3 -2 5 0 -3 4 -1 -7 -4 1 0 -1 0 1 -2 0 -1 -5
4.15029 -5 5 -1 -1 1 -3 -5 2 1 0 2 -3 0 -1 -1 0 -2 -2 -3 2 4 2 -3 0 0 1 3 1 2 0 -4 3 0 0 -3 0 3 -1 2 -1 0 0 1 0 0 0 0 -1 3 0 -5 0 1 -3 -1 1 -4 3 0 -1 -4 -3 -2 0 0 0 0 0 0 -1 3 0 2 1 0 0
4.10451 0 3 0 -1 1 -1 4 0 2 3 3 4 2 -5 -2 4 1 0 -1 -4 -1 2 -2 1 -3 3 0 0 -2 0 5 0 -2 3 -1 0 2 -2 2 3 -2 0 -2 0 0 0 4 -3 0 -1 -1 3 2 0 1 2 0 2 0 0 0 0 3 -1 2 -3 0 -2 1 1 1 -1 1 -1
4.05995 -1 1 0 -3 3 -2 0 0 0 -1 4 0 5 -2 0 -1 3 0 1 5 -3 2 -1 0 2 -1 0 0 0 4 -1 0 0 1 1 2 -2 0 -4 2 -1 0 2 2 1 0 2 1 5 4 2 4 0 1 -2 7 5 3 0 0 -3 4 0 3 1 0 0 1 0 0 -1 -4 0
4.01600 0 -1 -1 0 0 0 0 1 -1 3 0 0 3 1 4 6 2 4 3 0 4 0 3 0 3 0 1 0 1 0 4 2 2 1 1 -4 0 -1 3 1 5 1 0 1 2 -1 3 0 -1 -1 -3 3 3 1 3 3 -2 1 0 0 1 1 0 -1 -1 2 -4 2 -1 0 0 0 0 -1 0
3.97083 0 0 1 0 0 0 0 5 0 3 -2 -1 5 1 -3 2 0 2 -4 2 0 2 -3 2 0 0 2 3 2 -1 -1 1 -3 -2 0 -3 -1 1 0 1 0 7 -4 3 0 1 6 0 3 1 0 0 0 3 2 0 0 0 -1 0 -6 1 -1 -1 2 -1 -1 0 2 -3 0 0 0
$$ packed form
4.28031@%TJjJ%jKmJTkKkKlMlNlkLkJjJ%NpJKTlj%TJKmLnJ%KJlMkMn%LjTKlNkT%jKjKoPj%j%kK
4.23636@j%MoL%TJLjkTJ%mNj%Mm%mMKkMnJ%kNlLmKkL%jMmMkLj%l%TjJjT%JlOm%KJoLlL%J%lKp
4.19302gJ0l%J%jLJ%kJl%JTk%JkJ%nPkjJkKjlPnK%lL%Tk%LjJKpNoNJlK%LnPnlPnoLNjTJTlKjm
4.15029eJ0o%KmkPjTKnLj%Jk%jNKknL%JKkJkmPl%lLTmLlJ%Jj%UjMlnNJmKTnPljlJTK%WjMlKjT%
4.10451@LljKkNmKJ%JkpLOljTlLTmLmOl%kKNnkNmJKmMJnKkK%TMpLj%MjkJTkKk%ULmLnLkL%TkKk
4.05995aKjlOnK%TjNmNpKjMlJMqNlJKlJ%TMnJ%J%JmKmOlJK%jTKjMjkKmJlRkTl%lPmLkj%Jj%jlM
4.01600@j%J%UJkMl%LkLKmKjlMmLlLlJjJjMk%j%nMjMkMmjJTlMlj%kO%kK%nLj%J%jT%LoOlJ%UjJ
3.97083@%Jj%UNnLnJOmTNkKoOkKnNk%KJjl%KmJKlKTjJjPj1PlJNoLkj%TLjk%TjJoPk%Ll%JKnL%T
$$ plain form
3.92688 0 -1 0 0 0 3 0 4 2 -4 4 -2 0 4 1 -3 0 0 0 2 1 1 3 1 -1 0 0 0 2 -1 0 1 0 -2 -2 0 1 -1 -2 2 2 1 0 3 0 1 -1 0 1 0 1 1 0 2 1 1 -3 2 4 -2 4 2 -1 1 0 2 2 4 0 3 1 -1 2
3.88293 2 -3 1 0 5 0 0 1 -4 3 1 0 1 1 3 2 7 0 -2 0 0 5 0 -3 1 1 0 3 -2 4 0 -1 3 3 0 4 0 0 3 7 -2 -1 -1 -1 3 2 0 2 -2 1 3 0 -2 6 0 1 7 0 0 1 0 1 -1 1 -2 0 3 4 0 3 5 4 7
3.83898 7 1 3 5 3 4 3 5 7 0 7 4 3 0 5 5 4 4 7 3 2 3 4 6 6 0 5 2 6 3 0 1 4 0 4 1 3 6 1 1 2 -1 3 -1 5 -1 1 2 1 0 2 1 -1 0 6 5 -2 4 1 5 0 7 1 3 5 5 2 3 0 0 4 3 5
3.79503 5 5 0 4 1 4 0 1 4 0 2 2 1 4 0 1 3 1 7 3 4 4 3 3 7 5 2 6 0 1 4 3 5 4 0 0 5 1 4 2 1 1 5 3 3 3 1 2 2 8 0 2 0 1 2 5 1 5 2 4 0 2 3 4 3 3 0 4 3 3 3 2 1
3.75108 1 9 1 5 1 1 4 -1 6 2 0 1 6 0 12 1 3 1 3 0 7 5 0 2 4 -1 11 2 6 0 1 0 1 3 5 5 3 2 4 4 0 4 -1 2 5 3 4 5 0 5 2 2 3 2 2 4 0 7 3 7 2 3 2 0 4 5 0 8 6 -1
3.70896 -1 6 2 3 3 4 2 5 3 5 0 4 1 2 5 3 0 8 2 4 5 2 7 7 -4 4 2 2 1 5 6 4 3 4 6 5 2 4 2 5 3 0 4 3 2 2 0 1 4 4 0 6 4 4 6 2 4 6 2 4 0 3 5 1 1 2 3 10 2 3 2 8
3.66562 8 2 6 4 5 2 2 6 -2 5 3 4 4 0 4 1 6 1 5 3 10 0 4 1 2 5 6 5 3 9 7 4 6 6 0 7 4 4 7 3 3 5 6 7 4 4 5 7 14 11 17 15 12 11 12 8 12 8 4 8 6 5 6 5 6 4 5 8 0 5 7 4
3.62228 4 6 4 2 5 5 7 3 4 3 6 6 3 3 4 3 5 7 4 5 4 3 4 2 7 5 3 6 5 4 7 4 5 7 1 5 6 5 2 6 4 0 8 12 10 4 6 2 9 6 6 6 4 6 3 7 3 6 8 3 1 3 10 3 10 6 6 6 2 6 3 8 3
$$ packed form
3.92688@jJ%TLlMkoQoKMlmL%TKj%KkTJ%TKlJTjk%KJkjM%jTLlJkJTjJ%jKj%mNKoOklKjK%KmLkTL
3.88293BnMjNn%JnPkjJ%KjNpkK%NnlM%jLnOmjM%lMm%LMrJ%TMjkKmLKlkQoJOp%JjJkKlKLJmLKjL
3.83898GoKTkJjKTpPljlN%j%LmjJTK%oNlMlTJLmMlKLn%JlMmOoKJjTKjkJOjpOlMnPoKT%lJl%MjK
3.79503E%nMlLmJLmK%jLmJKkOmJ%j%MklMoJLjKjm%NmLkj%Mk%TkJ%OqKkJTLmMlKmKJTj%lMj%TjT
3.75108AQqMm%LnPmkJNoJ2j1KkKlPknKTnJ2rMoJjJKT%kjK%mMnLTkJTnNl%Jj%KmPmMnJjkMJnQkp
3.70896aPmJ%JkLkKnMlJLklQoKJlN%j1Qk%jMJkjJKjlKkLklMjT%kJL%mOk%KmKTmKmLKm%JTPqJjO
3.66562HoMkJl%MqPkJ%mMlNnMkPj0MlJLJjkOklK%oPl%Lm%KJTl%JKPlOkljJmMmTMkjJjJkJLqNKl
3.62228DKkTL%KmJjL%l%JjKTlJjTJkNkTLjTLlJKoMJjlMkmQMkoKmPl%TkKlMmLKnkKPpPm%TmMlNn
$$ plain form
3.57833 3 8 8 4 6 9 6 14 4 6 6 7 8 2 9 9 9 11 6 8 5 6 6 5 8 6 2 7 7 2 10 6 5 8 8 6 8 8 6 2 10 10 6 11 5 9 6 9 11 16 22 28 24 24 21 18 17 15 15 12 10 9 8 5 9 11 8 9 11 8 12 10
3.53499 10 12 11 13 11 15 9 11 11 8 10 11 7 11 14 12 12 11 13 12 14 11 12 13 14 10 18 11 13 14 15 15 19 15 13 12 21 17 18 16 28 30 30 23 18 16 16 10 12 6 8 13 8 5 7 9 9 7 5 5 7 12 6 8 13 11 12 8 10 8 13 7
3.49165 7 15 10 9 14 14 14 14 15 20 14 18 15 13 12 13 14 17 15 13 14 14 14 18 15 17 22 19 23 22 25 27 29 28 22 26 21 20 21 19 18 17 20 20 18 19 17 21 16 19 16 15 18 15 21 17 24 18 23 23 20 18 19 22 22 22 17 25 19 17 22 15 17 19
3.44709 19 14 20 17 17 20 17 20 19 21 20 23 16 23 18 21 19 21 19 18 20 23 22 19 17 16 21 22 24 21 24 22 22 23 28 24 25 26 27 30 27 26 29 29 32 26 31 28 31 30 33 30 35 36 32 37 42 37 44 38 45 46 49 47 55 52 50 55 51 54 57 52 50
3.40314 50 47 53 47 51 49 55 55 54 56 53 60 56 65 63 66 66 70 65 72 77 74 74 76 82 86 85 85 84 87 81 84 82 86 86 87 89 86 91 95 95 103 104 113 117 120 118 126 124 134 137 142 145 149 161 165 170 178 182 193 206 217 227 242 251
3.36407 251 270 280 299 315 342 366 398 427 475 524 587 658 748 845 948 1048 1147 1249 1358 1490 1643 1818 2031 2285 2598 3017 3591 4377
3.34698 4377 5525 7300 10221 15208 22898 30697 32767 29292 25995 22900 19017 15434 12219 9090 6463 4588 3383
3.33660 3383 2612 2082 1711 1427 1218 1043 903 792 698 624 558 503 458 428 397 371 350 335 314 305 289 286 274 258 238 220 205 189 178 165 158 149 142 135
$$ packed form
3.57833CN%mKLlQj0K%JToP%TKnKlJ%jLkmN%nQmjL%kK%kmQ%mNoMlLKNOTm%lTjk%lkjTlMKlJKlMk
3.53499A0KjKkMoK%lKJmMLk%jKjKlJUmQpKJT%MmkjRmJkJ2K%pnk%oKoKNnlKT%kT%KNoKNkJmKkNo
3.49165GQnjN%UJNoMlkjJTLkTJ%TMlKNlMjLKTjoMnjJkjTL%kJkMnLljLlOmPoN%lkJL%TnQokNpKT
3.44709A9nOl%LlLjKjLpPnLkKkjKLjlkjNJKlLk%JNmJULljL%LoNlLjLlNJmNTnPoPJLkQlkNmLTnk
3.40314E0lOoMkO%jKlPmRkL%MnPNl%KOMj%jLoLkM%JKlNM%QJRMLkQkJ0LNLMJ2MNQMJ1J3J1J0J5R
3.36407B51J9J0J9J6K7K4L2K9M8M9O3P1R0R7J03J00R9J02J09J32J53J75K13K54L13M19N74P86
3.34698D377J148J775K921M987P690P799K070l475l297l095l883l583l215l129k627j875j205
3.33660C383p71n30l71k84k09j75j40j11r4p4o6n5m5l0l1k6k1j5k1rj6lj2j6k0j8j5j6j1j3prpT
$$ plain form
3.31585 135 123 120 112 107 107 99 99 91 87 82 81 81 75 73 72 69 71 66 72 64 63 58 59 54 58 51 52 48 53 46 51 46 46 50 47 46 44 45 45 42 46 46 50 50 52 57 58 61 63 59 56 62 54 57 55 54 57 65 73 87 115 159 171 135
3.27678 135 123 118 106 86 80 70 54 47 41 28 36 27 28 30 28 30 28 30 30 32 35 27 30 31 27 29 36 37 39 42 46 45 58 58 56 52 46 42 39 31 28 25 26 22 18 20 20 19 17 15 14 17 16 15 21 16 17 15 14 17 14 12 13
3.23832 13 10 16 12 17 14 8 12 17 12 16 17 15 13 15 11 14 19 10 12 11 13 14 15 18 19 19 17 21 14 19 17 22 21 14 18 15 19 18 16 18 17 16 28 24 28 27 23 27 28 23 24 21 19 22 22 20 22 19 21 25 20 22 21 23 20 22 25 26 26 25 24
3.19498 24 29 31 25 32 34 33 36 32 35 29 31 23 24 21 20 22 12 18 14 15 16 13 14 10 16 11 19 15 17 18 2 0 2 -2 2 5 0 6 4 1 2 1 6 6 10 8 12 10 10 8 13 10 9 10 10 11 14 11 13 16 14 14 14 13 18 12 15 16 12
3.15286 12 15 12 18 16 19 19 17 22 21 19 23 23 27 25 29 25 25 26 24 22 23 29 22 21 24 21 23 26 20 29 25 27 25 27 24 28 26 28 29 30 26 27 31 29 28 31 31 31 34 29 35 31 30 33 29 30 29 32 33 35 32 37 28 37 36 41 35 42 41 47 44
3.10952 44 42 50 47 49 56 55 54 61 65 62 68 69 76 78 82 86 89 97 103 107 114 119 134 143 151 165 177 192 202 228 248 272 300 334 368 400 448 494 549 616 689 785 894 1045 1227 1461
3.08144 1461 1736 2067 2421 2759 3042 3249 3394 3469 3457 3338 3112 2829 2506 2179 1873 1594 1344 1127 942 796 678 578 503 435
3.06679 435 389 343 309 277 252 228 206 188 172 160 148 134 123 120 112 102 100 88 84 85 80 71 70 65 63 64 57 58 58 51 53 49 43 49 44 42 39 39 34 35 32 32 32 32 29 31 27 30 27 28 22 25 26 23 19 21 20 23
$$ packed form
3.31585A35j2lqn%q%qmnj%okjlKnOqjnJnMpJmNpNn%MljkJ%lM%M%KNJLKmlOqLkjLQTJ4K8M4J2l6
3.27678A35j2nj2k0oj0j6poj3QrJKkKkK%KLqLJmKPJKLMjJ3%kmomlqlTJmTK%jkTjLjTOnJkjLlkJ
3.23832A3lOmNloMNnMJkTKmLNrKjKJTLJ%kMpNkNjpMlMjkKjTJ2mMjmMJnJlkL%kKlKMnKjKlKLJ%jT
3.19498B4NKoPKjLmLoKqJljKj0OmJTlJmOnQmKJj6kKmMLnOklJjN%MkMk%kNljJ%JLlKLk%TjNoLJm
3.15286A2LlOkL%kNjkM%MkMm%JkTJOpjLlKLoRmKkKlMkKJTmJMkjL%TLnOmjLmJjLJKlNrRjNoPjOl
3.10952D4kQlKPjTPMlOJPKMTLQOMPNJ5RQJ4J2J5J0K6K0K4K8L4TL2M8M6N5O7P3R6J09J51J82K34
3.08144A461K75L31L54L38K83K07J45P5j2j19k26k83l23l27l06k79k50k17j85j46j18j00p5o8
3.06679D35m6Tl4l2k5k4k2j8j6j2Tj4j1lqj0kj2mJnrjnkJpJ%pKmoOnkl%nJl%UlKmLlJoLJlmKjL
$$ plain form
3.03139 23 19 28 19 24 19 22 21 20 21 25 20 19 19 19 19 27 22 24 22 21 22 23 20 23 20 26 28 32 26 36 34 35 36 38 39 39 36 41 41 38 38 34 28 34 28 28 24 20 26 20 21 21 22 19 23 17 17 13 19 15 21 16 17 12 16 15 19 16 16 10 13
2.98805 13 10 13 7 13 11 14 11 9 9 9 8 7 11 9 12 12 10 4 9 8 15 9 12 11 8 11 13 6 11 10 12 7 9 8 14 7 11 9 10 11 9 8 9 11 6 11 9 5 6 8 5 11 10 8 9 8 8 13 5 13 9 11 7 14 12 8 12 14 8 13 11 11
2.94410 11 13 10 18 11 17 14 11 16 13 16 10 15 11 16 9 12 11 12 11 11 13 14 13 13 14 13 15 14 15 14 14 16 14 12 14 8 11 14 6 14 9 9 14 10 8 13 9 8 11 10 13 10 13 11 12 8 11 8 7 10 10 10 5 8 10 9 8 9 11 5 9 7
2.90015 7 10 10 10 8 10 8 12 10 13 11 10 10 12 8 12 7 15 9 12 12 13 11 14 17 13 17 15 21 17 15 17 16 18 22 15 16 21 16 19 20 20 17 25 23 25 26 27 24 32 28 23 36 33 33 42 40 42 45 44 41 46 37 42 36 31 34 31 27 28 28 25 20
2.85620 20 28 22 26 29 24 18 24 24 26 26 21 27 21 27 27 27 24 25 28 25 26 28 26 33 31 34 34 32 39 33 37 35 35 38 41 40 38 44 44 43 45 46 51 48 50 54 55 59 59 63 68 70 71 73 80 83 88 93 107 108 115 129 138 147 155 164 178 187
2.81469 187 206 213 227 246 263 287 308 337 367 400 441 492 541 608 675 775 888 1039 1226 1476 1775 2140 2517 2865 3111 3278 3401 3485 3505 3409
2.79638 3409 3177 2863 2520 2178 1872 1586 1334 1107 921 766 648 556 477 420 370 326 298 260 237 215 192 179 159 152 139 130 125 114 112 102 98 97 92
2.77623 92 89 80 72 67 69 64 65 54 53 52 52 47 50 45 42 42 40 40 41 38 37 35 38 32 34 30 29 33 28 27 25 26 32 29 23 29 26 29 29 26 29 28 25 27 24 23 26 26 23 26 25 27 26 24 21 23 22 24 24 16 20 25 21 24 20 28 28 29 23 25 30
$$ packed form
3.03139B3mRrNnLjTJMnj%UQnKkjJTlLlOKMoJ0kJTKJ%lN%l%moOo%mTOoJ%JlMo%mOmOnJnMjMl%oL
2.98805A3lLoOkLlk%TjTMkL%koNjPoLjlLKpNjKnKjOpMkJTkjJKnNkmJKlOjkJj%NqQmKmPkmMKoNk%
2.94410A1KlQpOlTNlLoNmNpLjJj%KJj%JjKjJj%KkTKoLTqQn%NmkNmjLjLlLkJmLljL%TnLKjTJKoMk
2.90015GL%TkKkMkLkj%KmMnQoL%JkLTmMkOmkKjKMpJNnLJ%lQkKJTlQmnJ3l%RkKLjlNrNonLlmJ%ln
2.85620B0QoMLnoO%K%nOoO%TlJLlJKkPkL%kPoMk%LTjkO%jKJNlKMJM%MNKJKPLNTJ4JPJ4RTQRJ4R
2.81469A87J9PJ4J9J7K4K1K9L0L3M1N1M9O7TJ00J13J51J87K50K99L65L77L48K46J67J23Q4K0r6
2.79638C409k32l14l43l42l06k86k52k27j86j55j18r2p9n7n0m4k8l8k3k2k3j3k0pj3rnj1kj0mjn
2.77623I2lrqnKnJj1jT%nLnl%k%JljkLoKmjMnjkJOloOlL%lLjlKljL%lLjKjklKjK%qMNmLmQ%JoKN
$$ plain form
2.73289 30 28 29 25 32 28 26 28 22 23 21 26 16 26 16 22 27 24 24 26 25 27 27 25 27 27 25 25 24 26 24 21 24 22 17 23 22 18 21 17 16 16 14 19 15 14 13 18 13 15 12 18 12 13 15 11 13 19 11 13 16 14 19 14 12 14 11 14 12 16
2.69077 16 11 12 13 13 9 12 14 8 10 13 11 11 11 12 12 11 12 11 15 11 13 16 17 17 12 17 14 13 16 18 16 13 15 10 18 15 12 14 13 14 15 12 12 17 7 11 13 9 10 11 12 13 15 13 14 13 15 11 13 12 10 16 8 11 14 12 10 12 14 15 12 12 18
2.64621 18 15 13 15 12 13 14 10 14 18 13 16 16 13 20 19 19 19 17 19 22 25 21 26 26 26 29 35 39 40 37 45 37 42 38 37 36 34 30 29 26 26 33 37 45 55 44 43 38 32 34 28 25 26 19 24 16 19 17 18 13 19 18 17 19 19 18 18 16 20 25
2.60348 25 20 20 27 30 30 29 32 35 39 43 38 43 42 41 44 44 36 39 33 33 32 28 32 27 31 31 32 32 35 32 37 34 37 30 30 27 26 25 20 21 22 18 22 21 20 21 23 32 38 51 44 37 35 31 34 24 25 22 17 15 15 14 18 11 18 8 19 11
2.56198 11 15 13 12 15 18 11 16 8 13 14 6 14 12 13 15 11 11 12 9 14 13 6 10 11 12 13 13 9 14 12 12 13 15 15 13 9 10 13 12 15 14 12 11 13 16 11 12 14 6 17 11 15 7 13 9 12 13 16 15 11 18 10 13 12 14 17 12 12 16 10 18 15
2.51802 15 19 17 16 17 15 18 17 19 23 23 25 27 32 32 36 41 47 52 67 76 97 117 143 155 169 165 173 168 171 187 215 247 291 319 324 319 307 294 293 299 316 357 401 444 445 422 390 361 335 320
2.48750 320 308 311 322 339 333 314 284 255 227 210 193 186 178 179 174 157 139 122 105 93 75 66 54 39 38 33 30 25 23 22 15 20 21 19 18 16 21 17 16 16 16 13 16 17 11 20 16 12 17 12 16 12 14 7 9 12
2.45332 12 8 12 10 10 10 13 12 9 12 13 8 12 13 15 11 7 11 2 10 8 5 9 4 9 10 6 7 11 4 12 6 9 8 8 9 11 10 8 6 13 7 8 10 7 6 8 9 9 8 10 6 8 12 8 7 10 4 7 10 6 5 7 5 9 9 10 8 6 9 5 6 10
$$ packed form
2.73289C0kJmPmkKoJkNj0J0j0ONl%KjK%kK%k%jKklLknOjmLmj%kNmjTNnKlOoJKmKOqKLkNnkKlLkM
2.69077A6nJT%mLKoKLk%TJ%jJjMmKLJ%nNljLKklKnQlTKjJTl%Nj0MKmJVKkJjKmKjkOqLTkTKTJl%O
2.64621A8lkKlJTmMTnL%lPj%TkKLTmN%TLOMJlQqNmjTkmjl%PMQJ0j1jnoKolJpNqLkJnOjTK%j%kMN
2.60348B5n%PL%jLTMTnNjTL%qLo%jmMnM%J%LlNlLp%ljTnJTmMjTJKROJ3pTkmLj0Jlnk%jMpPj0J1q
2.56198A1MkjLTpNqNJqQkJKm%JlNjpMJU%mNk%JK%kmJLjLjkjKLnJKqJ1oMqOmLJLjmPqLjKLn%MoQl
2.51802A5MkjJkLjKM%KTN%MNONJ5RK1K0K6J2J4mQnLJ6K8L2M4K8Nnj2j3jOJ7M1M4M3Jk3l2k9k6j5
2.48750C20j2LJ1J7oj9l0k9k8j7TpqJnj7j8j7Tj2j8rj2j5jnlnkjpNJkjkNmj%TlLJoRmTNnMmKpKL
2.45332A2mMk%TLjlLJnMJKmTMrQklMnNJmJMpQoLj%JKjkTPoJKljKJ%jKmKMmjLoLTmjKkM%JkTLmJM
$$ plain form
2.40937 10 7 12 8 8 8 8 10 17 10 10 12 6 13 7 8 11 12 6 7 9 7 5 7 4 9 4 8 6 5 2 8 7 1 4 6 6 11 8 6 8 2 11 7 9 10 5 9 4 10 4 8 5 6 6 4 5 1 7 5 5 4 3 3 3 3 5 11 4 11 7 4 9 4 7
2.36420 7 8 3 3 5 4 7 2 6 5 8 5 0 5 6 5 2 8 5 7 5 3 7 4 5 2 2 3 7 4 4 0 3 3 6 2 2 3 0 6 4 1 1 3 5 4 -1 3 3 3 0 5 0 7 4 4 3 2 9 2 7 3 3 3 4 4 13 0 5 7 0 5 0
2.32025 0 7 0 7 -1 0 5 0 6 7 1 0 2 4 2 2 5 2 6 7 0 4 -1 4 2 4 2 8 5 6 3 2 0 3 4 -2 6 3 3 5 2 1 0 3 3 7 5 5 0 6 4 1 4 4 4 3 2 7 -2 5 -4 6 2 4 5 0 5 3 1 2 1 3 1
2.27630 1 1 1 6 6 5 6 4 6 5 0 2 4 3 6 6 9 4 6 4 3 4 6 4 5 7 4 6 6 5 3 7 4 6 4 7 5 7 4 5 8 2 6 4 2 3 2 0 5 2 4 3 1 5 2 0 6 8 4 3 3 0 1 3 5 3 3 1 4 5 3 3 5 5
2.23174 5 -2 0 0 3 7 6 2 3 0 2 6 4 0 2 7 1 4 4 0 6 2 0 1 0 1 2 6 -1 0 6 2 0 6 1 4 1 3 2 1 2 4 4 1 4 1 3 1 0 3 3 -2 4 0 9 0 3 0 2 4 1 1 4 3 3 7 1 0 2 4 0 3 0 3
2.18718 3 2 0 0 1 1 6 3 -1 5 0 -4 8 0 4 1 3 3 4 0 1 5 0 2 2 0 10 0 2 1 4 1 -1 0 1 3 0 4 1 1 2 2 3 7 0 2 3 0 3 4 3 3 0 2 3 3 0 1 0 2 0 1 4 1 1 4 5 3 -1 4 2
2.14445 2 2 2 4 3 2 3 -1 4 4 3 2 0 3 5 1 0 3 3 0 5 0 2 0 1 0 1 1 -1 0 -1 2 3 5 1 0 5 1 0 5 3 4 5 2 5 2 2 5 6 1 -2 4 -1 3 1 5 2 0 3 1 0 3 5 0 -3 0 1 0 5 0 2 0 2 5
2.09989 5 -1 2 0 6 0 5 1 0 2 1 6 3 4 3 4 1 1 4 1 0 0 5 3 0 3 6 4 0 0 -2 4 1 7 1 3 3 3 3 3 1 7 2 4 8 4 6 0 5 4 3 5 1 5 3 1 6 0 11 1 3 3 4 1 2 4 2 2 5 4 3 1 0 0
$$ packed form
2.40937A0lNm%UKPp%KoPoJLJoJKkTKlNnMkjlOjoLK%NlkKoRmKJnMnOoMlJ%kJmOk%jT%UKOpPmlNnL
2.36420GJn%KjLnMjLlnNJjlOlKkTMlJl%JMl%mL%Lm%JlOkl%KTjnM%TlNnPl%jTPpNm%TJ%Rj3NKpNn
2.32025@PpPqJNnOJojKTk%LlMJpMnNkKkOlJljkLJoQl%KljTL%Mk%nOklL%TjTNrPrJ0mKJnNkTJjKk
2.27630A%TN%jJkKjnKTjL%LnKkjJKkJKlK%jkMlKkLkKlJLoMkTJjkNlKjkMlkOKmj%lJKTk%kLJk%K%
2.23174EpK%LMjmJlKMkmKNoL%mOmkJjJTMpJOmkOnLlKjTJK%lLlKkjL%nOmRrLlKTl%Lj%MojKTmLlL
2.18718Cjk%J%NlmOnmJ2qMlK%JmJMnK%kJ0j0KjLlkJTKlMl%J%JMpKJlLJj%lKJ%lJjKkJLl%LJkmNk
2.14445B%TKjTJmN%jTkLKmjL%lNnKkJjJ%kJjLJKmjNmjNkJTlLl%LJnlOnMkMlkLkjLKnlLJjNnKkKL
2.09989EoLkOoNmjKjNlJjJl%Llj%NklLTkm%kOlOoK%VkOnKMmKoNjTKmMkTNoJ1j0K%JlJKk%LjTkj%
$$ plain form
2.05533 0 1 1 6 1 6 4 5 2 5 8 1 0 3 3 2 5 4 4 2 5 4 2 1 2 5 2 2 3 3 2 3 4 3 2 -1 3 4 1 2 2 4 4 4 -2 3 2 0 2 0 2 2 5 0 7 3 -1 4 2 2 3 4 1 7 3 3 3 4 3 4 1 4 6 0
2.01076 0 8 3 3 1 0 0 4 0 4 3 1 3 3 3 0 1 1 0 2 0 4 8 -1 1 2 2 3 -1 2 4 -1 0 6 -1 4 3 2 6 0 3 4 3 -3 4 2 2 4 3 2 3 6 5 9 11 15 18 11 9 11 9 11 6 4 2 4 -1 3 2 0 3 3 3 3 1
1.96559 1 4 3 1 5 0 4 3 3 0 2 2 -2 6 1 0 5 0 3 3 2 1 0 0 0 2 -1 1 0 3 1 8 1 3 0 2 2 4 3 4 4 0 5 3 2 0 1 3 0 3 0 3 2 3 2 0 2 -2 1 6 0 1 2 0 3 -1 1 0 1 2 7 0 3 2 3
1.92042 3 1 0 -1 3 0 2 0 4 -2 2 4 3 2 -1 3 2 1 0 3 1 2 3 5 4 4 5 7 7 4 1 3 1 0 4 1 0 0 1 5 2 1 3 3 3 -2 1 1 3 0 3 0 0 2 2 1 3 -1 1 0 2 2 4 -1 1 3 5 3 0 3 5 1 3 1 1 4
1.87464 4 -1 4 0 2 3 0 1 2 -1 4 -2 1 -1 7 -4 1 0 5 4 2 -2 2 2 2 1 5 0 4 5 0 0 3 3 0 4 4 2 4 3 1 5 -1 4 5 2 4 0 5 7 1 0 3 2 2 2 4 0 4 4 4 7 2 5 5 9 3 4 6 6 7 9 5
1.83069 5 13 9 20 18 24 32 38 39 36 33 31 21 25 18 14 18 8 8 4 6 9 2 2 6 2 4 4 4 5 0 6 0 3 5 6 6 0 1 7 -1 3 5 0 3 1 -2 4 3 0 2 2 0 0 4 0 3 4 0 1 1 0 0 4 4 2 5 1 1 3 0
1.78796 0 0 5 4 3 -1 2 3 1 2 0 0 3 2 2 4 3 1 2 2 2 4 3 1 0 5 3 6 5 1 0 1 0 4 5 3 6 3 -1 3 2 2 3 4 -1 0 4 0 2 -1 3 3 0 1 5 1 4 5 0 4 1 4 -1 0 0 4 0 -2 5 2 0 6 5 2
1.74340 2 4 0 2 4 0 5 2 3 3 3 2 2 6 5 1 3 0 5 4 -1 1 2 1 3 2 3 0 3 1 4 9 1 2 1 -1 3 3 0 0 0 5 3 1 2 0 -1 8 1 0 0 3 0 5 2 4 5 2 6 3 0 0 2 1 2 1 0 1 2 -5 0 7 7 2
$$ packed form
2.05533@J%NnNkJlLTpjL%jLj%kLjkjJLl%J%jJTjTlMJlJ%K%ToNjkKkK%LnPmTNk%JTlOm%TJjJlLKo
2.01076@Qn%kj%MmMjkK%TlJ%jKkMTrKJ%JmLKnJOpNjTMoLJjoPk%KjTJLjMKMLpkKkKnkTKnMjkL%Uk
1.96559ALjkMnMj%lK%mQnjNnL%jU%TKlKjLkPpKlK%KjJ%mNkjkJKlLlLjJjkKmLNoJTkLmKjJTNpLjJ
1.92042CkjTMlKkMoMKjTlMjULkJTKj%JK%lTKkjMlj%JMljK%TnL%KlLl%K%jKmKjK%KnKUklLKmKk%L
1.87464DnNmKJlJTlNoLkQj1NjNjkmM%TjMnMJn%L%lM%kKjkMoNJlKmNKojLj%TKmM%TLnL%MoJK%JKm
1.83069EQmJ1kOQOJlTkj0MpmMj0%mKLp%MmK%TJnOoLKJ%oJOqMKnLklOjlK%k%MmLJmJ%j%M%kLm%Kl
1.78796@%NjTmLJkJk%Lj%KjkJ%TKjkjNkLjmjJjMJkLlmMj%JTnJMmKlM%lJMmLJnMlLnJ%MmkPlkOjl
1.74340BKmKTmNlJ%Tj%MjmKlNjnKJjKjJlLkLNqJjkM%l%TNkTJkjRpj%LlNlKJlMlT%KjJjTJTpNP%n
$$ plain form
1.69884 2 1 1 3 4 0 1 3 -1 4 0 0 1 0 0 3 1 0 1 -1 4 6 2 0 1 5 3 4 2 3 4 3 2 -2 1 4 0 1 1 3 3 -2 2 0 6 4 1 3 0 5 2 2 6 1 4 1 0 1 0 5 1 7 0 6 2 4 -1 5 3 0 5 2 2 4
1.65428 4 4 3 1 4 9 9 2 4 6 0 3 0 -2 3 -1 4 3 3 0 3 -1 4 4 0 8 1 2 0 2 1 4 0 3 6 7 3 8 5 7 4 4 5 9 5 6 4 2 3 5 1 1 4 3 8 4 5 1 8 3 3 2 5 5 5 5 3 1 3 1 4 0 5 3 3
1.60911 3 6 5 3 7 2 3 1 5 2 6 3 5 7 2 6 3 5 1 7 3 3 5 1 0 3 4 2 5 7 -3 3 -1 0 3 4 0 5 2 3 1 0 3 2 5 3 2 3 2 5 3 5 3 3 3 -2 6 1 2 2 0 1 0 4 0 5 1 4 0 1 6 0 0
1.56516 0 6 -2 0 1 0 1 4 3 3 7 3 3 2 4 4 6 3 6 4 0 3 6 0 1 3 9 3 4 1 0 1 2 2 4 2 6 2 0 -2 5 1 3 6 4 4 2 0 7 3 -1 3 2 4 1 4 0 6 -3 3 -1 1 2 5 1 1 2 4 2 2 3 4 4 2
1.52060 2 7 5 0 4 6 0 5 2 2 7 2 4 4 3 2 1 1 1 1 1 3 1 1 5 4 2 2 3 6 1 4 2 7 3 3 3 1 2 0 4 3 2 1 2 5 1 5 1 4 4 2 3 2 1 6 0 7 1 6 4 3 5 5 3 4 3 1 3 3 3 1 2 -3 0 4 1 -2
1.47359 -2 1 3 2 0 0 4 4 3 2 2 2 3 2 1 3 2 1 3 6 5 0 3 1 0 1 9 0 6 5 1 3 5 0 -2 3 0 4 0 3 -1 5 2 5 6 2 5 0 3 2 7 1 0 3 3 1 5 4 1 4 3 4 2 4 1 4 4 2 3 2 -1 -2 2 1
1.42903 1 1 2 3 0 0 4 0 1 0 0 1 3 7 3 3 -1 0 4 0 4 0 6 0 -2 5 0 4 6 2 2 1 4 3 0 4 7 1 2 1 0 8 3 5 5 4 5 9 3 6 7 4 7 4 0 10 2 3 3 3 8 4 5 0 7 0 3 5 5 0 9 8 10 12
1.38447 12 10 8 6 4 5 3 5 4 6 5 7 5 7 4 4 1 6 1 5 2 6 12 3 7 5 6 1 3 2 7 2 4 3 5 5 7 0 5 3 6 4 4 4 4 8 2 3 3 9 3 6 7 6 6 6 3 9 4 4 4 9 4 9 5 6 1 7 3 8 4 4 5 4 5 4
$$ packed form
1.69884Bj%KJmJKmNm%Jj%LkjJkNKmkJMkJkJTjTmLTmJ%K%nMkOklKlNl%MnLljJjNmOpOmKnOklNl%K
1.65428D%jkLN%pKToLlkNmNj%lLmN%mQpJkKjLmLTJmNlKl%JMmJkTJKm%LjNmJmPn%jL%UkTKkLmNk%
1.60911CLjkMnJkMlMlKTnMlKmOm%KmjLJkLKj0OmJLJmNlJkjLjLkjJjLkKk%TnQnJ%kJjMmNmLmJNo%
1.56516@OqKJjJLj%Mm%jK%KlLkmLToJKOoJljJT%KkMmkTPmKLk%kTPmTMjKlLmOrOmKJLm%JKk%JT%k
1.52060BNknMKoNl%NnK%jU%VKk%Mjk%JLnLkNm%TkJkMjUJLmMmL%kJjTNoPoNkjK%kJjkK%TkJnLMlT
1.47359bLKjk%M%jT%TJjTKjTKLjnLkjJQrOjmKTnkNlMmLmOlLJmLnLjNojL%kMjlLjJkKlL%kJjljMj
1.42903A%JTl%MmJj%JKMm%mJMmMmOokPnMKm%jLjlMLoJjTQnK%jJMoLJlLlmJ0qJ%TNmJnPpLK%nRjKT
1.38447A2kVJkKjKjKkKl%lNnMlMOrMkJnKjNnKjK%KpNkLk%UMoJ%OoLJj%TlOn%TNnNmJnOmNm%JjJj
$$ plain form
1.33869 4 7 5 4 8 2 6 5 2 2 6 3 4 9 0 9 2 0 6 2 5 7 4 8 8 7 2 5 7 4 5 0 6 5 4 4 6 4 8 1 4 3 1 7 0 9 1 6 2 2 6 5 7 6 5 2 4 7 8 0 6 2 4 3 5 2 3 6 3 8 2 8 5 10
1.29413 10 1 7 7 3 4 2 5 8 4 5 6 4 4 4 8 7 5 6 5 8 5 5 5 1 7 4 10 7 5 7 3 5 8 8 7 3 5 5 5 9 7 5 8 11 4 5 13 7 7 1 4 4 2 4 4 5 8 4 9 6 6 3 9 4 9 4 5 8 7 6 7 7
1.25018 7 11 4 9 8 7 5 10 7 9 6 10 4 9 7 12 5 10 11 7 15 6 10 6 8 6 9 7 11 7 10 12 8 10 10 7 9 8 9 11 12 8 8 8 9 12 12 7 9 16 9 12 12 15 12 18 11 12 16 12 11 7 10 11 14 13 9 13 9 12 17 14 6
1.20623 6 19 9 14 16 11 17 15 14 20 11 16 15 15 20 18 17 17 16 21 14 17 17 18 13 14 9 18 15 19 17 14 15 12 14 13 11 11 9 8 7 13 8 6 8 6 12 7 4 7 8 8 9 4 7 4 3 8 5 11 8 2 9 8 4 6 4 2 14 2
1.16411 2 15 14 12 10 9 5 6 5 0 6 0 4 4 5 6 1 3 6 4 8 7 7 4 4 8 9 1 1 7 4 4 2 1 5 2 6 3 9 4 9 11 7 4 8 5 6 7 5 8 5 3 7 3 5 2 9 5 3 4 0 4 3 7 2 4 2 0 2 3 1 6 3
1.12016 3 9 5 4 8 8 3 6 4 5 0 5 3 1 7 4 5 0 6 3 5 4 7 1 3 4 4 5 3 3 4 0 5 0 7 1 5 1 2 4 7 12 8 4 7 6 7 5 4 10 2 4 3 2 4 1 5 2 3 3 2 3 1 4 7 5 6 4 6 8 6 8 4 4
1.07560 4 2 4 4 4 3 1 5 1 6 4 6 1 6 3 3 7 4 4 5 4 3 4 0 2 1 2 0 2 0 0 4 5 3 4 6 4 6 5 3 3 8 2 1 4 2 8 2 0 4 1 5 0 5 0 3 6 6 2 1 9 1 3 4 3 1 7 1 5 3 1 2 5 1
1.03104 1 7 4 1 7 7 2 5 2 5 6 0 2 6 1 3 2 1 6 0 5 2 1 1 -3 -1 3 0 1 2 0 3 4 3 5 6 9 4 0 1 4 3 2 0 4 6 4 5 0 0 1 0 3 4 -1 1 1 1 1 3 1 1 6 4 3 3 0 3 3 5 4 6 1 6 0
$$ packed form
1.33869DLkjMoMjl%MlJNrRpkOmLKlM%jnLKlJnOjT%KkMpLjkOpRqNm%MjKjTlKLJqOmKjKlJLlNoOlN
1.29413A0rO%mJkLTmJTk%TMjkJjLl%TmOlOlkKmKL%jmK%TMkTLTpJQo%oL%kK%JLmNl%lOnNnJLjTJ%
1.25018GMpNjTkNlKlMoNkNpNJmQrMmKkLkMmLKmK%lKjJKJm%TJL%nKPpL%LlOpJMmjmLJLjmMmLNlq
1.20623FJ3j0NKnOkjOrNj%Nkj%jNpL%JnJnRlMklJlKjk%kjTOnkKkOnlLJ%JnLljNlOloPjmKkTJ2j2
1.16411BJ3jkTjmJjnOoM%JTnKLkMj%l%MJq%Ol%kjMlMlOnNKmlMlJTkLlkMmKlPmkJmMjMnKkTKJkNl
1.12016COmjM%nLkJnNkTOlJnOlKjLoKJ%Jk%JmNnPoMmJKLNmTLjJkjOqKjTKlMlJ%jJkLTkJkKTkKm%
1.07560DkK%TjkMmNkKnNl%Ml%JjTJmKjJkKk%MJkJKkKjk%NojLkOokMlMnNnLT%mjQqKJjkOoMkTJLm
1.03104AOlTO%nLlLJoKMnKjTNoNlj%mKMlJTkLJjKJLnmJLjTkMKkJn%JjLJnK%UKk%Nkj%lL%KjKnNo
$$ plain form
0.98587 0 0 3 -2 1 4 0 2 -1 0 0 0 0 0 1 0 3 0 0 0 0 3 1 1 0 2 0 0 2 -1 0 3 -2 4 -2 2 4 1 -2 -3 1 5 0 3 2 0 0 2 0 2 3 0 -1 2 3 0 1 -1 0 3 0 4 0 0 0 -1 8 2 3 0 3 1 2 1 3 4 2
0.93947 2 3 -2 3 0 2 0 3 4 2 -5 6 0 2 0 2 1 3 1 3 5 1 -1 6 4 6 1 7 4 6 4 8 5 7 1 7 4 1 3 0 0 1 3 1 5 5 8 0 5 1 0 3 3 0 2 0 1 0 6 5 1 4 2 1 2 0 9 8 12 12 13 10 14
0.89552 14 8 4 8 5 3 1 3 2 0 10 -1 2 3 -1 3 4 -2 7 0 1 3 3 1 2 7 3 6 2 2 1 3 0 4 0 6 4 3 8 5 7 1 8 6 0 2 1 1 4 1 8 0 3 7 3 3 0 3 1 0 6 4 3 5 5 7 5 5 5 3 6
0.85279 6 1 8 5 3 0 5 3 6 4 7 2 2 2 2 6 5 6 5 3 6 10 8 3 8 4 5 4 4 6 5 10 5 7 8 5 10 4 4 6 12 4 7 6 7 1 5 5 5 6 5 3 4 7 5 6 0 8 5 0 7 7 7 6 10 4 5 3 8 3 4 5 1 9 7
0.80762 7 6 0 5 -1 3 3 6 4 -2 0 1 2 0 3 0 -1 1 8 0 7 5 5 -1 -1 2 5 8 6 1 7 2 1 3 2 1 2 1 4 -1 5 7 -1 -3 1 -2 5 -3 0 1 0 5 -1 4 0 4 -2 0 2 1 0 1 -2 0 2 -2 4 1 2 3 0 0 4 4 2 0
0.76184 0 4 1 3 -2 0 -3 1 3 2 4 -1 0 0 -3 0 1 1 2 -2 -3 0 -1 1 0 0 0 -2 -3 1 2 -1 4 -5 1 -2 4 0 3 0 0 1 1 0 1 -1 0 0 0 2 0 0 3 -1 -1 0 1 -2 3 0 -7 3 0 6 3 1 2 -2 -1 0 -3 1 3
0.71789 3 3 -2 2 1 5 5 0 0 2 3 3 1 -2 0 2 0 4 -2 -2 0 3 0 0 2 -3 -1 2 3 -1 2 -5 1 2 0 -1 -1 0 0 -2 -1 3 -2 3 0 1 -2 0 -3 -2 4 2 0 0 4 -2 -1 0 0 2 -2 3 0 1 2 3 -2 0 3 -3 0 0 -2 2 3
0.67272 3 0 -2 0 0 0 0 0 -5 -1 0 0 0 1 -1 2 -1 2 1 1 0 4 -3 -2 0 0 -5 1 -2 -3 1 -1 -2 -3 3 -2 0 -2 0 -1 0 0 0 3 -1 0 0 1 3 0 2 0 1 -5 -1 1 -2 0 0 -1 5 0 2 -3 1 -1 2 0 3 -1 1 -3 -3 -4 -1 1
$$ packed form
0.98587@%LnLTmKlJ%VJjLl%ULk%jKk%KlJLnOoMKlTjMTnLjk%KkKJljLJlJkJLlMm%TjRoJlLkJjKJk
0.93947BJnNlKkLJkpJ1oKkKjKkKTmkPkKnOlKkMlKoOlTKl%JKkM%LqNmjL%lKkJjOjmLkjJkRjM%JlM
0.89552A4omMlkTKjkJ0j1LJmMJoRpJK%kJNmLm%jKlMmOkjNlKoPkoKj%LlPqLMm%lLkjOkjK%Kk%TkL
0.85279FnPlklNkLkLn%UMjJjkLMknNmJj%KjNnKJlNo%KOqLjJoM%TJjkJLkJoQlnP%TjMoJkNnJTmQk
0.80762GjoNoM%LkoKJTkLljKPqPk%o%LUknOnjKjTJjLnOKqkMlPqLJjNoNmMoKTjTJlKTmOlJTl%M%kT
0.76184@MlKnKlMKjKnJ%lLJ%JmjLjKj%TkjMJlNrOlOmLl%J%jJkJ%TKk%Lm%JTlNlpJ0lOlkJmJTlMK
0.71789C%nMjM%n%KJ%klKTkMo%KLl%KnKLJmLpOJkj%J%kJMnNlJlKlJOkT%MoJT%KmNlJUnKLoL%kMJ
0.67272ClkK%VnMJ%TJkLlLj%jMpJK%nOljMkjTOnKkKjJ%TLmJ%JKlKkJoMKlK%jOnKnMkLkLmKm%jLK
$$ plain form
0.62694 1 0 -1 -2 3 -2 0 1 0 0 -1 0 -1 0 -1 0 3 4 -1 1 -2 -2 3 -1 -2 -4 -2 0 -3 3 -1 0 -4 -1 1 1 2 2 -3 0 0 0 1 -2 1 3 -1 0 0 0 -2 0 2 0 4 0 -1 -1 1 -1 2 -3 -1 1 1 -2 -4 2 0 0 0 0 -2 4 -1 -1
0.58116 -1 1 0 -1 0 -4 2 1 -2 -1 0 -1 4 0 0 1 0 0 2 -4 5 -3 -3 -1 3 -1 0 2 -3 0 1 -5 1 -2 1 1 -3 0 3 3 0 -2 0 -5 1 -5 -2 0 0 -3 -1 0 0 3 5 1 0 -2 -2 0 0 -3 0 0 5 0 0 1 0 2 -3 3 -6 1
0.53659 1 0 0 0 0 0 0 1 0 -3 2 0 -2 2 1 5 2 2 -2 2 1 0 -4 -5 -1 1 3 -1 2 -1 -2 2 0 -1 4 0 0 0 0 -2 4 0 -2 -1 0 -3 0 -3 0 -4 0 -3 -1 0 3 0 2 4 -4 0 0 -1 4 -6 -4 0 0 4 -3 2 1 -3 3 -1 0 0 1
0.49020 1 3 0 1 -5 0 -4 -1 5 -2 -3 3 -1 0 3 -4 0 0 -1 0 -2 0 -5 -1 2 -2 1 -1 2 0 -1 -2 0 -1 0 1 -1 -2 0 -1 1 -3 2 2 -1 0 1 -3 1 -8 1 2 0 0 -6 0 0 0 -1 0 1 -3 2 -2 1 -5 3 -1 1 -3 3 -5 1 -3
0.44564 -3 0 -1 -2 0 -4 1 0 3 -1 1 0 1 5 -1 5 -2 0 0 0 -1 3 -2 0 0 -1 -2 2 1 -2 0 0 -4 0 -2 -1 0 0 -1 -3 6 -2 2 -1 0 1 0 1 -1 2 2 -1 2 1 -2 0 2 -5 -3 -1 -1 4 -4 -1 0 3 -1 4 -1 3 -5 -2 1 -2
0.40108 -2 -1 2 -2 0 -1 1 1 3 -2 -1 -1 2 2 -1 -1 0 0 0 -2 -1 2 0 1 -2 0 0 -1 0 0 0 0 0 0 -1 4 0 -2 -1 5 -2 2 2 1 0 3 0 -2 0 1 -2 -2 -4 1 -2 2 -2 4 -3 1 1 -2 -3 0 0 -1 -2 -2 3 -1 1 1 -1 0 0 -1 3
0.35469 3 0 0 4 -3 1 -3 -1 1 0 -1 -1 -1 1 -4 0 2 -1 -3 0 4 1 0 1 3 -3 -2 1 -2 2 1 1 1 -1 1 0 0 -2 -2 -1 2 0 -1 0 -2 -2 0 -4 0 0 -2 5 -4 3 0 1 -2 -1 -3 2 2 -1 -3 0 -2 0 -4 -4 -2 0 0 0 2 0
0.31013 0 2 0 -1 1 3 -3 2 -5 2 -2 -5 3 1 -2 0 0 3 0 0 -5 -1 -2 1 -5 -2 0 0 -3 1 0 -3 0 1 0 -1 0 -4 -2 1 -3 0 1 -3 1 1 -2 0 -1 2 -4 1 -1 2 -2 -2 -1 2 0 5 1 3 -3 -2 -4 5 -2 0 1 -3 0 0 0 0 0 -2
$$ packed form
0.62694AjUNnKJj%jJjJjJLJnKl%NmjkKTlOmJmLK%J%nL%TJlLKmJ%TkKTkMmj%KkLnKT%lkOk%UkOn%
0.58116aKjTJmOjlJTjNm%Jj%KoRq%KMmJKnLJoOlL%mLT%lkKnOoLK%lKJ%LKmjk%K%lL%Nn%JjKnOrP
0.53659Aj%WJjlNkTMjMl%mMjTmjMKTmLljMkjNm%UkOmkJTlLlLmMlKJLlKTqM%jNj0KM%MpNjmOmJ%J
0.49020AKlJoNmLOpjOmJLpM%jJkKnMLmLkLkjTKjJTkjKjKmN%lJTmMrRJk%oO%TjJTmNmLoQmKmOqOm
0.44564cLjTKmNjLmKjJMoOpK%TjMnK%jTMjlK%mMkJT%jkRqMlJTjJkL%lLjlKTpKT%NqLJLmNnMqLTl
0.40108bJLmKjK%KnJ%L%l%J%TkJLkJlK%jJ%WjNmkJOpM%jTLlkKJl%kNlMmOpM%ljL%jT%NmK%kJ%jM
0.35469Cl%MpMmKTjT%TKnMKlkLMljJKoJLlMj%TkKj%k%JLkjJk%KmM%kPrPlJlJkN%lkLkKm%KT%TKk
0.31013@KkjKToNpPmlQklK%Ll%nMjLoLK%lMjlLJjTJmKLmLJmM%lKjLoNkLm%JLkNmKoJkRpKJmL%Vk
$$ plain form
0.26435 -2 1 0 -1 1 -1 0 0 4 -3 0 -2 0 0 3 -2 -4 1 -4 3 -3 0 0 0 -2 -2 1 -2 2 1 -1 0 0 -1 0 0 0 -2 1 -2 1 -1 0 2 0 -3 0 -1 0 -3 1 0 0 0 4 -5 3 0 0 2 -4 0 0 0 0 2 0 -2 0 0 -2 -1 1 -1 -2
0.21918 -2 -1 -2 -1 -1 -1 -4 -5 0 -1 0 3 0 1 2 -2 3 3 -1 2 -3 2 -1 -2 3 -1 0 -2 -3 -1 0 0 0 4 0 3 2 -4 -1 2 -3 0 -3 0 -1 -1 0 -1 2 3 -3 1 3 -4 0 0 -1 1 -3 3 0 -2 -1 -1 -1 0 -5 0 0 0 -4 -1 -2 -3
0.17461 -3 1 -4 0 5 1 -2 0 1 -3 0 1 -3 0 0 -3 0 3 -1 2 2 -2 6 0 -1 3 1 -1 -1 1 -1 0 -2 0 -3 1 0 -4 2 -1 -2 0 1 0 0 0 -3 -1 2 -1 2 -4 2 0 -1 2 -5 3 -3 3 -2 1 -3 2 0 -2 1 -2 -4 0 0 0 -1 -1
0.13005 -1 -3 0 5 -4 0 2 5 2 -1 -3 1 -3 2 -4 0 -1 2 1 0 0 -3 3 0 -1 3 -1 -2 0 0 3 0 0 1 2 1 -1 0 0 -1 -1 0 -2 -5 1 1 0 -4 1 1 0 0 -3 1 -2 0 0 -2 0 -4 0 3 1 1 0 -1 -1 0 1 -1 1 0 -4 4
0.08549 4 0 0 0 -1 0 -3 -2 -2 -1 -2 3 -3 2 0 0 0 1 -3 1 0 -2 -1 -1 -3 -1 0 1 2 2 0 1 1 0 -1 -3 2 -1 2 -1 2 -2 1 0 1 0 0 7 -5 2 -4 0 0 -4 2 0 2 0 -1 0 0 -3 1 5 -4 3 2 -2 3 -4 2 -2 1 -1
0.04093 -1 -2 -1 1 -3 4 0 1 4 0 -1 -5 0 0 1 2 -5 2 -1 -3 0 0 2 2 0 -3 0 -1 -1 1 0 0 0 0 -4 -1 1 5 0 1 0 0 0 1 3 0 0 0 -4 -1 2 0 1 -2 3 -2 0 -1 0 -2 0 -2 1 0 1 1 0 2 0 -2 1 0 -3 3 0
-0.00424 0 3 0 0 2 1 1 0 0 4 -3 -3 -4 -1 -8 3 0 1 0 -2 7 -1 -2 0 -6 2 1 0 -1 0 -4 0 0 -1 3 -3 2 -2 0 -2 0 -4 1 1 -1 0 -2 0 1 1 -1 0 -2 -3 4 3 1 -1 0 0 1 -3 2 -3 2 -4 -1 -2 2 -3 0 2 0 5
-0.04880 5 0 0 1 -1 -1 2 2 0 3 0 4 5 -1 5 1 1 4 3 3 0 -4 3 0 1 0 4 1 0 1 -2 0 -3 0 2 0 -1 -1 -2 -3 0 4 -4 -1 0 -5 1 -2 0 -2 -1 4 -3 3 -4 2 0 -1 3 -1 2 4 -3 2 0 0 5 0 3 2 1 -1 5 -3
$$ packed form
0.26435bLjTKkJ%MpLkK%LnkNnPoL%Tk%LlMjkJ%jJ%TkLlLkJKklLjJlMj%TMrQl%KoM%UKkTK%kJKkj
0.21918bJjJ%TljNjJLlJTmN%mLnNljNmJkjKJ%TMmLjoLTnLlLj%JjLJoMKpM%jKmOlkJ%TJnN%TmLjT
0.17461cMnMNmlKJmLJmL%lLTmL%mQojMkT%KkJkKlMjmOljKJj%TlKLlLoOkjLpQoOnLmNkTLlkM%Tj%
0.13005akLNrMKLlTkMmNoMjLjT%lOljMmjK%Ll%JTjkJ%j%JklO%jmN%j%lMlK%kKmMLk%jT%JTkKjmQ
0.08549Dm%TjJlJ%JjNoNk%TJmMjkJ%kKJU%kJ%jTkNlLlLmLjJj%Pj2PoM%mOkKkjJ%lMTrPjmNpOmLk
0.04093ajJKmPmJLmjmN%JTpPlkL%K%klLj%Kj%UmLKMnJj%TJKl%TmLTkJlNnKjJkKkLjJ%jKkTLjlOl
-0.00424@Ll%Kj%j%Mp%jLpJ1lJjkRqjKoQjUJmM%jMoNmKkKmN%kJkKJ%kJkjPjkTJ%JmNnNoLjMnLKkN
-0.04880En%Jk%L%kLlMJoOm%Lj%lmPlJjMljJlKlLKkj%jTLMqLJnOlKkJNpOpOkjMmLKpNk%NnLjTkOq
$$ plain form
-0.09336 -3 -1 1 0 0 3 1 5 3 -6 -2 -1 -2 -3 -2 0 2 0 -1 -1 1 -2 0 -1 -1 -1 -1 -3 1 0 2 1 0 0 -1 0 1 5 1 -2 1 0 3 1 0 -1 4 6 -3 3 -1 1 -2 0 -3 2 -3 3 5 0 2 0 2 3 -6 0 3 -3 -5 -4 -1 1 3 -1 0
-0.13853 0 0 0 -1 0 0 1 -1 -2 1 3 -6 0 -2 0 5 0 0 -3 5 -2 -1 -4 -1 0 -2 0 0 2 0 0 -2 -1 1 1 0 0 1 3 4 -2 -3 2 -1 -2 1 -5 0 1 0 -3 4 0 -2 0 0 0 0 -3 2 0 -1 0 0 1 1 1 0 2 -5 3 0 3 1 2
-0.18370 2 0 0 0 1 -1 0 -2 5 0 4 0 0 -3 1 0 0 2 -1 -1 0 0 -4 0 -2 -1 -3 3 1 -1 2 -3 2 -3 -1 -2 0 -3 3 0 -2 2 -4 -1 1 -2 0 -1 0 0 1 0 3 0 0 0 0 0 0 3 -5 5 1 1 0 -2 -4 -3 -4 1 1 2 -1 2 -3 -1
-0.22948 -1 0 -3 0 -5 -2 0 -3 0 0 0 1 -7 0 0 -1 0 2 0 0 -1 3 0 -1 -1 1 0 0 2 -2 2 -1 0 3 -3 0 1 -4 1 2 0 2 0 -1 2 -2 2 1 3 0 0 -2 0 0 -2 0 1 2 3 -1 -3 -3 -1 0 1 -4 0 2 4 0 4 3 -2 0 -4
-0.27466 -4 1 5 0 1 0 -1 -3 3 -4 0 -1 -1 0 2 -2 -3 -3 1 0 4 0 2 1 -1 3 0 0 2 -2 0 5 0 2 -2 3 0 -2 -1 1 4 -1 4 -3 0 1 -4 1 -4 0 0 -1 1 0 -1 2 2 -3 3 -4 -1 0 -1 1 -1 0 0 1 -2 0 -1 -1 -1 -2
-0.31922 -2 -2 0 0 3 -3 -2 2 0 0 0 0 0 3 -1 0 -2 0 0 1 1 -1 0 0 0 -3 -2 0 0 -2 0 -1 1 -1 0 -2 2 5 0 3 0 0 3 0 4 1 1 0 4 -4 4 0 1 -5 -2 0 -5 -2 0 0 0 -1 0 0 1 -3 2 -1 2 1 0 -3 3 0 -3 1
-0.36500 1 -3 -3 4 -4 0 4 -1 4 -1 1 -1 0 2 -1 1 -5 2 -3 2 -1 0 -3 1 -2 -1 0 3 -3 1 -1 0 2 -3 0 2 -1 -1 -3 0 0 1 0 0 0 4 2 0 0 -1 5 0 2 -3 2 -2 4 0 0 3 -1 2 2 -4 -2 0 0 -1 1 0 0 2 1 0
-0.40956 0 0 0 0 0 -3 -1 2 -2 1 0 1 0 1 -3 1 4 0 0 -1 4 2 4 0 3 0 0 -3 0 -1 3 0 2 2 2 -2 0 1 7 0 0 -2 0 3 -1 2 0 -6 0 0 2 1 0 1 -2 0 0 -3 5 2 1 -2 0 0 1 0 -2 0 0 -2 0 2 -1 -3 5 -1
$$ packed form
-0.09336cKTj%LkMkrMJjTJKTkj%KlKj%UkMjKjT%jJTMmlLjLkjTNKrOmKlKlNnOKnKkKJrOLokJLKTmJ
-0.13853@%TjJ%JkjLKrOkKNn%lQpJlLJkK%Kk%kJK%j%JKJojNljLoNJjlPmkK%UlNkjJ%J%TjKpQlLkJ
-0.18370Bk%TJkJkPnMm%lMj%Kl%J%mMkJkOkTLnNnKjKlOlkMoLKlKjJ%JjLl%WLqJ0m%jkTJjN%JlLnK
-0.22948aJlLnLKlL%TJqP%jJKk%jMlj%Kj%KmMlJLoLJnNJkKkjLmMjKl%kK%kKJUmk%KJTnMKTmMjnKm
-0.27466dNMnJjTkOpMj%JKmj%MjMmKjkMl%KmKNnKmNlkJKLnNpLJnNnM%jKjTL%nOpLJjKkJ%JlKj%Tj
-0.31922b%K%LoJMk%VLmJkK%J%kJ%TlJK%kKjKkJkMLnLl%LlMl%jMqQmJoLKnLK%TjJ%JmNlLjTlOlTM
-0.36500Am%PqMTnNnKkJKlKoPnNlJlMlJTLoMkJKnLKl%kL%Jj%TMkT%jOnKnNmOm%LmL%oKT%jKj%KjT
-0.40956@%VlKLmLjJjJmMLm%jNkKmLl%lLjMlK%TmKJOp%kKLmLkoO%KjTJlK%lQljlK%JjkK%kKTlkQo
$$ plain form
-0.45534 -1 0 2 -2 0 0 0 2 -2 0 -1 1 -2 -3 -1 0 -5 1 0 0 -2 3 -2 3 -1 1 0 -1 2 2 2 1 1 1 -2 0 1 -2 1 0 4 -3 2 0 -3 2 1 -1 0 0 1 1 4 -1 3 1 1 0 -3 4 -1 -1 -4 -1 -1 3 0 3 -3 0 1 1 -2 3
-0.49990 3 -1 3 -3 -1 1 -2 0 0 -3 2 -6 4 -7 1 0 4 0 2 3 -1 -5 1 -1 -5 1 -2 1 2 0 5 0 -1 2 -2 2 -3 0 0 0 0 -2 3 -2 0 3 0 2 -2 0 0 1 0 0 1 0 0 0 -4 -3 4 0 0 0 0 -1 1 1 -3 -1 1 -1 5 -3
-0.54446 -3 0 0 0 -4 3 -2 2 1 -1 2 2 -4 0 0 0 0 0 -2 2 0 1 3 0 -1 1 -2 1 1 -1 0 -1 0 0 0 -1 0 0 -1 1 3 -2 -1 1 -2 -1 0 -2 -3 0 -2 -2 -2 0 -1 4 0 0 -1 0 3 2 1 -5 -1 2 1 -1 2 -1 2 -3 0 0 -1 3
-0.59024 3 0 0 -2 -1 0 -2 0 2 0 -1 4 -6 3 0 0 0 0 0 0 1 5 -1 -2 -1 0 -2 -1 -1 -3 -2 -4 0 3 1 -3 -4 -3 1 5 1 1 -2 1 0 0 -1 3 -3 -4 2 -2 -4 0 3 1 -2 3 0 0 0 0 0 0 0 0 3 0 0 -3 -2 -2 2 -2 2 -2 2 0 0 0 2
-0.63908 2 1 2 0 2 2 3 4 1 -1 5 -1 3 3 0 -3 1 0 0 4 1 -4 4 1 1 0 -1 0 1 -1 1 -1 1 -2 2 -2 0 0 -1 0 1 -1 0 0 0 -3 -4 1 7 3 0 -5 1 2 2 1 -1 -3 2 -1 -1 0 -1 4 0 -2 5 -2 2 0 -3 4 1 2
-0.68364 2 0 0 2 4 0 2 -1 1 0 -1 -2 1 2 -2 2 0 0 0 0 2 0 1 -6 4 -4 0 1 0 -1 -1 0 0 3 -3 -2 1 -1 0 0 0 -5 5 -2 -2 3 -1 0 2 0 1 0 -3 4 -1 4 4 0 -3 1 -1 2 2 -3 0 0 2 -4 1 3 0 3 0 0
-0.72820 0 -2 3 0 1 -1 -4 -2 -2 2 0 1 4 -1 2 1 -1 6 2 0 3 -1 -3 4 -1 1 0 0 0 1 -5 3 2 0 2 0 -3 0 0 0 2 0 0 1 0 0 5 0 1 0 0 1 1 0 -1 -2 -1 0 6 0 0 6 -3 1 1 0 0 5 0 3 0 2 0 1 1
-0.77337 1 0 1 3 -1 1 1 1 4 0 0 0 1 3 -1 0 1 0 0 3 0 -2 3 -1 1 2 0 0 0 1 2 6 -1 2 0 -1 1 1 2 0 4 5 3 0 5 0 7 1 0 -1 4 -4 0 -1 1 2 0 1 1 0 -1 3 1 2 1 2 -2 -1 1 2 -1 -2 2 0
$$ packed form
-0.45534aJKmK%TKmKjKljKJnOj%kNnNmKjTL%Tj%TlKJlLjMpNklNjkJ%J%LnMk%jlPn%lL%MlLoLJ%lN
-0.49990CmMoKTlK%lNqJ0j1QjMmKJmTOkmOlLJkNnjLmMnL%UkNnKLlKmK%Jj%Jj%TmJPm%UjK%mKTkOq
-0.54446cL%TmPnMjkL%oM%VkMkJKljKlL%kJjJ%TjJ%jKTnJKlJTkjLk%TKjNm%jJLjToMLjkLlLnL%jM
-0.59024Cl%kJTkKTkjNj0Rl%WJMojJTkJ%kJkMLkmjJMTm%lLj%jMojOmkMLklNl%YLl%lJ%MmMmMk%TK
-0.63908BjJkK%JTlkOoM%lTMj%MlnQl%jTJTkKkKlMmK%jJTkJ%TljNOmlnOJ%jkTNl%JjNmkPpMklPlJ
-0.68364Bk%KTmKlKjULJmMk%UKkJpJ0qMJjT%J%LoJLkJ%TnJ0p%NmJKkJjlPnN%mlMkL%nL%KoNKlLl%
-0.72820@kNlJklK%MkJLnLjkPmkLmkPnKj%TJoQjkKklL%TKk%Jj%NnJj%J%jUJTOo%OrM%j%NnLlKkJ%
-0.77337AjJKmK%TLm%TJKmJTj%LlkNmKJk%TJTMpLkjK%JkMJklNnPojTNqMjKJkJ%jTMkJjJmJKJljMk
$$ plain form
-0.81793 0 2 4 1 5 2 -2 2 0 0 -1 1 2 0 0 -2 3 -2 -2 -2 1 0 0 0 3 -1 -1 1 0 -1 -3 -4 6 0 3 0 4 0 -2 1 -1 2 -1 0 1 -1 2 2 1 0 2 1 2 1 4 0 4 -3 0 3 2 0 0 0 2 2 0 -1 0 2 -4 2 0
-0.86188 0 -4 0 3 0 -1 -1 -2 0 -2 1 0 5 0 0 3 -4 2 5 -1 0 0 -1 1 1 1 1 1 0 -4 5 0 -1 0 -2 2 0 0 1 0 0 -2 0 3 0 1 0 -2 4 0 -1 4 0 -4 0 0 3 0 2 3 -1 4 -2 1 1 4 -3 0 1 0 0 0 -1 4 0 3
-0.90766 3 2 3 2 -2 -2 2 0 3 0 5 -1 3 -1 0 0 1 5 1 4 -1 0 0 -1 -2 2 0 0 0 0 1 3 1 -3 0 0 5 2 2 0 -2 -1 0 -1 -1 0 1 4 -2 3 0 2 -2 4 1 0 0 -1 -1 2 3 -1 0 1 2 -7 -2 2 1 0 2 -1 0 0 1 -2
-0.95345 -2 0 0 0 2 -1 0 2 0 -3 -1 1 2 0 2 -1 -2 4 -3 1 3 3 0 0 -1 0 1 0 1 4 1 0 2 0 -2 0 0 -5 0 0 1 2 -2 1 0 4 1 -1 4 -4 -1 0 1 -4 3 -2 4 2 2 0 0 4 1 4 -2 2 3 0 1 1 0 -2 4 1
-0.99801 1 0 2 0 1 -6 2 -3 0 -1 5 -2 3 3 1 3 1 0 0 0 0 3 0 3 1 3 5 1 0 2 0 1 -4 0 1 -2 5 0 -3 4 0 0 -2 2 -7 -1 1 0 1 -2 0 0 0 3 -1 0 0 -1 0 1 3 0 2 0 2 3 4 2 -1 0 -2 -2 4 2 2
-1.04318 2 -1 0 2 1 0 5 0 1 0 1 6 6 -1 0 2 -4 -3 5 0 0 2 -3 5 0 0 3 -4 5 0 0 1 2 0 1 1 0 4 0 3 2 -2 -3 -3 -3 5 0 0 2 1 -3 2 1 -1 2 -2 0 0 3 2 0 4 -1 1 0 1 -1 5 -2 0 0 1 0 0
-1.08774 0 1 -1 0 1 2 3 2 0 1 0 -1 3 -1 0 -2 2 1 0 2 1 1 0 0 0 2 6 -3 3 -2 0 0 4 1 2 0 3 -4 0 3 2 -2 4 -2 -1 2 -2 3 0 0 3 -1 7 -1 1 3 2 0 0 -1 2 0 -2 0 -1 0 0 1 4 3 -2 2 0 3 -5 1
-1.13352 1 1 -3 0 1 0 2 2 3 2 0 1 3 2 -2 0 1 4 0 -1 0 0 -2 2 0 -3 -1 0 0 6 -3 0 -1 0 -5 0 0 0 -2 2 1 3 1 0 2 2 1 4 2 1 0 -1 3 0 3 1 0 0 0 7 0 1 2 0 2 -1 3 1 2 1 -1 -5 -1 0 0
$$ packed form
-0.81793@KTlMlmMk%jKJk%kNn%TLj%TLm%KjTkjJ0oLlMmkLkLlJTkL%jTKjJjLmMpLTjk%TK%kjJKoOk
-0.86188@mMLlj%jKkLjNn%LpOLoJ%jK%VjmRnjJkMk%Jj%kKLlJjkOmjNmTM%LlKJmNoL%LpLJj%TjNmL
-0.90766CjJjm%MkLlNoMmJ%JMmLnJ%jTMk%UJKkmL%Nl%kTJTj%JTLoNlKmOlj%j%LJmJUrNMjTKlJ%Jl
-0.95345bK%TKlJKklKTJkKljOpMK%l%jJTjJLljKkTK%nN%JTmLjMlkNqLJTnPnOk%k%MlLoMJlJ%jkOl
-0.99801AjKkJpQnLjOpN%kKkj%ULlLkKTmjKkJnMJlPnlPm%kMrOKjJlK%TLmJ%jJTKlKkKJTklJk%Ok%
-1.04318BlJKjTNnJjJN%pJKoJQn%KnQn%LpRn%JTkJ%jMmLjmj%TQn%KjmNjkLmK%LjkMnKjJkOpK%Jj%
-1.08774@JkJVjkJjTMmJkMjTKj%j%TKMrOnK%MlJkLpMLjmOoJLmNl%LmQqKTjk%jLkTKjJ%JLjnMkLqO
-1.13352A%mLJjK%JjkJKjmKJLmjJ%kMklKJ%OrLjJnN%TkMjKkjK%jLkjUMlLkj%TPpJTkKlMkJjkmMJ%
$$ plain form
-1.17869 0 2 0 0 1 -4 1 0 1 2 0 3 4 -3 3 0 -1 4 0 -2 -2 -1 1 1 -3 2 0 -2 2 0 0 0 0 0 -2 4 -2 1 2 0 -1 3 1 0 3 0 3 0 0 3 0 4 -1 0 0 2 1 -1 0 -1 2 1 -1 2 -1 2 0 4 -5 3 -2 2 0 2 0 5
-1.22447 5 0 1 2 2 0 -1 2 3 -2 4 0 -1 2 2 -3 7 2 4 -1 4 0 0 0 1 0 0 0 5 -4 2 0 -1 3 -1 2 1 0 1 5 2 2 4 0 4 0 5 0 3 1 0 4 -5 -1 1 0 -1 -1 2 -1 0 4 -1 2 -1 0 -1 5 0 1 9 0 4
-1.26842 4 1 0 4 0 0 0 3 0 0 1 0 2 -1 1 3 2 1 -1 0 -1 0 0 -1 0 2 -1 1 0 1 1 -1 0 -3 2 3 0 4 -6 1 0 0 0 0 0 -2 2 3 -1 -1 1 -2 2 0 -2 -1 0 -3 2 1 0 4 1 0 0 0 0 3 1 -1 1 -2 2 0 2 0
-1.31420 0 4 2 4 2 0 4 1 -2 6 0 -3 3 0 3 0 1 2 0 3 0 4 0 -1 5 5 1 0 0 -1 1 -1 2 2 2 1 0 -1 4 3 0 0 -1 2 4 -1 0 5 -2 3 -2 5 -2 5 4 1 7 -2 0 2 -1 3 0 0 0 1 0 0 1 0 -1 0 -2 1 2
-1.35938 2 2 3 0 -1 1 0 2 9 -2 -1 1 -2 0 -4 2 2 1 2 -1 0 0 2 4 3 -2 3 -3 2 -1 2 3 -2 4 0 1 -1 3 -2 5 0 0 0 -2 3 1 2 0 0 2 1 3 1 -5 0 2 0 3 -1 0 -2 3 1 5 -1 3 -2 3 2 3 0 2 2
-1.40333 2 -4 2 0 0 2 2 -1 5 1 2 0 3 0 5 -3 -4 3 1 -2 3 2 -1 3 0 0 4 -3 2 3 4 2 0 0 0 1 5 2 -1 0 3 -3 1 0 0 2 2 -7 3 1 -1 3 2 1 2 0 4 1 -1 0 0 1 1 -4 3 1 4 0 2 1 -3 4 1
-1.44728 1 -6 3 -1 0 -1 -1 3 1 0 1 1 -1 2 0 0 3 2 1 -1 1 -2 0 4 0 7 -1 0 0 -1 -1 4 0 0 2 0 0 3 3 0 0 0 2 3 2 2 0 1 0 0 0 3 2 2 0 4 0 1 5 -1 4 -1 -2 -5 3 -2 2 4 4 0 2 -1 0 6
-1.49184 6 0 2 -1 2 2 1 0 0 0 2 3 1 1 1 0 1 2 0 0 1 2 4 3 0 -2 2 3 1 4 -4 1 0 1 0 -1 6 -8 3 0 0 1 -2 3 4 1 3 0 -1 3 -3 0 0 -1 1 2 3 0 2 2 -2 3 0 1 2 1 1 4 3 -2 5 0
$$ packed form
-1.17869@Kk%JnNjJTkLJpOljNmk%JK%mNkTMk%VkOoLJkjMkjLlLl%LlMnJ%KjkJjLjkLlLkMrQnMkKkN
-1.22447EnJT%kjLJnOmjL%nJ0nKnNm%TJj%TNrOkjMmLjTJMl%KmMmNnLkjMrMKjT%LlJMnLlJjOnJQrM
-1.26842DljMm%TLl%JjKlKTjTkJjJ%jJKlKjJ%kJlNJlMj0Pj%VkMJm%KlMkTJTlNjTMlj%ULkTKlMkKk
-1.31420@MkKkTMlTQolOlLlJTkLlMmjO%mj%jKkL%TjUNjl%jLKnJNpNnPpPjlOrKTlMl%TJj%JjTJkLJ
-1.35938B%JljKjKPj1JKlKmO%jJlJ%KTjnNoNlLJnOmJkMnPn%TkNkJk%KjKkoNKkLmJkNkMoMnNjJlK%
-1.40333BoOk%K%lOmJkLlNqjPklNjlMl%MpNJTkT%TJMlTJLoMj%K%rJ0kTMjTJkMlkJ%J%nPkLmKjmPl
-1.44728ApRmJj%MkjJ%kLk%LjTkKlKMmPqJ%j%Nm%Kk%L%l%TKJj%kJj%TLj%kMmJMoNnjlQnMK%mKlJO
-1.49184FoKlL%jT%TKJk%TjJTk%JTKjlkMJkLqNjJjTPj4J1l%JlNJlKljMoL%jKJTlK%mNlJTj%LjnPn
$$ plain form
-1.53518 0 3 2 0 0 3 1 3 2 1 -1 5 -3 0 0 1 1 0 -4 2 6 0 1 2 0 0 3 0 4 -4 3 4 4 -3 7 0 0 -1 1 -1 3 2 0 -4 3 0 -1 3 1 2 0 -3 6 -3 0 1 0 2 1 -1 6 0 7 -3 0 1 -2 4 5 3 3 2
-1.57852 2 2 0 0 3 -2 5 0 1 0 -2 2 1 2 -1 1 8 2 0 1 1 2 -2 3 6 -2 4 3 -1 0 1 -5 3 0 3 -1 0 1 2 3 2 2 -2 -4 -2 3 1 3 2 -1 3 -3 5 1 0 4 0 1 1 0 2 3 1 6 0 6 2 1 0 3 -3 3 1 2 3 2
-1.62430 2 3 -1 1 5 2 -2 1 0 5 2 0 3 1 0 5 4 0 4 2 -3 3 -1 4 0 3 1 1 3 -1 4 0 -4 5 2 1 0 -1 0 0 2 5 0 5 -5 4 0 3 4 0 3 2 -4 3 4 -1 2 2 1 0 4 -1 0 2 1 3 2 1 0 2 4 3 -1 0 0
-1.66947 0 2 0 0 0 -1 0 1 1 1 1 2 2 2 3 0 5 -2 -1 1 0 2 2 2 -1 2 -1 3 0 0 2 0 -2 0 1 4 0 3 5 -4 1 1 0 0 1 4 -3 0 4 0 1 2 1 1 3 1 5 -1 5 2 0 2 5 1 5 3 0 1 3 0 2 -3 5 1 4
-1.71464 4 0 3 -2 2 0 2 3 2 4 2 -2 3 -1 3 1 3 1 3 -3 0 1 0 0 1 1 1 2 -2 3 -3 3 2 1 2 -1 3 0 0 0 0 5 3 0 0 5 1 0 6 0 0 7 6 0 0 4 3 0 -2 2 0 -1 2 -1 0 3 3 -3 6 0 4 2 4 6 2 -2
-1.76042 -2 1 0 3 2 4 0 4 0 0 3 -1 2 0 0 1 2 0 4 3 2 0 0 0 0 6 0 3 1 1 -2 0 3 -2 5 1 2 4 0 4 3 4 1 3 7 4 -1 0 0 0 0 -2 6 0 3 0 1 1 1 5 3 0 2 0 0 1 3 0 1 3 -3 1 -1 -1 2 5
-1.80620 5 2 1 0 7 1 5 0 0 1 -2 3 2 2 5 0 -4 0 6 2 3 0 3 2 -1 5 -1 1 4 1 -2 0 0 4 0 1 0 4 3 3 5 1 3 1 1 3 6 3 1 4 2 0 2 2 0 4 0 3 0 3 0 3 -1 4 3 1 3 7 -1 0 3 2 2 0
-1.85077 0 3 -1 2 2 0 3 1 4 0 0 2 4 4 3 1 0 1 3 5 1 1 7 2 0 2 1 0 3 3 4 0 5 3 -2 5 0 1 4 0 2 2 1 1 0 4 0 0 1 0 1 1 3 3 0 8 -1 -1 0 0 3 -3 5 1 2 -1 1 1 3 0 1 0 1 -7
$$ packed form
-1.53518@Ljk%LkKjTkOqL%J%jmOMoJTk%LlMqPJ%pJ0p%jKkMjkmPljMkJklRrLJjKjkPoPj0LJlOJk%j
-1.57852B%k%LnPnJjkMjJlKPokJ%JmNLqOjmJToQlLmJVj%mkKNkKjlMoQmjMmJ%jKJkNoOmjTLoOkJTj
-1.62430BJmKMlmLjNlkLkjNjmMknOmNmLk%KmNmTRljUJ%KLnNj0RmLJmLjoPJnL%jTMnJKjKjUKTjmJ%
-1.66947@Kk%TjJT%UJ%TJlNpJKjK%TlLlMl%KkTKJLmLKrN%j%JLpLMmJTj%KkMoOlkKLmMklJKlKnQmL
-1.71464DmLnMkKJjKkmNmMkKkKoLJj%J%TJmNoOjTJlMl%UNkl%NmjOo%Pjo%MjlkMkjLlJL%oRoMkKTmT
-1.76042bLjLjKmMm%LmLk%JTkMjTk%UOoLk%lKLnPmJKmMjJlKMlnJ%UkQoLlJ%TMklKk%JKlJKoMk%LT
-1.80620EljTPoMn%JlNj%LnmMOmJlLjlOoKLlTK%MmJjMj%KmKk%KLlkLkTK%kMmLlLlLmNjkKMqJLj%k
-1.85077@LmL%kLkLm%KT%jkjJKTm%OnkKjTL%JmNknPnJLmK%j%jMm%JjJ%K%lQr%J%LoQmJlK%KlJjJq
$$ plain form
-1.89533 -7 2 5 0 5 0 -2 1 4 -1 2 1 2 1 0 0 3 3 3 3 0 1 1 1 6 -7 4 -1 2 2 -2 0 -2 0 2 5 -2 5 4 -6 1 3 5 -1 0 1 3 3 0 6 0 4 -3 4 0 5 1 2 4 5 4 5 2 4 6 1 -1 4 0 0 1 3
-1.93867 3 0 1 0 4 3 2 3 -1 0 8 0 3 0 3 2 4 0 7 0 0 0 2 -1 3 2 2 0 3 2 2 0 -2 0 4 -4 4 0 1 3 7 0 2 3 0 4 3 1 1 3 -5 2 2 1 5 3 5 0 2 1 2 0 2 3 1 0 6 8 1 1 3 3 5 0
-1.98323 0 3 2 4 2 5 0 0 1 0 5 -2 2 4 3 0 3 4 0 7 2 1 4 3 4 4 5 5 2 4 0 -1 -2 1 6 2 5 0 -2 -1 4 -1 6 2 3 0 3 3 0 2 1 3 0 0 5 0 0 1 2 2 2 5 2 4 0 4 1 2 2 0 0 2 4 2
-2.02779 2 2 3 0 2 0 3 -2 4 0 0 4 3 0 4 0 0 3 -1 4 0 2 -1 2 3 3 4 -2 4 0 -1 3 3 2 1 1 4 -4 -1 1 2 -1 3 -2 6 -1 7 0 1 2 0 2 -2 7 0 3 1 3 1 0 3 1 0 2 -2 -2 0 0 0 3 3 5 2 0
-2.07235 0 1 5 4 2 1 2 7 1 -3 3 0 3 5 -3 0 2 0 2 0 0 1 0 5 3 4 3 3 3 0 4 -1 3 2 0 5 3 2 4 2 0 4 -1 -1 4 2 1 2 0 1 2 3 1 4 3 3 5 2 6 0 -1 5 2 3 -2 0 7 3 5 3 3 3 -1 3 4
-2.11752 4 3 5 0 2 0 3 4 1 1 0 3 0 4 6 2 3 3 0 0 10 2 4 4 0 7 6 0 3 1 -2 5 3 2 -1 4 0 5 3 1 2 2 0 0 7 2 3 0 7 1 3 1 -2 5 1 2 2 -1 5 2 0 2 7 2 2 1 0 0 1 1 4 5 2
-2.16147 2 1 0 3 5 3 0 -1 1 6 1 0 0 4 2 1 3 -3 1 3 3 3 0 2 4 4 2 2 0 5 0 6 -4 7 -2 3 0 6 2 1 4 1 3 3 3 2 3 -2 3 2 0 3 4 0 -1 -1 2 1 6 0 0 2 0 1 3 4 4 4 5 0 0 3
-2.20481 3 -1 5 1 5 6 1 6 2 4 1 4 3 1 4 1 3 4 4 4 -1 4 2 0 5 3 0 3 0 0 1 7 1 0 3 1 1 4 2 2 2 -2 3 -1 5 0 8 -2 0 -2 3 2 1 5 1 1 3 4 1 2 -1 2 0 6 1 2 5 1 1 2 1 5 0
$$ packed form
-1.89533gRLnNnkLTnLjJjT%L%UlJ%TNj3J1nL%mKkKTLpPjj0PKToJTK%lOoMpPmNmJKJjJlKTnkNm%JK
-1.93867ClJjMjTJmJQqLlLjKmPp%TKlMj%kLj%kTKMqQmJKMpKJlMjk%KqP%jMkKnKjJkKJkjOKp%K%Kn
-1.98323@LjKkLn%JjNpMKjlLJmPnjLjJ%J%lKmjTLNmLnkJNnPmJlL%lKjKl%Nn%JT%TLlKmMlJ%k%KTk
-2.02779B%JlKkLnOm%MjlMm%LmNmKlLJ%JoOmjM%jT%LqLKJlMnQpQpJTkKmRpLkKkjLkjKm%K%TL%Klk
-2.07235@JMjkjJNomOlLKqLKkKk%JjNkJj%TlMnMjkNkjKkTMn%NkjJkJUkLj%KlMojOlJnKPmKk%TmMJ
-2.11752DjKnKkLJl%jLlMKmJ%l%J0qK%mPjoLklPkjlNmNkTJ%k%PnJlPoKklPmJ%lOlkKNn%jT%J%LJl
-2.16147BjTLKkljKNnj%MkjKoMK%TlKT%k%kNnOj0J1rNlOmjLlK%TjJnNjkLJmj%LjNo%KkJKJ%TJn%L
-2.20481CmOmMJnNmKlLjkLlKJ%TnNkTNklLl%JOojLk%Lk%TmNmOnQj0KkNjTMm%KJlJlLkOnJLm%JjMn
$$ plain form
-2.24876 0 0 4 0 0 3 0 2 0 4 -1 3 4 1 3 -1 5 1 4 0 2 0 0 0 1 2 2 -1 0 2 0 -2 0 3 1 5 1 4 2 3 0 0 3 8 -1 5 4 0 3 5 0 3 2 4 1 1 0 7 1 3 3 2 3 6 0 3 3 0 4 1 5 2 1 4
-2.29332 4 -1 3 0 3 0 1 4 0 10 -4 5 3 3 2 5 1 3 1 2 4 3 2 2 1 4 -1 6 1 2 0 6 4 0 2 3 2 3 1 -1 7 5 7 5 3 1 0 3 5 -2 2 0 2 2 6 3 0 -1 0 1 4 0 3 0 3 1 4 1 -2 5 0 2 4
-2.33727 4 1 0 1 0 4 1 3 2 0 7 3 0 6 1 6 6 4 -2 5 0 3 3 3 2 3 4 0 5 3 3 4 6 4 6 2 1 0 3 5 2 8 2 7 0 1 7 2 2 0 1 2 3 4 4 3 5 7 0 3 0 0 2 3 3 1 0 2 4 4 2 1 2 0 -1 2
-2.38305 2 1 3 1 1 0 3 3 0 2 0 2 4 -2 1 9 0 6 3 -1 0 6 1 4 7 0 2 4 3 5 0 2 6 3 2 4 -1 5 2 0 2 4 -1 6 1 5 -4 4 0 4 2 -1 3 0 7 3 5 -1 0 0 2 3 6 4 2 5 2 3 3 4 3 6 3 -1
-2.42761 -1 4 6 0 5 4 5 -3 -2 4 4 0 5 2 0 0 1 2 -1 5 0 6 1 1 1 3 2 1 4 0 6 -1 3 3 -2 5 6 3 5 3 4 4 2 0 2 3 2 2 -3 1 6 2 6 3 0 0 4 3 3 3 1 6 4 4 4 3 -4 5 2 2 9 4 4 2
-2.47218 2 6 1 1 2 3 1 3 0 1 -2 3 -1 3 0 7 2 7 0 -1 2 3 3 2 0 0 2 1 4 0 6 1 5 3 3 3 0 5 6 4 2 2 1 1 7 5 6 4 4 2 6 -1 5 0 0 1 4 2 3 9 0 0 2 3 4 0 3 2 1 0 2 3 3 1 2
-2.51735 2 0 1 3 4 6 -1 5 4 3 5 2 4 0 7 4 6 1 -1 3 0 -1 3 5 6 4 3 1 4 1 0 3 2 3 2 1 1 0 3 -1 6 0 3 2 6 5 3 1 1 3 2 3 5 3 8 1 2 2 0 3 3 1 2 1 8 5 5 4 1 1 1 1 5 1 2 1
-2.56313 1 4 1 0 7 2 0 4 0 1 4 0 3 2 -1 5 0 3 -2 4 0 3 5 2 3 5 0 0 2 6 3 4 3 2 5 3 1 4 2 6 0 5 -1 4 0 1 2 3 2 8 -1 5 5 4 1 7 1 2 4 2 2 2 2 2 0 6 3 7 -2 4 3 4 6 1 8 4 3 7
$$ packed form
-2.24876@%Mm%LlKkMnMJlKmOmLmKk%TJT%lJKkTKLkMmLkJl%LNrOjmLKnLjKl%jPoK%jJLoL%lMlMljL
-2.29332DnMlLlJLmJ0j4Rk%jLmKkJKjT%jLnPnJkOkmKJjJkTQkKkUjLKpMkK%MlTjJTLmLlLkLlTPnKT
-2.33727DljJjMlKjkPmlOnN%koPnL%TjJTmNk%JKkKmjTLKlOoNpJOn%kJV%jKTpLl%KJ%kjKT%kjJkjL
-2.38305BjKk%jL%lKkKToLQrOlmJOnLTpKTjKnKMljKnOlkKTnPnMrQmMklMlPmKoJ%KJLkTLlJ%JjLlm
-2.42761aNKoNjJqJO%mNlk%JTlOnOn%TKjTLmOpM%nPJlKkJ%kTKJj%nMNmMlT%Mj%TkNk%TjpRl%Pn%k
-2.47218BMn%JTkKlJlNmMlPnNpjLJ%jk%KjLmOnMk%TlNJkT%j%OkJk%kMpOn%JLkJOr%KJTmLjUKJ%kJ
-2.51735BkJKJKpOjTKlKmPlKnkMljMKJkjkLljLjJjT%jLmPoLjMjkT%KjJKkNpJ%kL%kJjPl%jl%UMmJj
-2.56313ALljPnkMmJLmLjlOnLnOmLKlJKn%KMlJjTLkTLkMoNoNmJUjOrO%jlOoJKk%VkOlMrOjJKnPmjM
$$ plain form
-2.61013 7 2 2 3 4 3 6 2 2 2 4 2 4 5 2 2 2 -1 6 3 2 2 0 4 0 2 1 2 0 2 2 5 0 4 1 0 5 3 7 1 1 8 0 1 6 0 3 4 0 3 0 5 4 3 6 3 2 4 3 4 3 6 1 4 3 1 2 -1 4 1 2 6 5 1 4
-2.65530 4 1 4 6 1 6 3 6 -1 7 2 0 3 3 0 5 4 0 3 0 0 4 2 -2 5 3 0 5 2 0 2 4 2 1 4 -1 7 0 5 0 5 1 2 4 7 0 0 6 1 7 5 6 0 4 2 3 4 0 2 3 6 1 7 5 4 3 6 3 2 0 3 1 7 2 5
-2.70047 5 2 0 1 9 0 1 6 0 8 6 5 5 3 -2 7 1 6 1 3 4 0 1 1 4 0 3 5 1 4 3 2 1 0 5 2 2 0 1 4 1 4 8 1 1 1 2 2 4 4 8 5 4 5 1 0 4 2 2 -1 3 6 3 1 5 5 4 -1 3 2 0 1 0 2 1 2 3 4
-2.74748 4 3 3 0 2 4 3 3 3 6 4 2 10 0 5 4 0 4 2 0 2 1 4 3 5 0 7 5 -1 3 4 3 5 1 3 4 2 1 3 3 1 3 4 0 3 2 -1 0 7 2 0 5 0 7 5 0 5 2 5 -2 3 3 0 0 2 2 3 3 3 2 0 8 0 4
-2.79204 4 5 3 5 6 5 2 5 2 5 0 6 0 5 2 3 6 3 5 5 3 0 7 3 6 4 3 6 1 4 1 2 6 0 5 4 -2 7 4 0 2 2 0 5 0 13 0 1 3 3 6 2 6 2 8 0 2 0 7 0 6 11 3 4 2 1 5 0 4 5 7 1 0
-2.83599 0 5 1 0 5 1 3 6 0 0 7 1 5 1 5 2 2 3 3 5 0 7 1 9 5 0 2 2 0 7 0 3 4 0 7 3 2 3 -2 5 6 6 1 0 -1 4 5 5 0 4 5 0 5 2 1 5 0 6 6 3 0 4 4 1 9 0 6 7 3 -2 4 5 1 5 7
-2.88116 7 2 3 2 2 6 4 0 5 1 4 4 3 4 6 3 2 1 7 3 0 3 7 -2 8 1 3 5 3 1 0 -1 4 2 3 2 4 1 0 5 2 4 -1 7 2 2 0 6 1 5 10 3 1 -1 4 0 2 6 -2 8 3 5 5 5 1 4 2 0 4 1 1 0 6
-2.92511 6 3 6 7 6 3 5 3 3 0 6 4 4 3 -2 4 1 5 2 3 0 4 8 -2 5 2 -2 2 3 6 6 4 0 1 5 6 0 8 2 2 4 2 1 -1 4 5 5 4 0 4 2 2 4 4 5 4 4 2 5 0 1 2 4 3 2 2 6 3 0 1 6 2 0 5
$$ packed form
-2.61013Gn%JTjLm%TKkKJl%TlPlj%kMmKjJkK%LnMljNkMo%PqJNoLJmLlNjTLljKjJjLnLjkJlNlJMjmL
-2.65530DlLKnNlLpQnkL%lNjmLl%MkmPklNlkKTkjLnQpNnNmJKLp%OnOkJoMkJTmKJLnOkjTLljkLkOnL
-2.70047ElkJQrJNoQkj%knRoNnKJmJ%LmLKmLjVNl%kJLlLMp%TJ%K%MljJmjMk%lMLlkM%jnMjkJjKjJU
-2.74748Dj%lKTj%TLkTQj0NjmMkTKjLjKnPkoMJjKmKJkjK%kKJmLjlJPnkNnPknNlLpN%l%K%J%TjkQqM
-2.79204DJkKJjlLlLnOoNlJLlK%klPmLkjLnLlJMoNjoRlmK%kNnJ3j3JK%LmMmOqKkPpONqJkjMnMJKoj
-2.83599@NmjNmKLo%PoMmMl%J%KnPoQmnK%kPpLJmPmjJnPJ%njTNJ%nMJnNljMnO%lTM%lQrOJmnOJmMK
-2.88116GnJj%MkmNmL%jJKljTOmlLMrJ0pKTkTjTNkJjKljNlKnQn%kOnMNpkTNmKMqJ0nK%TmLkTMl%jO
-2.92511FlLJjlKk%lOk%jnOlMlJlMTj0PlmMJL%kmJMJoQo%KkjkNJ%jmMk%K%Jj%kLnJTKjT%MlTJNmkN
$$ plain form
-2.96967 5 0 3 5 2 9 -1 7 1 3 0 5 2 4 0 3 3 4 1 4 6 1 5 1 0 2 0 0 2 8 2 10 2 5 5 2 2 7 5 2 4 3 3 7 1 2 5 5 3 2 3 4 3 8 0 7 1 5 2 4 3 6 6 3 0 4 5 7 5 4 1 2 2 3
-3.01423 3 3 7 5 1 6 3 5 1 9 5 0 3 3 2 5 2 8 3 4 0 3 7 6 3 7 3 5 6 3 5 6 4 6 3 1 3 2 -1 5 0 9 3 2 2 3 3 2 2 2 3 2 4 0 6 4 4 9 0 11 6 6 5 2 5 6 3 3 2 5 3 2 5 2
-3.05879 2 2 4 5 0 11 3 9 -1 7 5 3 6 7 4 5 5 8 0 7 2 4 0 5 3 5 4 2 5 3 3 5 1 4 2 5 0 1 0 2 8 3 6 3 2 4 1 0 0 5 5 0 5 5 4 5 0 5 4 5 7 2 4 4 3 8 -1 2 2
$$ packed form
-2.96967EnLKlPj0QoKlNlKmL%JlLKnMmjKk%KOoQqL%l%NklKj%MoJL%kjJTjNqPoMlKjL%lTMJKkjlJ%J
-3.01423C%MkmNlKmQmnL%jLlOnJmLMjlMmKJlKJkKlkKjlOnRoj%J%j%TJjKmOk%NrJ1n%jlLJl%jLkjLl
-3.05879B%KJnJ1qOj0QkTLJlJ%LqPnKmNkKjkLk%KmLkLnJjKOnLljKlj%N%nN%jJnNjJKnK%jNrL%
-3.10030B    $$ checkpoint
##END=
