##TITLE= 5,12-Dihydro-6,13-dimethylcarbazolo[3,2-b]carbazole
##JCAMP-DX=   5.00   $$ Varian Associates, Inc., VNMR Software
$$ VNMR Version 5.1 Revision A, March 1, 1995
$$ Wed Jun  3 11:43:34 MET DST 1998
$$ svsj version 5.1, 97/1/14
##DATA TYPE=  NMR SPECTRUM
##DATA CLASS= XYDATA
##ORIGIN=     varian
##OWNER=      haider
##SPECTROMETER/DATA SYSTEM=   Varian UNITYplus-300
##.OBSERVE FREQUENCY= 299.9496408
##.OBSERVE NUCLEUS=   ^1H
##.SOLVENT REFERENCE= 2.490        $$ solvent=DMSO
##.FIELD=             7.04         $$ Tesla
##.ACQUISITION TIME=  3.7376000    $$ seconds
##.AVERAGES=          32           $$ number of transients
##RESOLUTION=         0.153        $$ digital resolution in Hz
##.PHASE 0=           -34.6        $$ zero order phase correction (left edge)
##.PHASE 1=           0.011404     $$ first order phase correction, deg/Hz
##$REFERENCE_POINT=   1142.034     $$ Referencing label
$$ Varian specific parameters
$$ --------------------------
##$acqstatus=    (0..1)  101 0
##$alfa=         19.9999923706     $$ usec
##$alock=        <n>
##$array=        <>
##$arraydim=     1
##$arrayelemts=  0
##$at=           3.7376
##$bs=           16
##$celem=        1
##$cp=           <y>
##$ct=           32
##$d1=           2                 $$ sec
##$d2=           0                 $$ sec
##$date=         <Aug 20 97>
##$dfrq=         299.9493529       $$ Hz
##$dm=           <nnn>
##$dmf=          200
##$dmm=          <c>
##$dn=           <H1>
##$dod=          0.00999999977648  $$ sec
##$dof=          0                 $$ Hz
##$dp=           <y>
##$dpwr=         30
##$exppath=      </export/home/varian/haider/vnmrsys/exp1/acqfil>
##$fb=           2800
##$file=         </export/home/varian/haider/dime_b>
##$filter=       54.0999984741
##$fn1=          1024
##$gain=         48
##$homo=         <n>
##$hs=           <nn>
##$hst=          0.00800000037998  $$ sec
##$il=           <n>
##$in=           <n>
##$lb1=          0.318309992552
##$load=         <n>
##$loc=          0
##$math=         <f>
##$method=       <z1z2>
##$np=           37376
##$nt=           32
##$p1=           0                 $$ usec
##$pad=          0.5               $$ sec
##$parversion=   4.3
##$pmode=        <partial>
##$priority=     5
##$proc1=        <ft>
##$proc=         <ft>
##$pslabel=      <std1h>
##$pw90=         16.8              $$ usec
##$pw=           10                $$ usec
##$rfband=       <ch>
##$rof1=         10                $$ usec
##$rof2=         9.9999961853      $$ usec
##$seqfil=       <s2pul>
##$sfrq=         299.9496408
##$sn=           0
##$solvent=      <DMSO>
##$ss=           0
##$sw=           5000
##$tin=          <n>
##$tn=           <H1>
##$tof=          287.9             $$ Hz
##$tpwr=         57
##$vtc=          25
##$vtwait=       300               $$ sec
##$wbs=          <>
##$werr=         <>
##$wexp=         <>
##$wnt=          <>
##$wshim=        <n>
##$wtfile1=      <>
##$wtfile=       <>
##$x1=           -103
##$x2y2=         327
##$x3=           115
##$xy=           335
##$xz2=          0
##$xz=           57
##$y1=           20
##$y3=           -133
##$yz2=          0
##$yz=           -44
##$z1=           -1983
##$z1c=          -82
##$z2=           1295
##$z2c=          154
##$z2x2y2=       0
##$z2x3=         0
##$z2xy=         0
##$z2y3=         0
##$z3=           75
##$z3c=          0
##$z3x2y2=       0
##$z3x3=         0
##$z3x=          0
##$z3xy=         0
##$z3y3=         0
##$z3y=          0
##$z4=           -82
##$z4c=          0
##$z4x2y2=       0
##$z4x=          0
##$z4xy=         0
##$z4y=          0
##$z5=           0
##$z5x=          0
##$z5y=          0
##$z6=           0
##$z7=           0
##$z8=           0
##$zx2y2=        0
##$zx3=          0
##$zxy=          0
##$zy3=          0
##$rp=           22.5
##$lp=           -57.0
##$rfl=          1888.9
##$rfp=          746.9
##$axis=         <p>
##$sp=           -1142.1
##$wp=           5000.0
##$cr=           2779.1
##$delta=        748.6
$$ End of Varian specific parameters
$$ ---------------------------------
$$ Y-values stored with standard (16-bit) integer precision
##DELTAX= -0.0005087117
##XUNITS=        PPM
##YUNITS=        ARBITRARY UNITS      $$ (mm on paper)
##XFACTOR= 1.0000000000
##YFACTOR=       0.007127273
##FIRSTX= 12.8615370294
##LASTX= -3.8074191286
##MAXY=          233.539368
##MINY=          -0.128291
##NPOINTS=       32768
##FIRSTY=        0.014255
##XYDATA=        (X++(Y..Y))
12.86154BLqJ1lT%OqQnmMKJ%rQnN%KmQj0NqPJmQmjknONj0PmPqQlJqPMmkKjTK%TJTLj3QpJ0nlLJQ
12.82745A3j2R%j0LTkJLrOnOrJ1pPj1J3j2RkMj0R%JoK%LnLjJOj7J2pJ0nJ%j%TjLKJj0lRKlMJpjK
12.79693DlOjkNlkJLj5J8kTnkPoL%kRj1NkKj0J0nLlJ4pnJPLmTLj2J6j0MoRJkTKj3MKMRmj6J3pLl
12.76641@NkM%koM%Mjj0OKNmJLjqPqP%TjKmN%TMj1NpJkQmOq%NKMlj0%MNoQj0J0qLlj%JNK%nJko
12.73283dJ5nJjlTPkNq%TLKMmkjMoJNnLlNkJlmLlM%mL%JNkjJNKj1lKNmLnNmLmjNmJUk%mQ%Oj0Oo
12.69722BMoQlL%TlmMJkKkJLlmPoOoPpPm%oMpNkMJLnLMmjkJ1oMkp%NkKlJMqNM%j0K%jMTqOoMj0R
12.66212Dj%jOnOrQj0MRmkjMj3J1pQJqKMrJ1oLjMkTJnKPnlJOMpkNkTLlnNQj2OoMOrP%oJ0j1NJkl
12.62906BMlLj%TnmJ1MqMpMPoJPj1NoNlM%jKjp%J2r%lOj%kJPqOj%m%lNmPqRnJkOqlKQk%TkMmNj1
$$ plain form
12.86154 2 5 -3 8 5 2 2 8 0 8 3 -1 3 5 6 6 -3 5 0 5 5 7 3 11 1 6 -2 5 6 2 10 6 5 3 -2 4 9 -1 6 2 9 1 9 6 7 -1 6 10 6 4 6 5 4 6 6 6 7 8 11 -2 6 -1 9 4 1 4 5 13
12.82745 13 1 10 10 0 3 6 4 5 8 -1 5 0 6 -3 8 1 8 -3 10 -2 7 5 9 -1 8 8 9 3 5 5 8 3 6 5 6 12 -5 7 0 10 5 6 6 5 5 5 4 7 9 10 0 -3 6 8 5 9 10 3 2 4
12.79693 4 1 7 6 4 9 6 4 5 8 -7 11 9 7 2 0 7 1 4 4 2 11 0 5 3 5 -5 5 0 3 0 14 7 2 3 10 13 9 5 8 -4 12 2 6 0 9 10 8 6 8 -5 -1 1 5 14 10 -6 7 0 3 0
12.76641 0 5 3 7 7 5 -1 3 3 7 6 -4 2 4 9 5 6 9 8 0 7 -1 6 6 6 5 7 3 8 8 8 12 1 6 -1 0 -2 6 2 8 0 0 5 7 11 8 -2 -2 2 7 1 9 -1 9 1 4 1 0 0 1 6 8 8 3 4 2 -4
12.73283 -4 11 6 7 6 3 0 7 5 10 2 2 2 5 7 11 7 5 4 8 2 3 8 3 6 3 8 6 7 4 0 3 0 4 4 0 3 3 4 9 7 6 7 12 14 3 0 2 7 3 6 1 6 2 5 1 0 5 1 2 3 4 2 2 -2 6 6 12 2 8 2
12.69722 2 6 0 8 5 8 8 8 5 1 5 6 4 6 4 5 8 5 1 8 2 8 2 9 2 9 5 5 -1 3 -4 1 -1 3 4 7 2 5 9 5 4 2 13 7 11 9 2 2 7 5 7 4 5 9 1 6 10 10 0 2 2 1 5 9 1 7 1 5 -5 4
12.66212 4 3 3 2 8 3 9 0 8 -2 2 11 7 5 4 8 -5 6 -1 7 8 0 2 6 -3 8 2 5 4 8 6 4 5 0 2 9 4 1 2 8 12 5 3 8 6 4 7 4 -1 4 12 0 6 0 4 10 1 8 8 2 12 1 6 7 5 2
12.62906 2 6 3 6 5 5 5 0 -4 7 11 3 7 0 4 11 5 6 13 2 7 1 6 3 7 7 6 8 7 0 0 12 3 3 0 6 5 5 3 4 11 3 9 8 8 4 4 1 6 2 9 1 10 5 6 4 10 2 -1 1 9 7 7 7 5 9 5 10 -1
12.59446aRj0PkKpNlNKoMmLnQKnLkJoRj1LK%lMUlLqMmJnRpkOJ0j2%JLoKkMjkJKJjlkOpNlRqQolp
12.55936eJ7qK%KNlJj1J0r%MjJ%MlkLj2QmLTJlpMKOkUjOjlPn%LnML%pOpQn%kNj%Mj1M%m%P%j%oL
12.52477CmOnJ%jOJLolQkUNpLJnP%jlMj5J8j1joJ1MKj4RlKjM%qKOpOlKmKJ0qjTMlkLJKpMKQj1Mp
12.49119@MTqnPJRj4Q%JmOn%Lj%mkKkM%J0j4Oj2J0jO%knLMpjLjJmMkQj1PkJjmjKjMLlNmljQkTmN
12.45762Fj1OLj%jJNmlTKJOnLrOJjLmMkMknTNKQj3J3qPnMmrOj%kJ0nOn%mTJ1%j1LOJlLNrnJ1oJT
12.42455DmJK%jpPMknLMKnKoJ2ljklMoJ1pPj0MOpPj1NKmKpK%UnJ8j3MqPlNmJj%LlJmJ1pMqKMpJ4
12.39149A1pLnjJ2qmJPjkpPnNnJ%Qj3J0pLMJnjMj1J3j0PkJN%kTLj0RKpJkLlPoMKnmJ%KJjOqJ4j3
12.35995AQj0L%MkjRjTlk%JKlNpPplMJKj2J5nLj0jOlNqPmRkTlMqJLMJTnJKjmRj0lNMj1J3kjTmR
$$ plain form
12.59446 -1 8 -2 5 3 5 -2 3 0 5 7 1 5 1 4 -1 7 9 4 7 5 6 0 9 -2 1 3 3 0 4 8 12 9 12 4 8 4 5 0 9 2 0 6 16 4 4 5 8 2 4 2 6 5 3 4 6 7 6 3 1 7 0 5 2 11 3 11 5 2 -5
12.55936 -5 12 4 6 6 8 13 10 11 0 10 1 1 5 4 5 5 9 6 4 7 -5 3 -1 2 5 6 3 -4 0 2 8 6 4 2 1 7 6 3 10 5 5 8 3 7 10 10 3 9 2 10 5 5 3 8 7 7 11 0 4 4 0 0 7 7 6 6 0 3
12.52477 3 -1 5 0 1 1 0 6 7 10 4 1 9 7 5 3 8 1 4 5 0 7 7 6 3 7 -8 10 -1 -2 -8 3 7 9 -5 4 1 3 2 6 6 -2 0 6 -1 5 2 4 0 2 12 4 3 2 6 3 1 4 5 7 0 4 6 14 3 7 0
12.49119 0 4 8 0 -5 2 3 12 -2 6 6 7 3 9 4 4 7 6 6 2 0 2 0 4 4 14 0 6 -6 4 3 9 9 7 2 5 9 2 1 4 3 4 0 4 2 10 -1 6 4 5 4 0 -1 1 0 4 7 4 9 5 2 1 9 7 5 1 6
12.45762 6 -5 1 4 3 3 2 3 8 4 1 -2 0 1 7 2 5 -4 2 3 2 5 1 5 3 7 5 0 -5 0 2 10 -3 10 2 9 4 8 4 -5 1 0 0 -2 8 3 9 4 4 0 -4 7 7 -4 -1 5 6 3 6 11 2 -3 8 2 3 4
12.42455 4 0 1 3 3 2 -5 2 6 4 -1 2 6 8 3 5 -1 11 8 7 5 2 6 0 11 4 11 1 5 11 4 11 0 5 7 3 5 -2 0 0 0 0 -5 13 0 4 -4 3 0 5 1 2 1 1 4 1 2 -2 9 2 6 -2 0 4 -3 11
12.39149 11 4 7 2 1 13 5 1 2 9 8 6 -1 6 1 6 1 2 2 10 -3 7 0 3 7 8 3 2 6 -5 8 -2 5 3 4 9 9 7 5 8 -2 7 9 2 3 1 4 1 8 2 6 8 3 -1 0 0 2 3 2 8 0 14 1
12.35995 1 9 -1 2 2 6 4 3 12 11 10 7 5 5 6 8 5 10 3 10 3 0 4 5 7 -5 10 5 8 -2 -3 3 0 5 -3 4 0 9 7 5 2 6 -2 -1 2 6 7 8 3 4 6 5 1 10 0 -3 2 6 -5 8 6 5 4 0 9
12.32739Ij0LKl%LqQmlMKMqJNjJ0j4PpRpKlOKrMLTmJk%jnOljNmjTMlKlKjNnLOj1NjJmMnMlJQmMr
12.29280@Oo%QqLTlTNj1J5j5J4lKqNMqPlJmQm%LoNjJoNlNrQmOrjOkmJOJpMoPoJ5j4OJnL%Lm%Mj2
12.25973dMLNlj%Lm%KLkjk%jMnj%PJnRpnNkJkTLmJ%LKmMkj%J0rJNkj%TJnjkKJ0rJ%lRrKkNlLjT%
12.22412CK%m%JMoKTkTRrMTj0PJKoJ%nNkJTLq%KJ2j5J0kLj0KOJlNKj1%JPnLjlkKNnPj1J1qNoKNj
12.19156FKjqJ6j5JKJoJ0nLl%Oj2J3o%mPkUjK%k%J%LjKJlMknJLljJ0lJo%LqL%JlRjokPmNnQpKmN
12.15748ElkQrOmQpNj0KPlOqRj0NmJ%Po%k%kPKloPnlMNj2J0KkToJKMjMkjoPKmjJlJ1j6J0%KoJj0
12.12492hJ0JmQoRj0KNnkLnOmLoRrNPj2Ojj0J2LnL%JoM%TKl%ToPJ%klNmkOKpPlJlLlMnLmJKlQkK
12.09084HqJ0oKJp%KMmJ1oLqMkMqKL%nMmJ2j0NoJKLkj0QkLjOrJOm%lKJkjJ1plMlLnOlJjlNPj6OM
$$ plain form
12.32739 9 -1 2 4 1 1 4 -4 4 0 -3 1 3 7 -1 0 5 4 14 0 7 0 9 2 4 1 7 9 0 4 7 10 6 7 5 5 4 -1 5 2 1 6 2 1 0 4 1 3 0 2 1 6 1 4 10 -1 4 3 4 0 4 -1 3 0 1 9 5 9 0
12.29280 0 6 0 0 8 0 3 6 3 0 5 -6 9 -6 8 5 7 -1 4 8 0 7 4 5 1 9 5 5 8 2 7 6 7 1 6 3 8 -1 7 3 9 0 -1 5 3 -1 0 6 7 0 4 -2 5 -1 14 0 6 7 2 5 5 8 4 4 8 -4
12.25973 -4 0 3 8 5 4 4 7 3 3 5 8 6 5 3 3 2 6 1 0 0 7 8 3 12 5 0 5 3 4 2 0 3 -1 0 0 3 5 1 5 3 2 2 12 3 4 9 7 6 6 6 7 2 1 -1 1 11 2 3 3 0 9 0 2 0 5 2 5 4 3 3
12.22412 3 5 5 1 1 2 6 0 2 4 2 0 9 0 4 8 -2 5 6 8 2 3 3 -2 3 1 2 3 6 -2 -2 0 12 -3 7 5 8 -2 0 6 7 4 9 11 0 0 1 8 3 6 5 2 0 2 7 2 9 -2 9 1 6 0 2 7 6
12.19156 6 8 7 -1 15 0 1 3 4 -2 8 3 6 3 3 9 -3 10 4 4 0 7 5 3 1 0 2 2 0 0 1 1 4 3 5 6 3 7 5 0 1 4 1 0 10 7 8 2 2 5 -3 0 0 1 -2 7 6 0 -2 5 1 6 1 9 2 4 0 5
12.15748 5 2 0 8 -1 5 1 9 2 7 -3 -1 6 3 9 1 10 0 5 1 2 2 9 3 3 1 1 -1 6 8 5 -1 6 1 -2 2 7 -5 5 7 5 3 -3 -2 0 4 3 7 5 4 -2 5 7 3 2 3 0 11 -5 5 5 7 1 2 -8
12.12492 -8 2 3 -1 7 1 10 0 2 7 2 0 3 -2 4 0 3 -3 6 -3 2 9 -3 3 2 -8 4 7 2 5 5 6 0 4 4 4 6 3 3 3 -3 4 5 5 3 0 5 1 -1 5 7 0 7 4 5 2 5 2 6 1 4 0 1 3 0 8 6 8
12.09084 8 0 10 4 6 7 0 0 2 6 2 13 7 10 2 6 4 8 0 2 5 5 0 4 0 12 2 7 1 2 4 7 5 -5 3 1 4 3 9 0 1 7 3 3 0 2 3 1 0 11 4 1 5 2 5 0 6 3 4 3 0 5 12 -4 2 6
12.05777Fk%NknQj2J2qkM%nOnLl%MkJRj1LKJnL%ljKJlMnKNMj4OoPqQpJ1jUlTQlnN%TlkJTOlMn%p
12.02318dJ7qpPJoJlLMjnNlNoQnlJ2j1j%Kk%KMJ%TlJ%pl%RJlJMoLjkKJnlJ0nkLNpOoJ0qlTKNl%k
11.98910bPmJkJPjnmMJnNTj1LPmnKMm%M%mMmLlLljNl%NJpRo%LjnMUj2klPmJ4j6Q%JmRnlnRjMk%K
11.95400Im%kJ0mj2J3qNoLl%PklMpNjMj1MKQmPj4%PkpOmKmJLlNMkJoMpJ3k2K2j3QlJPqkQmjKpPp
11.92195aKTkMmPqJTjLpLQm%lOpkLKMj1Q%kTJL%TnJK%JTOj3J3rNmNpLlOlKkTNJlmMkTjRj5J4%lM
11.88786HqKkKTJPj1jkMljlJ1qmPLmPj3J5mTMl%kOj0J0oQpMpQrPkJKjPrkjLJLjlJMpPoJ1j2N%n%
11.85531@JOpJ3j7J0nkjNkjOmkL%lNj0OlOkMKnNlm%nOToPmnJPqNLkTlNoQj0J4rOnmJjJN%LmjJ%J
11.82173FjTk%K%nLkJ%OojT%MoQk%JkKNqOpjJ2kqjNj1J4pLlNjklMk%oJ3Kkr%Pj%oOqRpJ1oJojJT
$$ plain form
12.05777 6 4 4 9 7 2 10 -2 10 2 0 4 4 -1 5 0 3 0 0 4 2 3 12 1 4 6 7 2 5 5 2 1 3 4 1 5 0 2 7 11 -3 3 -3 4 -4 4 -3 8 7 6 5 2 -1 7 4 -1 4 4 4 1 -1 0 1 7 4 8 3 3 -4
12.02318 -4 13 5 -2 5 6 0 1 -2 1 5 4 -1 4 1 6 0 8 3 0 12 1 0 0 2 0 0 2 6 7 7 7 4 5 5 -2 -5 -5 4 5 2 3 7 1 4 3 1 3 4 -1 -4 6 1 -1 2 7 0 6 0 10 2 -1 -4 -2 3 0 0 -2
11.98910 -2 5 1 2 0 1 8 7 2 -2 2 3 -2 3 8 -3 0 7 3 -2 0 4 0 0 4 4 0 4 0 3 0 3 0 -1 4 1 1 6 7 0 9 3 3 6 5 0 4 8 12 0 -2 -5 2 -2 12 -4 4 4 5 1 10 5 2 -3 6 5 9 7 7 9
11.95400 9 5 5 3 13 9 -3 10 2 7 1 4 1 1 8 6 3 7 0 5 4 8 -3 1 3 11 7 14 0 0 7 5 -2 4 0 2 -2 -1 2 -1 4 8 6 7 1 5 -2 11 -11 11 -2 6 3 4 11 3 1 9 5 4 6 -1 6 -1
11.92195 -1 1 3 1 5 1 8 0 1 2 1 4 -3 0 8 4 4 1 7 0 -2 1 3 7 -4 4 4 2 0 1 4 4 4 -1 0 2 2 3 4 10 -3 10 1 6 2 7 0 3 0 6 3 5 3 1 6 7 4 0 4 2 0 -1 8 -7 7 7 4 8
11.88786 8 0 2 0 2 4 5 12 1 0 -2 2 -1 -2 -5 6 -2 -6 1 4 0 7 -6 9 5 1 5 2 2 0 6 -4 6 0 8 1 5 -2 6 -3 4 2 3 5 4 11 2 0 -1 2 3 6 5 2 3 7 0 7 1 12 0 5 5 0 0
11.85531 0 1 7 0 13 -4 6 1 -1 -2 3 1 0 6 2 0 3 3 0 5 -5 1 -2 4 2 6 8 3 8 5 1 1 -4 2 8 2 9 5 0 1 8 0 5 8 6 4 1 6 0 8 -2 12 3 9 4 0 1 0 1 6 6 9 5 4 5 5 6
11.82173 6 5 4 2 2 4 4 -1 2 0 1 1 7 1 0 -1 -1 3 -3 5 3 3 4 2 4 9 1 7 0 -1 11 9 1 0 5 -6 8 1 4 1 6 5 3 0 4 2 2 -4 9 11 9 0 0 7 6 6 0 6 -2 7 0 11 5 6 0 -1 0 1
11.78765AMnNpLKJKnNkLomOJoRnJ1j5PJmTJ2joMpN%j0J1mLrJ2kT%JKnNpNjJMl%ojLjMqJ1nLlOrN
11.75458ElKTpPnQj1MrQKTlMNj5J1j1J3rNkJjlTQlKlmPmjLT%klMmOrJ0rNJ%nOj%ljOmkMnMlLKnN
11.72101EnOJoOJmJ%oMLmPmlmKOljQrlPlLmJ0j7OMmKmPKl%lNn%kM%MklNmNjkUKJ2j3J3j4NMKMq%
11.68692HjpOjKJn%lLPj0JMQj4LKkNjo%Rn%JjJkQj1PkPqkRpmQpJ%NpQnmJ0oNpPj0%ONnm%JMmJNp
11.65284@J2mTkKmNjTLl%NKmkNj0J0jLnTjRkloJ0j1QKpMJmjJ3j0QnKPqMrPj0MkP%TmMkjNpOqQp
11.62079BJ0j1NQq%JKoNTqLKnQnLmJmOoQnQqL%pjNjQrQpJ1j1NljJ3j7J1rJ2j0JmQkKljMTmTjMOj
11.58874A6kTQmlJ%TOnkmMmJ1nMPj4RpLTJojRj0J4j1Nj1J4rJ4j1Q%Lj3J1mPnOpM%JNqJ2mTjQkOo
11.55873C5KMLKMkjQMmRoMTJmQM%PQjKJ1LJ1lJ4JJ5LJ6QJ1QJ7K1RK1J6K9J3L4K5L7J6M4M0M8M0
$$ plain form
11.78765 1 5 0 5 -2 1 3 4 6 1 6 4 7 1 -3 3 4 -2 7 2 13 -2 5 6 2 -2 10 9 3 7 0 5 5 -5 6 2 5 -4 8 6 4 4 5 7 2 7 0 5 4 5 9 6 6 0 -1 2 1 5 -3 8 3 6 3 9 0 5
11.75458 5 2 4 6 -1 6 1 9 -2 2 -7 1 3 5 2 6 11 -4 7 -4 9 0 5 3 4 3 0 -3 5 2 4 1 -3 4 0 -1 2 5 5 3 0 4 0 6 -3 7 -2 3 4 4 -1 5 4 4 1 0 6 2 0 4 -1 3 0 3 5 0 5
11.72101 5 0 6 7 1 7 8 4 5 5 -1 3 6 2 9 5 2 -2 0 6 3 2 10 1 -2 5 2 5 1 11 -6 0 4 0 2 -2 5 7 4 4 1 6 1 1 -1 3 3 7 5 2 7 3 8 7 5 3 1 3 15 2 15 1 6 10 12 16 8 8
11.68692 8 7 0 6 5 7 8 3 3 0 3 10 0 1 5 13 -1 2 4 2 7 6 0 0 9 4 4 5 4 5 3 11 0 7 5 12 4 2 11 4 0 8 1 2 2 7 0 8 3 -1 9 3 8 1 8 -2 -2 4 9 4 0 0 1 5 1 2 7 0
11.65284 0 12 8 4 2 4 0 5 4 3 6 3 3 8 10 6 4 9 -1 9 8 11 6 1 0 9 7 4 -2 8 -3 5 7 0 4 5 1 0 13 3 11 6 8 15 7 11 2 9 -1 3 1 8 8 8 4 8 6 5 10 3 9 1 9 2
11.62079 2 12 1 6 14 6 6 7 9 3 8 13 5 8 10 5 13 8 11 7 8 4 10 4 12 7 15 7 10 10 3 2 7 6 14 5 13 6 17 6 11 8 7 20 3 14 5 17 7 8 4 12 10 12 9 8 12 16 12 8 7 11 17 16
11.58874 16 14 12 20 16 13 14 14 14 20 15 13 9 13 9 20 15 19 26 12 21 14 17 20 21 15 14 23 13 27 16 21 10 24 15 29 18 26 26 29 16 27 23 30 25 31 24 28 28 29 34 26 38 34 30 29 37 35 41 35
11.55873 35 37 41 44 46 50 48 47 55 59 55 64 58 62 66 67 63 71 75 75 82 90 89 91 102 105 116 113 127 128 143 146 162 170 181 189 206 227 236 257 273 302 315 349 374 411 427 471 511 559 599
11.53329E99N3N7O3P0O1TO7N8N9M1L2J7oj3k4l1m3n4o7n3o2o4p0m3o2n3m6m8k3n3k8l3k3l4j3k9
11.51498B63j3j6j7j6rj1qj5mj3j1qlmTj0jprJ0j3lOj2j%jnlnMlUrRoMJj2QojTJqJ0j5KMljLToq
11.48649B1J7j0KoQrKrRmPKqkNRk2J3l%oJQj2RlTJLj2J0oOrQlMkMk%kjJ0j2QpQmKrRpjJlP%Jl%J
11.45495A6jTNlklRj2Rj2RpOTLj1kmLO%oPmMnPj0PmkQnj0ORnKokLTkPj2jkMJmMmJ3okJmLlkRlLm
11.42239GLTopMKkJ0rLpPlOqJLnKkM%mPmkJOnmMRr%Nk%KljJNolMpJ2rOmjMLjklOj2J0pP%oLm%J
11.38831CJ0j2kM%lJJ1jn%jJj4J4OKj0jLKpJ0j1MKOpOnK%qPklNKJ0j0loNjMqJ1oJKpQlkMqOkJr
11.35779dJ1nKjKlJlLkRj1J3j1JmOmPrJ1jlMokmQnNJjTnjKJTLjmKLjmMNnNqMnLMjkJOj0MJlkPp
11.32472AJ0mnMlK%TjJnJ3j3OmjPqPnLoJ2j1%MqQjlmJ9j3Jj0J2mj%NnJRj1JkJ0j1J2lo%JRrKmPl
$$ plain form
11.53329 599 652 709 772 842 903 964 1031 1089 1148 1189 1221 1238 1232 1219 1195 1164 1121 1067 1000 947 885 821 751 708 646 593 547 499 476 423 395 362 339 305 292 263
11.51498 263 250 234 217 201 192 181 173 158 154 141 130 122 119 115 111 101 100 93 84 94 81 78 84 72 71 71 70 65 62 57 61 58 55 52 43 52 46 50 51 39 47 41 40 39 40 32 42 27 29 33 30 29 32 35 29 21
11.48649 21 38 28 30 24 32 23 25 16 25 21 28 30 22 20 25 34 12 25 22 22 16 17 25 13 22 19 16 17 20 8 18 12 18 9 17 14 18 16 20 18 18 16 15 25 13 21 14 22 18 20 11 20 13 12 13 10 17 17 18 15 15 16
11.45495 16 15 14 19 16 14 11 20 8 17 5 14 7 13 19 22 11 9 5 8 14 14 8 15 11 15 10 17 7 14 10 8 16 11 1 7 16 11 13 7 5 8 11 9 16 4 3 1 5 6 2 6 2 15 9 7 8 4 7 4 2 11 8 11 7
11.42239 7 10 13 7 0 4 6 4 14 5 8 1 8 5 11 3 4 7 2 4 2 6 6 2 9 5 3 4 10 5 1 5 14 5 5 10 8 8 10 7 6 7 12 6 3 7 0 12 3 9 5 4 8 11 10 8 5 11 -1 9 2 9 9 3 6 2 2 3
11.38831 3 13 1 -1 3 3 0 1 12 11 6 6 5 6 -8 6 12 14 4 3 6 8 1 11 0 4 6 12 5 11 6 8 8 0 7 5 2 7 9 19 9 6 0 5 4 8 0 11 5 6 8 1 9 6 4 8 0 6 4 5 -4
11.35779 -4 7 2 4 3 5 2 3 0 3 1 10 -1 12 1 2 -2 4 0 7 -2 9 8 5 9 3 1 -3 5 0 5 6 5 4 -1 -2 0 1 2 5 4 0 2 5 4 0 4 9 4 9 1 5 0 3 7 6 4 5 11 1 5 6 3 1 8 1
11.32472 1 11 7 2 6 3 5 5 5 4 5 0 13 0 6 2 1 8 0 7 2 5 -1 11 0 0 4 -4 4 3 0 -4 15 2 3 -7 5 1 0 0 5 0 1 10 -1 0 -2 8 -3 9 6 0 0 1 10 1 3 -1 6 3
11.29471C%kMqRnPjKpJ0j1jkJ1j0LlMmQmkNoKk%lRj1J1rLkKOjloKNLj0NjTQnJ%TM%mKrJ1oRon%M
11.26215ClJKlJNq%J0plTNK%lKlPoJTNlkJMkmjkLQqKPrPm%jlkOK%j0JO%jkOmKlNJKqPqMlJ%OoJm
11.22654bNkK%j0P%NnlMj%JjMjUJkmMNkTMnOkpOKJ%m%kTMpNkQmnKnJ3j3PjOo%LkjMnkJ0pJjkJMn
11.19144bKJjOpJ%Oj0LJjkLM%njnJ0lLoJ0pjQj2J0qPpJ0nmPlnLJmJ1rKpRjkTMmJJ0j3MoJ2j4J1n
11.16091bPj2PLPnTMmjLkKJMlTjKloRKjnkJ1j5J4j2J5qJK%kLoNlJrJ1KoPmnJJ1j1J2pkJTj1RkMm
11.12988@QlnkQo%ToPkJPnjkPnjKk%LlJ%KqLKkOj%jkMlJkoRjLomJ0pLNkpJUPpMpMLrJ1kUQnTNmJU
11.09224BQj5PpJ2oPlnMmOJpOj1Rm%JLjlPmj%kjOlTJ1rMLj1QoOrRnM%oK%M%nkJ0j3MJKkPqMmKTk
11.05917@Qq%JjLlQoJLoKjJTjTNmk%jJKjoRoKJKqPlNmNn%kKTkNj2J6qTQj%MmOljkKTnLlL%lJMmN
$$ plain form
11.29471 3 3 1 5 -3 6 1 8 7 9 2 12 1 0 -2 9 -1 2 -1 3 -1 7 3 1 6 0 2 0 0 -3 6 -5 6 -3 0 -2 0 6 5 2 -4 -2 3 6 -4 1 0 -1 7 2 3 3 3 7 7 3 5 -4 7 1 10 4 -1 -1 3
11.26215 3 0 1 3 0 1 6 -2 -2 8 1 -2 -5 0 2 2 -1 1 -2 5 -1 0 1 6 3 1 2 6 4 0 -1 -3 0 8 0 2 9 0 7 3 3 2 -1 -3 3 5 5 -5 -4 2 2 1 -1 5 1 3 0 5 6 8 0 7 -1 3 0 1 1 7 1 2 -2
11.22654 -2 3 1 3 3 -7 0 0 5 0 -3 1 0 0 1 0 4 3 2 1 2 0 -4 0 5 3 1 5 0 6 4 -3 3 5 6 6 2 2 0 -2 2 -5 0 -2 6 2 -3 -1 -6 7 -6 1 0 6 0 0 3 1 0 4 -1 -3 7 0 1 0 -2 -1 3 -2
11.19144 -2 0 1 0 6 -1 0 0 6 -4 -1 0 -1 -3 0 4 4 -1 -2 -7 3 0 3 -3 7 0 -1 7 -5 5 -3 4 -3 7 2 -2 5 2 -3 0 1 -3 8 -1 1 -6 3 2 0 -2 2 -2 -1 9 -4 0 -6 6 -8 3 -2
11.16091 -2 5 -7 0 3 10 5 0 4 0 -1 2 0 2 3 7 4 1 0 2 -1 -7 2 4 3 -2 -4 7 -8 6 -6 9 1 2 4 4 2 5 -1 4 1 2 -7 4 6 0 7 3 -2 -1 10 -1 11 4 2 3 4 -7 2 0 4 0
11.12988 0 8 5 0 -2 6 0 0 0 -6 1 -1 0 7 2 1 -1 6 1 0 2 0 0 3 0 1 1 3 -5 -2 0 -2 4 3 3 2 0 4 1 2 0 -6 3 2 5 -1 -5 5 -2 1 6 4 -3 -2 -1 0 7 0 4 -3 1 4 -5 6 4 2 0 8 3 -2 3 -1 0 1 2
11.09224 2 10 -5 2 -5 7 1 8 5 0 4 0 6 7 0 6 -5 4 0 0 1 4 3 0 7 3 2 2 0 -1 5 2 -1 10 1 5 8 -3 5 -1 5 -4 5 0 4 4 -2 0 0 4 4 -1 -3 7 -6 -2 -1 1 -1 6 -2 2 -2 0 2 0
11.05917 0 8 0 0 1 0 3 0 8 2 3 6 0 2 1 2 3 2 1 6 2 0 0 -1 0 2 1 -5 4 -2 0 1 3 -5 2 -1 4 0 5 0 0 -2 0 2 0 5 -7 9 1 -7 1 0 0 4 0 6 3 2 0 2 4 -1 2 -1 2 2 -1 0 4 0 5
11.02356Ej1P%Llkj%MLjkTKNnkJLKJmk%jkRojK%qPkQqQj5J0MoKJjNojLlMnLPrMJlKm%TkjMTnKnL
10.98846@JNmkmPlLl%M%olJ0mjJ0j0%ToPKTkNj0KOqKToNKl%TmMJQj4NmMJPqJoQoRpMkjmQJrNjNm
10.95438AOpOqKNoOmlJ0j0RokJ%JjJNojMmNlolPoK0j3%nNlKJTjlJT%KJ%pJ0j0NJ1j3LjMmJjkTlQ
10.92182ALMqNrOkQpJOmknOqMkLjOqNkLrQJPj7J2rK%jLlNkQrMlMpOmJkMmKPj3J0kJTmLnPjqJ0qN
10.88774Cj1RkOnQj1QnJj%jJ0plKj%JRj0KJT%TnjLMmnNmOl%MJKpMoJKTqMKjPj4RpMJTMj4J2mJ3
10.85569A2j5MlMmJKlkPJj0J0j3MOMqjML%rQkT%NQoqJUkQml%JLlJ%jQj2Nj%kKOl%nkKQj4PjRJr
10.82262aJ1nJpMnM%mLJmOrQ%TnO%lNkJToKoNMlkOnJlnJ8j4NmNqOqRl%LlTLkOmOnqjLJ2j5P%j%N
10.78854CoKOm%nM%lJNjNrLjmjPljJ2j4MmJ2rKM%qNoKJKj%MOr%jNnJkT%KoJ7j1OrjOJToLkRj9J5
$$ plain form
11.02356 5 -6 1 1 4 1 -1 -2 -2 2 5 4 2 0 2 7 2 0 1 4 6 7 3 1 1 0 -2 7 1 0 2 2 -6 1 -1 7 -1 7 -8 2 6 0 2 3 2 7 1 0 3 0 4 -1 2 9 0 4 5 2 4 0 0 0 -2 -3 1 5 0 2 -3 0
10.98846 0 1 6 2 0 -4 3 0 3 0 0 4 4 -2 -5 5 1 0 10 0 0 0 -6 1 3 5 3 8 -2 0 6 -2 0 2 -4 1 3 0 0 0 -4 0 1 9 -5 0 -4 0 1 8 0 1 -5 3 -3 6 -1 3 1 0 -4 4 5 -4 1 0 5 1
10.95438 1 7 0 6 -2 0 5 -1 5 1 -2 8 -2 7 1 -1 0 0 1 0 1 6 0 -1 3 -1 4 1 -5 -8 -1 -7 13 0 0 -5 0 -3 -1 0 1 0 -3 -2 -1 -1 1 2 2 -5 5 -5 0 11 -2 1 0 4 0 1 0 -2 -4 -7 1
10.92182 1 4 8 0 5 -4 2 0 8 1 2 8 4 2 -3 3 -5 -1 -3 0 -1 5 -3 2 0 3 -6 2 3 10 -7 5 -4 -2 -2 -3 0 -3 2 0 8 -1 3 0 4 -3 3 -1 0 -2 2 -2 0 7 -6 4 2 3 4 0 3 -2 5 4 -4 6 -2 3
10.88774 3 -8 1 -1 5 0 8 -3 5 0 1 0 0 -1 9 2 -1 1 0 0 1 10 0 2 3 4 4 4 -1 -2 1 5 1 -4 1 -3 3 0 0 4 5 7 0 4 -2 -1 1 3 -5 -1 1 0 7 -7 2 -5 -1 0 1 5 -9 3 -1 12
10.85569 12 -3 1 -2 2 -2 -1 1 -2 -4 3 4 -6 4 -9 -5 1 5 -3 -4 0 3 3 -6 2 0 -2 -2 3 11 5 -3 -2 -1 0 -2 6 2 -1 -1 0 3 0 1 1 0 8 -4 1 0 0 -2 0 6 3 3 -2 -4 -2 6 -8 -1 -2 7 8 -1
10.82262 -1 10 5 6 -1 3 -2 2 2 -2 1 2 -2 4 -5 3 3 3 -2 4 4 1 6 4 5 6 0 2 -4 1 5 2 0 6 1 2 -1 -6 12 -2 3 -1 4 -4 2 -6 3 0 0 3 0 -3 0 -2 4 0 6 1 -7 -8 -5 7 -8 -1 -1 -2 -2 3
10.78854 3 -3 -1 5 1 1 -4 0 0 -3 -2 3 2 7 -2 1 0 -4 -5 2 -1 -2 10 -4 0 -4 8 -1 1 5 5 -3 2 -4 -2 -1 1 0 0 4 10 1 1 0 5 0 1 -1 -3 -3 -1 -7 10 -1 5 -4 -5 1 2 3 -3 0 -2 7 -12 3
10.75547CmJLoPkj%jKLKr%MkPqjMPj1QpJnNnOKmNrN%lNoMKMrkMJMj1M%KT%KkjJlOlJlTMPrkjLKT
10.71986B%kLjJljJM%mKkT%jPoLpJ2lmNmOj1PpN%UNpKTkjTNlpPjLqQKlTQoLmJ%J0j2JPljLrPqQp
10.68476dLJjMn%TkLNl%lKl%NTp%kMKmjLkoR%lNnTRj0J1pRpLoM%pQnL%kT%NMo%OmjNj0KNKpQlnP
10.64966DpOmTQMoPqjJ%J%kLjJjTNTplQrKJPj4NKl%KMjj2J3nKmRj0J2j1QpjnQj%Nlk%l%jPmKmNp
10.61608eNPqjPmTNkOrMJj%j%nNLmJNlqOmLkNk%kTM%j%J1nmkoOmJTLpMTnNjoKTLj0QJK%jTpJ4j2
10.58149eMmQlLpQJj3PjOolQnLlNrL%LJoOkmPkTj%LMrNKjTkLnOKkRj3K%kKnLTmPj0OJjkKJKjkjo
10.54639gJ0l%TOj3OTr%Nk%J%LkJmlJ0rQoMkUPkJLrMKljJ%KJqPJkmNj%Kk%mRpJjoRnJLJ0j1Oj2N
10.51231bMkTKTqNKLlOoJ1qT%TRj0J2j2J1lnMqRnJjKJj1J3lNm%jkTQkoLKjOqKkJ3j6RnJkMk%mMk
$$ plain form
10.75547 3 -1 0 3 -3 4 2 1 1 0 2 5 7 -2 -2 2 0 7 -1 -2 2 9 -2 6 -1 0 -5 0 -5 1 3 -1 4 -5 0 0 -3 2 -4 0 2 6 -3 -5 -1 0 4 -7 -3 -3 -1 1 1 3 1 0 1 -2 4 1 2 -1 -4 0 7 -2 -4 -5 -2 0 2
10.71986 2 2 0 3 2 3 0 -1 0 4 4 0 2 0 -2 -2 -3 4 -2 1 -6 6 3 -1 4 0 6 -5 2 -5 0 0 0 0 5 -2 0 2 0 -1 -2 3 0 -7 0 -1 2 -6 2 4 1 -2 6 0 3 -1 0 0 10 -2 -1 6 3 2 5 -4 3 -5 3 -4
10.68476 -4 -1 0 -1 3 -2 -2 -2 -4 -1 4 1 1 -2 0 -3 -3 2 7 0 0 -2 2 4 0 -1 2 0 -6 3 3 0 5 0 -5 4 -6 5 -2 7 0 3 -3 1 1 -6 2 -3 0 0 -2 -4 -4 1 5 -1 -1 5 1 0 5 -5 -3 2 4 -3 5 2 -3 4
10.64966 4 -3 3 -1 -5 3 7 1 8 0 -1 0 0 1 1 -1 2 1 2 1 0 5 10 3 0 8 -1 1 2 9 -5 0 2 -1 -1 1 5 4 -8 5 0 2 -2 7 -3 9 -2 6 -1 -2 -7 1 0 0 5 2 0 0 -3 -3 -4 3 -1 1 -3 2 -5
10.61608 -5 0 7 -1 -2 5 1 -3 2 0 6 -3 1 2 1 1 0 0 -5 0 3 -1 0 5 2 -6 0 -4 -1 -3 2 0 0 -2 -4 0 0 -1 -1 10 5 1 -1 -7 -1 -5 -4 -3 0 -7 -3 1 -4 1 0 -6 -4 -2 1 -9 -1 0 2 2 1 0 -7 7 -5
10.58149 -5 -1 -5 3 0 3 -4 4 5 -8 -1 -2 4 -2 -5 3 -2 1 -2 3 -6 -3 -3 0 1 -5 1 -1 -5 2 0 -2 -3 -3 0 4 -5 0 2 1 0 -2 1 -4 2 4 2 11 -2 0 0 -2 0 -5 -2 1 -3 4 -6 0 1 0 -2 0 1 3 2 0 -1 -7
10.54639 -7 3 0 0 0 6 -7 -1 5 -4 -4 1 -1 -1 0 0 3 1 2 -2 -5 5 -4 4 -2 2 0 -2 -4 3 1 2 5 -4 0 2 -1 -2 -1 -1 1 2 -6 1 2 0 -4 1 0 0 2 0 0 -4 5 -2 -1 -2 -8 1 -4 -3 0 10 -1 5 -7 -2
10.51231 -2 2 0 -2 0 2 -6 -1 1 4 1 7 1 12 4 -4 -4 -4 5 -5 7 -5 6 3 -2 2 -6 3 -2 -1 -2 0 1 -10 3 0 5 1 1 0 -2 -4 4 2 -4 -1 1 0 6 -2 0 -2 11 -5 4 -1 0 -2 2 0 0 -4 0 -2
10.48026bjKJ%NqPoKOm%Tp%OJmTQlKmMmNj0J3%okmJ3j1M%JTjTKkKkQokJT%JlJKj6RQnKoMLjLlTN
10.44617BjT%mNToNj3QnPk%ToJ0j1PoJ1qkJT%kQkLkl%OloOoPpKLJk%jTKk%LoJ0rMLJj1%QMn%Lkm
10.41260cLKljTRj0%KLnmOMKJj2J0l%ToOLlkKMmOmknLJ%kRkpPmTLJ%nLTnPmLJTrLPj5J0nQlnN%m
10.37852dMKoO%JjKljLjkJmLpRjJklLTqOMrML%jk%KoMQqMrLjL%TljMrQ%NmNlJj1MJTOj0PoKkKNl
10.34291aj%JNqJkN%UlL%JlNoLJMj0PpOlMlTLPj4KQpKTjNLm%pL%jKlMkNqNnLlJ0mTNlkLJTjTPp%
10.30730@KkTj%LJMj1PjMlKpQnJjLkJklPkjJMrRnjTJ%Lk%Nj2PjJNpJjkLPj0LjlTQpJ0JljNqLKmK
10.27270@%nMjJLpMNKj0MklMkNjKjkLTol%TJkM%Mj3LNk%TJTlMKkLqRj0RjTnO%oL%j%oRjKnkPkmJ
10.23760cL%KMj0MmMJj%nLjJK%Rj7RoK%M%nLJKLj0KLTpMkOj2J0oNknNPo%TMpLkMnJTjLlMLn%TnN
$$ plain form
10.48026 -2 -3 -1 0 0 5 -3 4 -2 0 6 2 2 2 -5 -5 1 2 -2 -6 2 -1 1 -3 1 -3 2 -8 5 5 -1 -3 -7 6 -5 -1 -1 0 1 0 -1 1 -1 1 -1 7 1 -1 0 1 1 2 -1 0 2 -14 -5 3 -2 0 -6 -2 1 0 3 0 -3 2
10.44617 2 1 0 0 -4 1 6 0 5 -8 0 -5 2 0 0 0 -6 4 -7 0 -6 5 -3 -5 -4 -3 -3 -5 3 1 4 2 -1 -1 5 2 -4 2 -4 3 -4 -2 1 2 0 0 -1 -2 0 -2 -2 1 -5 5 -4 0 3 4 -7 -7 1 5 0 0 3 1 -3
10.41260 -3 0 2 -1 -2 -3 6 -4 -4 -2 1 -4 -8 -2 2 4 5 -7 3 0 0 0 -6 0 3 0 -2 0 4 0 6 2 0 -5 -2 -1 -1 -3 6 4 -3 4 0 -4 -1 0 0 -5 -2 1 -4 3 -1 2 3 4 -5 -2 5 -10 0 -5 3 0 -5 0 0 -4
10.37852 -4 0 2 -4 2 2 3 2 4 1 0 3 2 0 1 -3 0 -7 2 1 2 0 -3 0 3 -5 1 5 -4 0 3 3 2 0 0 2 -4 0 8 0 4 -5 -2 -3 0 0 0 -3 -4 0 -9 -1 -1 4 0 5 2 3 -8 -4 -3 -2 4 -6 1 -5 -3 -5 -3 2 -1
10.34291 -1 -2 -2 -1 4 -4 -3 -5 0 0 0 0 -3 0 0 1 -2 3 -3 0 1 5 -5 2 -5 1 -2 2 -1 -4 -1 6 -8 -6 2 -5 -3 -1 -2 3 6 2 2 -5 -2 -2 -3 -1 -4 0 -2 3 -5 0 -5 -2 -5 5 1 -3 2 -1 -3 0 1 2 1 0 7 0 0
10.30730 0 2 0 -2 -3 -3 0 1 5 -6 1 0 4 1 3 -4 4 -1 0 -1 2 0 1 -1 -4 3 1 0 1 5 -4 5 0 -1 -2 -1 -1 2 0 0 5 -7 0 -1 0 5 -2 -1 -2 -4 -1 6 -4 -1 -2 -5 -8 0 -7 3 4 1 0 5 -3 0 2 -2 0
10.27270 0 0 -5 -1 -2 -1 2 -5 -1 4 6 -4 0 -2 -5 -1 -3 2 1 3 2 0 3 6 0 -3 -3 -3 -2 -4 0 0 4 -9 -6 -1 -3 -3 -3 -2 -1 -4 0 2 0 3 -5 4 -6 3 2 1 -4 2 2 -4 -1 -1 -2 -2 -8 1 0 2 -3 -5 2 0 -4 -3
10.23760 -3 0 0 2 6 -4 0 -4 0 1 0 0 -5 -2 -3 -2 0 0 9 -8 1 -5 -3 -3 1 1 -4 -1 0 2 5 -5 -3 0 3 -4 0 -2 4 -8 2 -4 1 -1 -6 -1 6 0 0 0 4 -3 0 -2 2 -3 -2 -1 -2 1 -2 2 5 0 0 0 -5 0
10.20352@Mj5J2Nj5RjNnlKQoMm%rJ3nJ%J%LoJlMrJ1MmnMnOkKj2PLNmNqOoJmMkKjkQlj%KpNJjT%l
10.16994dNM%nJnMNolN%TRj3MoNkmMTOpmoPOnmjQm%LjLrOKnJNqRoKjJmjRomPLpPpLOlTjlKTNmjm
10.13382dKLj%jlM%TkOj3RkMkMoRj0KjKljJ0moNnLlRnkOmlTRpL%MnJjJTKoMPp%Nj0NKJk%pJ1qLK
10.09974BkoOkKLKrL%KkpJ2pKTnLTqJnJ0%klKJkKMoNj%pMJLnOKmKTlkJK%TknKLlNTj8J1KjUJLj0
10.06515gJ2j0NlLqRmJ1mrOjJqPJj%ToPmLkjPlmjNmjL%lPqNnM%Tj0J1jJKmKlJLJjkTOl%nNJkJj%
10.03107aKj%j%Jk%k%JjJ1qkJLljlNJMpnJ3mloQKklLlPqNkKpO%lMOplL%jNk%lNnJkK%qOnNKjTQ
9.99596Fj0jPlJ%TjmKJPqLrJ0Oj6PMkrJ1nQmjkjTKqRKJoP%rMLnLTj5J8rRojKToMj%lRolQqMmPn
9.96239bkOlMmMlmKMOj3Pjk%TLl%mJ1oMp%Nj1RKkTK%TJTlJ%VjMk%pOoOj1J2njNnLKjkQj2NKNrQ
$$ plain form
10.20352 0 4 -11 1 6 -9 0 -1 4 -1 -4 -2 6 0 4 0 0 -9 4 -1 0 0 1 1 4 -2 -1 -4 0 -9 2 6 2 -3 1 -4 2 0 2 -10 -3 0 5 1 6 -2 4 -2 -1 -5 -1 -3 -1 -2 -4 4 1 0 0 2 -5 0 1 0 -1 -1 -4
10.16994 -4 1 5 5 0 1 -4 0 5 -1 -4 1 1 1 10 -3 1 -5 0 -2 -6 -2 2 8 1 -3 -9 -2 4 -1 -5 -6 2 -2 -2 1 0 3 -6 0 2 -3 -2 3 -5 4 -2 0 -1 0 -4 -5 4 -2 -6 1 4 -3 4 -3 0 6 3 0 -1 -4 -2 0 5 1 0 -4
10.13382 -4 -2 1 0 0 -1 -4 0 0 0 -2 4 -9 0 -2 2 0 4 -2 7 -3 -1 -2 0 -3 -4 6 2 -4 1 -4 -1 -4 5 0 -2 4 0 -3 -6 3 -4 -1 -1 3 -2 -1 -2 -1 0 2 -4 0 7 0 0 5 -5 0 2 3 1 1 -6 5 -3 0 2
10.09974 2 0 -6 0 -2 0 3 5 -4 -1 -1 1 -1 -8 4 -3 -1 1 -4 -1 2 -6 -5 -10 0 0 -2 -5 -3 -2 -4 -2 2 -4 1 0 0 -7 -3 -2 1 -4 2 4 0 2 4 1 -1 0 2 2 2 0 -5 -3 0 -3 2 7 -11 0 2 1 0 -1 0 3 -7
10.06515 -7 5 -5 0 -3 0 -8 1 -3 8 4 -5 1 0 1 -7 0 1 0 0 0 -6 1 -3 0 -2 -3 4 1 -3 -4 1 -3 -4 -1 -1 -4 3 -5 0 -5 -1 -1 -1 -11 0 -1 0 2 -2 0 -3 -2 1 2 1 -1 -3 3 0 0 -5 0 1 -1 0 -1 -1
10.03107 -1 1 0 0 -1 -1 0 -2 -2 -4 -4 -3 -4 7 -1 -3 -2 1 -2 -3 -6 -1 0 4 -3 -8 5 1 -2 -8 0 2 0 -3 0 -3 4 -4 1 -1 1 -6 0 0 -3 1 7 0 -3 0 0 -1 4 2 2 -1 4 -1 0 -2 0 0 -8 -2 -7 -2 0 -1 -2 6
9.99596 6 -4 -5 2 -1 0 0 0 -1 -5 -3 -2 5 -3 0 -9 1 7 -9 -2 2 0 -9 2 -3 5 1 0 -2 -3 -4 -2 -10 -1 1 2 -4 3 3 -6 -2 1 -4 -1 2 -13 5 -4 5 -1 -2 0 2 -4 0 -1 -1 -4 5 -1 -4 4 -4 0 -4 3 -2
9.96239 -2 -4 2 -1 3 -1 3 0 -4 -2 2 8 -5 2 1 -1 -1 -1 2 -1 -1 -5 6 0 4 -3 -3 2 -9 0 2 0 -2 0 0 0 1 2 -1 0 0 0 0 0 -1 3 1 1 -6 0 -6 0 -11 1 -4 -5 0 -5 -2 0 -1 -3 5 -7 -2 0 5 -4 4
9.92780DqNj%LJkTnJL%JToN%j0J5o%JNn%MpL%jkjMjkJT%LkjTkM%Lmj%MmOljkjMkTjKmL%lKlNM%
9.89219BLj4MN%pJ4j1%KkNjnkRl%jJqPkKM%oKkNoPJloLM%JmlNqPL%J%j1J4j0JTjPnNqRmjLnPnp
9.85861gPMj1QnJjOlJmM%MoJnO%PpkmNJjMlmJlMK%mRoljPoLJlLjpPJMoMoJKJjLkoKT%lMTmLmKk
9.82249bLJnL%nOoMmL%kMm%KNj0J0rOmNlTN%MoOoRpoPmKJ%lJKJTjTkmKMJKpOrNnP%TKJj0RlKN%
9.78739FqL%lnLO%mj%kJ2p%lKOj2NJQp%jTQj3Rp%NmJ%JL%jkTMlLnLoJ2j1MnLjJOj%TJoJUlKlOM
9.75280DmpJOnLQrLnPlMl%lM%j%TNj%o%Qj1LKT%TkNrKoPJjl%LRj1NlTMkTJjkJ0kTlTNQqlLTkjJ
9.71770@oOpLjNoOmkNKj0RJ%kmKTJ%qJ5qk%kJ%k%O%nPmKnNqQj1J5j2RnmJ4mLnkJPlnjLnOLnJjN
9.68412DqQmnLK%lLoKOkj0J3mLnNnJ1rKjpORnolNjKmNmOpLkmLjM%nLRj0rPTnJ4j0jmRklNmknMK
$$ plain form
9.92780 4 -4 1 0 0 3 4 2 0 -5 -4 -1 -1 0 1 -5 0 0 -10 5 -1 -1 0 5 0 0 4 -3 0 0 -1 -3 -4 0 -1 -3 -2 -1 -1 2 0 -1 -2 -4 0 0 3 -1 -2 -2 2 -2 4 1 0 -2 -3 1 -1 -3 -4 -2 -6 -3 -3 -6 -4 -7 -2 2 2
9.89219 2 5 -9 -5 0 0 -7 7 -4 -4 -2 -4 1 0 -5 -7 2 -1 -1 -2 -1 -9 -2 -4 -2 2 2 -4 -2 -4 1 -5 2 3 0 -6 -3 1 1 2 -2 -5 0 -8 -1 2 2 3 3 -8 6 -4 -3 -2 -3 4 -1 4 -4 5 1 0 3 -2 5 0 -7
9.85861 -7 0 4 -7 1 -4 -3 -4 2 -1 0 -4 0 0 4 -2 -1 -6 0 0 7 0 -2 -6 -1 0 -1 3 0 -4 -3 -6 -2 0 0 -4 5 -1 -4 -5 2 -4 -1 0 -3 0 -1 -8 -1 0 4 -2 2 -4 -3 -1 0 -1 2 0 -6 -4 -2 -2 -5 -1 3 -1 2 -2 0 -2
9.82249 -2 1 2 -3 0 0 -5 1 -5 -1 -5 -2 -2 -4 0 -4 -4 -2 3 -7 3 -6 0 -4 1 -2 -5 0 0 4 -2 4 -2 7 0 -6 1 -3 -1 0 0 -3 -2 0 1 2 1 0 -2 -6 -4 0 1 3 -4 2 -7 -2 -7 0 0 0 2 3 -7 2 -1 1 6 6
9.78739 6 -2 1 1 -2 -7 -4 2 2 -2 -3 -3 -5 7 0 0 -3 -1 5 -7 -2 -1 7 0 0 -1 -2 6 -7 2 -5 -5 0 -4 -3 -3 -2 1 1 0 -2 -4 0 -3 0 -5 -2 -8 4 -7 -3 -8 -5 -6 -5 1 0 0 0 1 -5 -4 -3 -2 -5 -3 -6 0 4
9.75280 4 0 -7 -6 0 -5 -2 6 -3 0 -5 2 -1 3 0 0 -3 1 1 0 0 0 5 4 4 -2 -2 6 -5 -2 0 2 2 2 0 5 -4 -2 -8 -1 0 -1 -4 -4 -1 8 -3 2 -1 -4 0 -2 -4 -3 -4 -6 4 2 0 -3 -6 -1 7 -1 -4 -1 2 0 -1 0
9.71770 0 -6 0 -7 -4 -5 0 -6 0 -4 -6 -1 1 -9 0 1 1 -1 -5 -3 -1 0 0 -8 7 -1 -3 -3 -5 -4 -4 -6 -6 0 0 -5 2 -2 0 -5 0 -8 0 -11 4 -8 1 -4 -8 6 2 5 0 -2 -1 6 3 -2 -3 0 -5 1 4 -1 0 -1 4
9.68412 4 -4 4 0 -5 -2 0 0 -3 0 -6 -4 2 0 -10 3 -1 2 -3 2 -3 8 -1 1 0 -7 -1 8 3 -3 -6 -1 -2 0 -4 1 -3 3 -4 -1 -3 -7 -4 -5 -1 -1 -6 -3 6 -4 -13 -6 1 -4 10 0 -1 -5 4 2 -1 4 0 -2 -7 -3 -1
9.65055a%JnRrLKlOmTNLj0OoP%mNlLmNmTNKjlLl%OlQj2JkMjk%nJ1klLpMNqjOKQrKlmPlKmM%LnM
9.61545Cj1OJTjJpJ0ljJLljkL%MmkmQkMmnQljlKT%LljloPJlQrOk%jkMJ%JjkJjKlJmNkKkTPJom%
9.57984gM%Mj%nMmJKLlKJoNrLOoMlNnMLj1MJ1j3KOnM%Kj5J0KpJ1mLkjlTKJM%Jk%jJ%KLomLQnlT
9.54626fNkLlKlOqKTMlklJ2onN%Nj1OloPKlJKkTKOlTMjnPlJNj7J1kKmMnRj3PJ%TKjnLJ%lMTqMm
9.51218dLkLlJKlPj1P%kj%LoMj%jLTkJLlj2J2jpPJlJjkMqJ2qQmL%lJMpL%Lj2NOolQkJj%TjKQj0
9.47860aKl%MlOn%TJKnQj6J3j2QjKmLJlK%J%kTJQr%KTLk%TkKnkRmjmRrJ2j0OoNnNjqJ2jqNMj1P
9.44554@jpPJ%TqNJKkL%n%lMNolP%jnOKkmKTqNjkMkTNmQj0MkJ0mpRlKjnMml%NOrPk%TKJ%j0OKj
9.41044@rNPlJmT%J1mnNmOjPj0QqK%kMkNopJ3jkljoQk%KjlMmPjokJQmLoKJkjNq%NlLnLNqLMlk
$$ plain form
9.65055 -1 -1 0 -5 4 -5 -2 0 -3 3 -1 -5 0 3 -7 -1 -7 0 0 -4 1 -2 1 -3 2 -2 -6 -1 1 0 -3 0 -3 -3 3 0 8 -4 -3 -5 -1 -2 -4 -4 -9 2 0 -3 0 -7 -3 2 -6 -7 -1 1 9 0 2 -1 -5 2 -1 1 -3 1 1 4 -1 3
9.61545 3 -8 -2 -1 0 -1 0 -7 3 0 -1 0 3 0 -1 -3 0 0 4 0 -2 -6 2 0 4 0 -5 3 0 -1 -4 -2 0 0 3 0 -1 -4 -10 -3 -2 -5 3 -6 0 -2 -2 -3 -5 -1 0 0 1 0 -2 -1 -2 0 -3 -2 -6 -1 -3 -1 -3 -5 2 3 -3 -7 -7
9.57984 -7 -3 -3 1 0 0 -5 -1 -5 -4 -2 1 -2 0 1 -5 0 -9 -6 0 -6 -2 -5 0 -5 -1 2 -9 -5 6 -7 -5 1 -4 0 0 2 -13 -3 -1 -8 3 -1 2 0 -1 -4 -7 -5 -4 0 0 1 -1 -1 -2 -1 -1 1 4 -2 -6 -3 5 0 -3 -6
9.54626 -6 -1 -3 0 -3 -1 -4 2 -6 -4 -2 2 -1 -3 -6 6 0 -5 0 0 5 -6 0 -3 -9 -2 0 -3 -2 0 -2 -4 -2 4 1 -2 2 1 -4 3 0 1 6 -11 0 -2 0 -4 0 -5 4 -9 -2 -1 -1 -1 1 0 -5 -2 -1 -1 -4 0 4 -4 0 -4
9.51218 -4 -1 -3 0 -3 -2 0 -3 4 -7 0 0 -2 -3 -3 0 -6 -2 -3 -3 -4 -1 2 0 1 4 1 -11 1 0 -7 0 1 -2 -1 -2 -4 0 -8 4 -4 4 0 3 3 0 1 5 -2 1 1 4 -8 -3 3 -3 -6 2 0 1 0 0 0 -1 1 9 -1
9.47860 -1 1 -2 -2 2 -1 5 0 0 0 1 3 -2 6 -10 3 -9 -1 -2 0 -4 -1 0 -3 -1 -1 0 0 -2 -4 -3 5 -4 -4 -2 0 3 1 1 1 -1 1 -4 -6 3 -1 -2 -6 3 -6 6 -4 2 -4 1 -4 1 0 -8 4 3 -5 0 4 -7 0
9.44554 0 -1 -8 -1 0 0 0 -8 -3 -2 0 -2 1 1 -4 -4 -7 -3 2 -4 -7 0 0 -1 -6 0 2 0 -4 -2 0 -8 -3 -4 -6 -2 -4 -6 -1 -5 3 -7 -3 -5 5 1 -6 3 0 2 1 -4 0 -4 -7 -7 -2 4 -5 2 0 0 0 2 3 3 -7 -1 1 0
9.41044 0 -9 -4 3 0 1 -3 -7 -7 4 0 -5 0 -4 2 1 8 -2 6 -2 0 0 -2 2 0 5 -1 -8 5 4 2 -1 -2 -8 0 -2 -2 0 -1 -4 0 -4 3 2 -4 -6 -5 3 -1 2 -4 -2 -1 -3 -4 1 -7 -7 -2 -5 -2 -7 -4 1 -7 -4 0 -3 -5
9.37584eJ0rMrRqJ0kJnmMTn%TNnRnKj%TqJ2moKJN%pKOj0MLlJPkqjPjkjmK%MNj0NmRqkjRnkPTpk
9.34176@jMnPqLoPKTnMj2J2nlRoj%jmOLjj1J0nJKJTpMNj0OnPnKJrJ1oJ0pnQJkOrJkJ0olJLkjLj
9.30920aNpOpJ0olJPp%lJMjkjkLjOkTJ0j4KOnKLMqNj6J1%KnMjKkNnj%Ol%kOpNoNj0J4nlL%KmP
9.27665Ej4RoMKoKkTNKTmJkTmO%LKjTJ%mJOlnLjkJ1rLlLlLk%nLTJpPlkK%TMjoLT%lJpMPmLlTN%
9.24104@klNmjQoKMlNmkLkLpNjnKJljNlNlK%KnJkjJLpJ0qOnKk%kP%nKOolLpJ1rOoJ3qNk%j%k%L
9.20593@nMqRnJ1j1L%J%rJ5rMlPrkJ1ojlLlMnNToL%mjJQqLJnN%KpOnlLNlKklKlO%JmMlpKjMlJR
9.17134Ckj1J0%lmJOjNmTKTLqL%lKOmMnMk%Tj0LMLjkLm%L%kKPo%kK%KlTLoPrNJ0j4PmOmJmRrMn
9.13726gNkMnNlLlkK%JjOljJmLkNrRj0PJnNpMJKj%TjnPK%lJqRmkNlLlPqLlMoLQnNj2J0qNqPJnQ
$$ plain form
9.37584 -5 5 -4 0 -9 0 -8 2 0 1 -4 -8 -4 0 -5 -5 -5 0 -5 4 -1 1 0 0 0 -8 4 0 -6 -4 -3 2 2 -5 -3 3 -7 -3 0 -3 -2 5 3 -5 -6 1 0 -2 -3 -7 -5 -5 -1 4 -6 -1 -5 4 -4 -6 -7 2 -3 -5 2 9 2 0
9.34176 0 -1 3 -2 5 -3 0 -6 1 3 5 0 4 -8 4 -1 -4 5 -1 -2 -2 -3 -7 -1 2 1 -10 0 -5 -4 -2 -1 0 -7 -3 2 -8 -2 -7 0 -5 -3 -2 -11 0 -6 4 -3 -8 0 1 -1 5 -4 -3 -5 5 -1 -4 -3 0 -2 -3 0 -1
9.30920 -1 4 -3 3 -4 6 0 -3 -2 5 -2 -2 -5 -4 0 -1 -3 -4 -6 -3 -4 2 0 -2 8 -6 -4 2 -3 -1 2 6 -2 3 -13 -2 -2 0 -5 -1 -2 0 -2 3 -2 -3 -3 3 0 0 -2 4 -3 2 -4 1 -9 5 0 -3 0 0 2 -2 5
9.27665 5 -9 0 -6 -2 0 -6 -4 -6 -8 -3 -1 1 -3 -2 -4 -6 -10 -4 -4 -1 1 0 -1 0 0 -4 -3 3 0 -5 -2 -3 -5 6 -3 0 -3 0 -3 0 -2 -2 -7 -4 -1 0 -7 0 -3 -5 -3 -3 -3 1 0 -6 -3 0 0 -3 -2 -9 -5 2 -2 1 -2 -5 0 0
9.24104 0 -2 -5 0 -4 -5 3 -3 -1 3 0 5 1 -1 2 0 3 -4 1 0 -5 -3 -2 -5 -6 -1 -4 1 -2 0 0 2 -3 -2 -4 -5 -4 -1 -8 2 -6 0 -5 -3 -5 -5 -7 0 0 -5 -3 3 -3 -6 -3 -10 1 -8 -2 -8 5 -3 2 0 0 -1 -1 -3 -3 0
9.20593 0 -5 -1 -9 0 -5 6 -5 -2 -2 -1 -1 -10 5 -4 0 -3 4 -5 -7 4 -2 -3 -6 -3 -6 -2 -7 -2 3 -3 0 0 -4 -5 -4 4 -4 -1 0 -5 0 0 2 -5 1 -4 -7 -4 1 -2 0 -2 -5 -3 -6 0 0 1 -3 1 -2 -9 -7 -8 -4 -7 -6 3
9.17134 3 1 -10 0 0 -3 -7 -6 0 -1 4 0 -4 -2 0 3 -5 -2 -2 -5 -3 3 -1 3 -2 2 0 0 0 -10 -7 -3 0 -1 -3 0 -4 -4 -1 -1 -3 -1 6 0 0 -2 0 0 2 -1 -4 -1 -7 0 -9 -4 6 -8 -1 -5 1 -3 -2 -6 3 -6 -2 -7
9.13726 -7 -2 -4 0 -5 0 -3 0 -3 -5 -3 -3 -2 -3 3 0 -1 0 -4 -1 -3 2 -7 2 -8 -1 0 -5 0 -7 -3 -2 0 -1 -1 -1 -2 -7 0 2 2 -1 0 -8 1 -3 -5 0 -3 0 -3 4 -4 -1 -4 0 -6 -3 5 0 5 -7 3 -5 0 -8 -1 0 -5 3
9.10216CnJnNKpMjPkT%j0QjL%TlPm%kmOjLnMklJ1qMljkLjnJNkKpKlJ0k%lJoOP%plMjTJ%PklTLT
9.06706CrKTlLnJKTpQoQqRnNnKlMrN%M%Tlj%LMpMoM%TNpMlNkMNj2Jl%Qj1QpM%L%TjkLMqKTJmJK
9.03145@kTMnLMoKJKqPl%L%jmN%JnJ0j3NJKkMnJ%J%kLoMJK%qPlKkLQj1PpjJ%TKjkLkTMmQoMlmP
8.99635BNo%nJQrMJkJ%TNokMkJjmkMLoQlQnmLToK%nJ0Kj2MjMj%oPL%mMjkKln%MjJpLjNLj0RMp%
8.96124aJ%jpMPNolMJkmjLUjpNm%lQlMo%NmJj%UKTjlK%lmNKJmTMkKLlLTj0NLopJ6o%JljNlj0R%
8.92513bJ0qLJj1OJjLoMjMlJnMlkL%k%PlkmRkjkTM%nL%K%lLlP%m%lNoRoQj1NlMn%Rj0OkTlKMKl
8.89053@jL%MpRloQnQj0LNkLkpNMLpOqJ1j6RmMmlPmJKpLlJ%JNo%MpljTJ0qOLnKTkJjKk%NljlQo
8.85594@Oj0O%LnTN%JlKlLjNnJOlTPmoLoOJjLkKlJ%jKoQoQoNrMjlQljkK%lNjTNrMjNnLj0MJkNL
$$ plain form
9.10216 3 -2 -1 -6 -1 1 -6 -2 -3 4 2 0 0 -10 -2 -3 0 0 0 -3 4 0 0 -2 -6 0 -1 2 -3 1 -1 -4 7 -1 3 0 -1 -3 0 -1 -6 -5 0 -2 0 -7 -5 -8 2 0 0 -3 -2 -8 -2 5 5 -2 -5 -1 -2 -3 -2 -2 5 3 0 -3 0 3
9.06706 3 -6 -4 -2 -5 -2 -7 -6 -4 -2 -9 -1 -7 1 -7 2 -3 2 -3 -1 -4 0 -9 -4 -4 0 0 0 -3 -4 -4 -1 3 -4 0 -6 -2 -2 -2 3 -4 0 -3 2 0 4 9 -3 -2 -5 -5 3 -8 0 -7 -3 -3 0 0 0 -1 -3 0 4 -4 -2 0 1 -3 -2 0
9.03145 0 -2 -4 0 -5 -2 2 -4 -2 -1 1 -7 0 -3 -3 0 0 -1 -5 0 0 1 -4 6 -7 -2 -1 1 -1 3 -2 -1 -1 0 0 -2 1 -5 -1 0 2 2 -6 1 -2 0 -2 1 9 -2 5 -2 -3 -2 -2 -2 0 -1 -3 0 -2 -4 0 -4 4 -2 2 -1 -5 2
8.99635 2 7 1 1 -4 -3 5 -4 0 1 -1 0 0 0 5 -1 -3 1 -1 0 -1 -5 -7 -3 0 -6 2 -1 7 2 -2 1 4 -2 0 0 -5 5 7 -5 -1 -2 2 1 1 -5 2 5 5 1 5 4 2 4 1 -4 -4 0 -1 0 -7 -4 -5 0 3 -7 2 6 -1 -1
8.96124 -1 0 0 -1 -8 -4 3 8 2 -1 3 4 2 -2 -3 0 3 6 5 -2 3 -1 -1 -4 4 1 5 -1 -1 4 0 1 0 0 0 0 2 4 3 0 2 2 -1 -5 0 2 3 -1 -5 -1 -3 -1 2 -1 2 5 -5 0 3 -3 -10 6 0 0 1 -2 -3 2 -1 -11 -2 -2
8.92513 -2 8 0 3 4 -7 -1 0 -1 2 -4 0 -1 3 0 1 -4 0 -3 -5 -2 -2 -4 -4 3 0 -2 -6 3 1 0 -2 -4 0 0 -5 -2 -2 0 0 -3 0 -3 4 4 0 0 -3 2 -4 5 -1 7 -4 1 -2 2 -3 -3 6 -4 2 0 -2 -5 -3 1 3 0
8.89053 0 -1 2 2 6 -1 8 5 -1 7 2 10 0 3 8 6 9 7 0 5 9 12 5 11 3 14 -2 7 3 7 3 0 7 3 4 6 -1 2 -1 0 0 1 6 0 0 4 -3 -6 -7 -8 2 -6 0 3 -2 0 2 0 1 0 2 0 0 5 2 1 -2 6 0
8.85594 0 6 -4 2 2 5 0 -5 0 0 1 -2 0 -3 0 -1 4 -1 0 6 3 0 7 3 -3 0 -6 0 1 0 3 1 3 0 1 1 0 2 -4 4 -2 6 0 5 -4 0 -1 -4 4 1 0 -2 0 0 -3 2 1 0 5 -4 0 -1 4 -1 2 -8 -4 -3 -5 0 3
8.82033CpJ0o%jTJKLoOoK%OlNlnL%kOqJrPnJ6njnNJOj5J4kj2PkJNoMlRj1JN%TkjlQoNkTJnLJPn
8.78676D%KkNkomMKJkJMpKjKk%O%mMkJNrNnJ%N%KoRj2NTk%JkLn%LQj2KTNj3RrJ3kLlkpRKlLqOk
8.75216A0JkPoQlnK%jN%Pj0MqJ2JTpKTOlOMPmlPnmJ5pQNqNRmQJkRO%J7JJ7%PMK0OJ2J5J7L2J5
8.72215B39K1M0K6M7L7N2M6N3N1M2M6L9L4K1K5QJ1j3Tk7k1m7l5m3n0n1l6m5l5m7k3m1j7l2rj2
8.70384B41j8j0pMj4QrQLKLJ0J7J1J7TK0L2K5L9M1M5TM7N5L8N8L7L2L0K6JJ3kj6k3k2m7l7o0l4
8.68298F26o1l9n2m9n2l1l6l7k4k8k6j2k2pk0orj1lrlj4%ljj4J0j1Mq%JjmlLoMmMmLqjTKJkOnL
8.65703D0oPqKNkLjnMRqPrN%JRJMkjJKQMLMN%J0JNKJ5LJ9MOJ9J1J7J5J3J8L2K0L2L6L2N3L9N8
8.63007E42N6P0P9P7R8Q9J12R5R4J02Q4O4M8L3J1Oj9l8o9o6p6r6q7r8q7r4q1q6p8o5o2n4m7n3
$$ plain form
8.82033 3 -4 6 0 0 -1 -2 -1 1 4 -2 4 -2 0 0 6 3 8 5 0 3 3 1 7 -1 0 -9 -2 -7 9 4 3 -2 3 4 10 -5 9 7 -5 2 0 1 6 0 4 1 10 -1 0 5 5 5 3 2 -1 7 1 6 4 2 3 -2 1 2 9 4
8.78676 4 4 6 4 9 7 1 -3 1 3 4 2 3 7 0 2 1 3 1 1 7 7 3 7 5 6 11 2 7 2 3 3 8 8 10 4 13 1 6 11 9 9 10 8 11 6 6 9 17 5 7 9 14 1 10 1 14 12 15 12 10 3 12 14 11 14 6 12 10
8.75216 10 11 9 16 10 18 15 10 12 12 11 16 16 23 13 17 9 21 22 23 16 18 20 26 23 29 33 40 36 33 40 35 31 46 39 47 52 44 49 58 54 62 63 61 70 76 76 93 94 111 111 118 122 142 148 160 175 192 224 239
8.72215 239 260 300 326 373 410 462 508 561 612 654 700 739 773 794 819 827 838 825 812 785 764 717 682 639 589 538 502 457 422 375 352 311 294 262 253 241
8.70384 241 223 213 206 210 196 204 195 203 206 208 211 221 238 249 266 283 303 335 360 399 440 485 530 577 632 670 728 765 797 827 853 854 867 865 849 826 804 757 720 660 626
8.68298 626 565 526 474 425 373 342 306 269 245 217 191 179 157 150 130 124 115 104 101 92 89 75 75 72 71 57 67 56 60 52 52 53 52 48 45 48 42 46 42 46 42 45 37 36 35 37 38 36 42 37 40
8.65703 40 34 41 33 35 40 38 41 40 35 39 48 40 47 38 43 43 44 53 54 58 56 55 56 58 66 70 73 77 82 82 92 93 98 100 115 118 137 141 147 166 177 194 209 222 240 272 292 324 360 392 445 484 542
8.63007 542 598 668 747 824 922 1011 1123 1218 1312 1414 1498 1562 1610 1643 1654 1660 1641 1603 1534 1468 1392 1296 1209 1111 1024 930 849 763 685 620 558 504 457 404
8.61278D04k8m5j6l4k1j7j8l0%j9lj7j0j2TKj1plpnrNj0Qj3ojklmOqjkpJkMrLOrj%mj1QJKLmnk
8.58531B5JOjqJ0omjK%j%TmMrNmLmNmMlKkJlLjKqRmRmoNkTNjoJ1j4NKTqJ5rNnKokKjQjPj1KJL
8.55224B1j1Oo%lJkKLJmlQpnJ2mOrKUrRJ%JpLkMl%JjMlOj2JPmkTLKlJNKqKjMmklJ1nT%klNlOjJ
8.51765FjnKJlLkjKkK%KRj6J0pQq%lLKMNp%jLKqMjMkmMmKjOj1LKJlPkjJpJ1kpMmPqOmPmpKTNjT
8.48306DmNj%mlNKjM%l%KoMKmkKN%Mqj%jJJ2j2lKPkjTlNpPknKNm%LjTL%mnKNlKjkKJ%JKnLoJ4o
8.44795FlNjJkrNkOnMkMj1MKPj0NkKMqOnkJKkjJlQjmLoRlKnN%j%kTPqNKJlJToQmjLlmMoPlNnjO
8.41234FnJLlkLJm%jOn%KlPrOlOj2J6j0MnjLMrM%NmjJOj4J7%lj1RJmk%NkmL%KmNnJ0j2Mm%K%Kl
8.37979aOnJ%OmTOpPrQqMjLjkTnRJ4j4KjJNlnOklMTJnjPomOjJpOj%kjl%JLKkqMJ%JLJnJmPkJkO
$$ plain form
8.61278 404 376 331 315 281 260 243 225 195 195 176 173 156 146 134 122 124 113 106 103 96 91 82 87 77 85 72 66 65 63 60 56 62 54 53 51 44 45 43 47 38 41 47 38 37 37 33 22 30 31 33 36 32 27 25
8.58531 25 26 32 31 23 33 27 23 22 24 24 23 23 23 19 23 14 19 15 18 14 19 15 19 16 18 16 17 14 17 16 18 10 19 15 24 20 14 19 17 15 20 19 13 24 10 15 17 19 11 26 17 22 17 19 13 11 13 12 20 19 26 15 17 18 21
8.55224 21 10 16 10 10 7 8 6 8 11 12 8 5 13 6 1 13 9 15 6 8 10 12 3 12 13 13 14 7 10 8 12 9 9 10 9 13 10 16 4 5 12 8 6 4 7 9 6 7 12 14 6 8 7 11 7 5 2 13 8 3 3 1 -2 3 0 6 5 6
8.51765 6 5 0 2 3 0 3 1 0 2 0 2 2 4 13 -3 7 0 8 0 0 -3 0 2 6 11 4 4 3 6 8 0 4 3 7 5 1 5 1 3 2 8 -3 0 2 3 0 7 5 4 5 -2 9 7 0 4 0 7 -1 5 1 8 4 -3 -1 1 6 5 4
8.48306 4 0 5 4 4 0 -3 2 4 3 7 7 4 4 6 0 4 6 2 0 2 7 7 11 3 2 2 1 2 14 2 -1 1 8 6 5 4 1 6 -1 6 4 -1 1 6 2 2 5 4 3 6 6 2 -3 -1 4 1 3 2 0 2 3 3 4 6 1 4 -2 12 6
8.44795 6 3 8 7 8 6 -3 2 0 6 1 5 3 7 -4 0 2 9 -1 4 2 4 8 0 6 1 -1 0 2 0 -1 0 -3 5 4 0 3 -3 6 3 5 0 5 5 4 4 2 0 7 -1 4 6 7 4 5 6 0 8 4 3 6 3 -1 3 -3 4 1 6 1 0 6
8.41234 6 1 2 5 2 0 3 4 0 0 -1 5 0 0 2 -1 6 -3 3 0 6 -6 10 0 4 -1 -2 1 5 -4 0 0 5 1 0 1 7 -7 10 10 7 -4 5 6 2 0 0 5 3 -1 2 2 4 0 5 0 10 -2 2 -2 -2 0 0 2 -1
8.37979 -1 5 0 1 1 7 3 -1 5 -2 5 -4 4 -4 0 -1 2 1 -1 -3 -8 1 15 1 3 2 3 8 5 0 6 4 1 5 9 10 5 4 11 5 1 7 6 7 0 6 5 5 3 2 -1 -1 0 3 5 3 -5 -1 0 0 1 4 5 0 1 -3 4 2 3 1 7
8.34418GpLj0QTrjPj1NmMjPqQj0OLlkUKjLPmj0J0kjmKMNj0MJnJkJLMloJMJoRpLTlk%LlKj0J4jp
8.31111dJMLmnNoLjMLjokOJNKr%jTKjKmMpPkKnNKkljLn%J0joRqLjJMnLkKlmKJkKJMj0%PjMp%Lk
8.27550bJ%TJTnQpPnjlJ0j0NmOpPnMjLPj7N%RqmJ0j3QJMpMoPjmLkpRnMjkJLk%mJ2j1J1j5OKklLT
8.24294A%pQlMpMm%NkMlJjJmNlrJ7j7J1jKj%kJNknmO%lKJToN%JlnJ1p%L%mTOJn%K%NmNlKnMKJj
8.20835BlKPqLjqQ%oOkJj%pQJMopPlL%MpMrOKmLlOKmJQj3Pj4J5m%pNkJKMnkOljMmTKQnJT%ToPJ
8.17325CnqJ3m%JjJjQmKnNj1J1m%KJ%ojLJKoKTj%jKknOjLmKjJrMN%joR%JkJk%mOLnLTmJlmkOm%
8.13815dQpnOlL%kM%j%qPJTlpJ1jLj0J%OlKJkKrO%mPJl%JjK%WnQj0MOl%JjNloQpJoQmMlLqQj4
8.10254a4K0rOnJpJ0nNmNnjk%J%Pl%mLlLpJ6pKqLNqOmNpJTPmMo%l%LKMjlkLkj%KLqjLKmOrRQj4
$$ plain form
8.34418 7 0 3 -7 1 9 0 -1 6 -5 0 -4 0 -1 6 -2 6 -4 2 5 2 0 -2 -4 -2 -3 0 7 3 -7 3 1 0 -4 -2 2 7 -3 1 2 -3 -2 -4 -3 0 4 1 -5 -4 0 1 -5 4 -3 0 3 0 -2 -2 1 -2 0 -10 4 3 -4
8.31111 -4 -3 1 4 0 -5 0 -6 -3 -4 0 3 2 -4 -6 0 1 6 8 -1 -1 -2 -3 -1 -2 0 -4 0 -7 0 -2 0 -5 0 2 0 -3 -4 -1 -6 -6 4 3 -3 6 -2 1 0 1 5 0 3 1 3 0 -4 -2 -1 -3 -1 0 4 -6 -6 1 0 4 -3 -3 0 -2
8.27550 -2 -1 -1 -1 0 1 -4 4 -3 4 -1 -2 -5 5 -5 0 -4 2 -5 2 -3 1 0 3 10 -7 -2 -2 7 -1 -5 5 -8 0 1 5 -2 2 -4 3 2 -2 1 -1 -8 1 -4 0 -1 -3 -2 1 -1 -1 -5 7 -4 7 -8 -2 0 -2 -5 -2 1
8.24294 1 1 -6 2 -1 3 -4 0 -4 -4 1 -1 3 0 1 0 1 -3 2 -1 -10 7 -10 1 0 2 1 1 -1 0 5 3 -2 -6 0 0 -3 -1 0 1 -5 0 0 1 -2 -7 4 -3 -3 0 0 -4 -8 -2 -1 -6 -6 -4 -4 1 -3 2 -1 1 -4 0 2 3 2
8.20835 2 -1 1 8 0 3 2 -6 2 2 -4 2 0 1 0 0 -7 1 2 6 0 -7 0 -3 0 0 4 -3 1 -8 -2 0 -4 -1 -4 2 4 0 1 9 -4 3 -11 4 0 0 -7 -2 -4 -3 -1 3 -2 -4 2 -1 -2 2 -2 -6 -4 4 -1 0 1 1 1 -5 2 3
8.17325 3 -2 -10 3 -1 -1 0 -1 0 -1 7 3 5 0 5 -6 5 1 1 3 4 4 -2 -3 0 1 3 -3 -1 1 0 0 -1 1 -1 -6 0 -1 2 -2 0 -1 0 -9 -5 0 0 -1 -7 2 2 3 1 2 0 0 -4 2 5 0 3 6 2 3 0 -4 -6 0 -4 -4
8.13815 -4 4 -3 -8 -2 -5 -2 -2 -4 0 0 -1 -1 -9 -2 -1 0 -3 -10 1 0 3 -7 -6 -6 0 -3 -1 0 -2 0 -9 -3 -3 -7 0 1 -2 -2 -1 -2 0 0 0 0 0 0 -5 3 -7 -3 3 0 0 1 0 5 2 -4 4 -3 -2 -8 0 -4 0 -3 0 -8 0 -14
8.10254 -14 6 -3 3 -2 -1 -8 2 -3 2 -2 3 -2 -3 -5 -5 -4 -4 3 0 0 -4 -1 -4 -1 -8 8 1 3 -5 -2 3 -5 1 -3 2 -5 -4 -3 4 0 4 -2 -2 -5 -5 -2 0 4 3 0 -2 1 -1 -2 -2 0 3 -5 -6 -3 -1 -5 1 -8 1 9 -5
8.06846eLlOqJ2njJpPKmNnlOkJmTJ0nmRnJK%kLmL%nKLkKlkO%TlLjK%mJLjlJTlmP%TlKmKLKpLMl
8.03285aJTjlNkjJjpRJmMmKlkO%pJQoNlkNmkML%nmLKmOl%m%OmRnKmLoPnJlOjmLKnjT%NJTlKnlP
7.99622aNn%TjoJPKk%TkNljqRjNj0Rn%kMlKqRkOmjkKlLkQo%JkJjMmKjT%kTJ1noPjmMm%LJnLjLj
7.96061aJTjqQpRnMkPnkTOnLjTJ1om%TM%KmMoKnLMnOn%MJn%JlPnNrPj0J2jrP%TjMpKjKNnlMlPp
7.92551aPlMpJN%kmLNlkjTK%LoMkTJkKTjT%qPlMkLjTkNj%TlL%TkK%nKLmLKnKjJlJjLmOmMnMOj2
7.88939eQnLjmLjPomjMkKLkKJkLl%klLMoQpLkTLJ%UkjNloRqO%VOoklOjmPljJjlMoJ2omLJmPnRq
7.85174anNMqLOLqMkJkNrLnJN%lkOo%JMjnPnjPnJmO%JkJnLmOjkPnJrJ1mKTljK%qJ0kj%JlMqP%j
7.81613aKJlmOjpQjklj%LNmNnJlKmOlLj%MmJTojJ0pMj%TnOpOnNjlKJjJ%NpkQKpPKoKkTJjoPjP
$$ plain form
8.06846 -5 -2 -5 1 -7 5 0 -1 0 -7 0 2 -2 3 -2 -5 1 -1 0 -4 -8 2 -3 -7 2 -3 -2 0 0 -2 1 -3 0 0 -5 -3 0 -2 0 -3 -5 1 1 1 -2 1 0 2 2 -2 -1 2 1 -2 -1 0 -3 -7 0 0 0 -3 -1 -5 -3 0 2 -5 -2 2 -1
8.03285 -1 0 1 0 -3 2 0 -1 0 -1 -8 1 2 -2 2 -2 0 -3 -5 1 1 -6 -5 3 -3 2 -1 -3 2 -2 -4 0 3 3 -2 -6 -3 -1 -5 1 -2 -2 -6 -6 0 -4 5 0 2 -2 1 -5 2 -3 -2 -5 1 0 -4 -1 1 -4 -5 -6 -6 -1 0 1 -2 0 -5 -8 -1
7.99622 -1 4 -1 -1 -1 -2 -8 -7 0 2 0 0 0 -2 3 0 -1 -9 0 -1 4 -6 3 -2 -2 -4 0 -3 -1 -9 0 -2 4 0 -1 -3 -1 -4 -1 -3 5 -1 -1 0 -2 -1 -2 2 -2 0 -1 -2 -2 -4 -6 5 0 -6 1 0 -4 0 -4 -4 -1 0 -5 -2 -3 0 -1
7.96061 -1 0 1 0 -8 0 -7 2 -3 1 -1 6 1 -1 -3 3 -2 1 0 -1 10 4 0 0 0 4 4 6 2 6 0 2 -3 0 4 -1 5 0 0 4 5 0 0 1 -2 5 0 5 -4 3 -7 5 4 -5 2 2 2 1 5 -2 0 -1 1 6 1 -2 2 -1 6 -1
7.92551 -1 6 3 7 0 1 6 6 4 0 3 8 5 3 2 1 3 3 6 0 4 2 0 1 -1 1 3 2 1 1 -7 0 -3 1 -1 2 1 0 -2 3 2 2 2 -1 2 2 2 0 2 2 -3 -1 2 -2 1 3 -2 0 -1 0 -3 -2 -3 0 -4 2 -2 2 -3 1 7 -5
7.88939 -5 3 -2 1 0 -4 -1 -2 5 -1 -5 -6 -2 -4 -2 1 -1 1 2 0 3 0 0 -2 -5 -2 2 -4 4 -3 0 -2 -4 -1 0 0 0 0 -2 -3 2 -1 -7 2 -6 0 0 0 0 0 6 0 -2 -5 1 0 -4 3 0 -1 0 -1 -4 0 -6 6 0 -4 -1 0 -4 3 -2 7 -1
7.85174 -1 -6 -1 3 -5 -2 4 7 -1 3 1 2 0 5 -4 -1 -6 -5 0 0 -3 -5 1 -5 -5 -4 0 -1 -6 1 -4 -5 2 -3 -2 -6 0 0 1 -1 0 -5 -2 -6 0 -1 -3 4 -1 0 -9 2 -2 0 2 -1 -2 0 0 -8 2 0 -1 -1 0 -3 1 -7 0 0 -1
7.81613 -1 1 2 -1 -5 1 0 -7 1 0 -2 -5 -6 -6 -3 2 -2 3 -2 -1 -4 -2 -6 0 -3 0 -1 -1 3 -1 0 1 -5 -6 4 -3 1 0 0 0 -5 1 -6 0 -5 0 -1 -4 -2 -1 -2 -1 -1 4 -3 -5 3 5 -2 5 7 1 3 1 -1 0 -1 -7 0 -1 6
7.78052Fj5N%M%MmlNk%UKLnNMrnNMjlkjJkMjLkoONJmk%L%lL%kTLlJ%MKmnL%jPnOj4J1kLnKkKkQ
7.74491H%nKkKm%mPnJKTmLl%M%MoKkLjLnK%oOJpNjNkJmjPTqjL%j2J0MJjkTOrjOjj0QNnOMj1J4
7.71134A9j6J1nlNJNjJnPjJ%OMpKPJnLQJ%J6j2J6kMKQJ0LPJ7KJ6MK2J6TK7L3L5N0TO3O4N8P4O9
7.68489G07N8M4N2L0K8J7qj4l9k7n7o5Tp0n9o5m3m8m4l6l7k2k7j2k0qj0Mpm%MLToJ7kJ4NJ7J2
7.66403B20K5K1L3L8N1N6O1Q8P8Q6Q1P4O3O5M5L3K6jj0l1l8n7p1p8q2q3q0p4o8n4n1n2m1k9l8
7.64622B06k6j5j8j9j1pj3oj0opJmj1NqjoKp%TqOkKp%pKUmOpnJmRpOpMj4J1kPj0PlkQolLMnNjU
7.61519A8pLKlqMTqKjJ1qMoQjpLknOpQpPNpljNLmQkqJ1j1JkKNKJj4J7qRjkpOjlJnLk%JjkJKlmQ
7.58162A0nKqNKkJ1pLqNqPLKpLMmjPljLojKMpNokOKTq%OjJj0%JPl%jlRljMpL%JjnQmjlQj%q%Ql
$$ plain form
7.78052 6 -9 -4 -4 0 0 4 0 -3 2 0 0 0 0 2 5 0 5 9 0 -5 0 4 3 0 -2 -3 -2 -4 0 -1 2 0 -6 0 5 6 2 0 0 3 3 0 3 3 1 -1 2 -1 0 0 4 6 2 -3 0 0 -1 6 1 7 -7 4 2 5 0 2 0 2 0 8
7.74491 8 8 3 5 3 5 1 1 -3 4 -1 0 2 4 0 3 0 0 4 4 8 2 4 2 5 4 7 2 4 4 -2 4 5 -2 3 2 7 5 6 2 1 8 15 7 6 9 9 -3 7 11 12 11 9 7 13 4 3 9 8 -2 6 11 6 12 16 5 19
7.71134 19 3 14 9 6 11 12 17 16 17 12 19 18 19 19 25 29 22 24 31 32 27 30 38 39 39 55 43 59 57 61 63 71 81 84 91 108 110 126 130 152 168 184 211 244 279 329 379 442 506 564 638 707
7.68489 707 765 809 861 891 919 936 928 914 875 848 791 726 661 591 532 467 424 376 332 296 259 237 210 198 178 170 160 164 157 153 153 157 160 163 157 174 172 186 191 208 220
7.66403 220 245 266 299 337 388 444 505 593 671 757 838 912 975 1040 1085 1118 1144 1143 1133 1102 1064 1007 936 858 776 693 613 539 471 417 366 314 273 244 206
7.64622 206 180 165 147 128 117 110 97 91 81 75 68 69 65 54 59 51 50 44 46 39 39 39 31 37 35 37 30 30 23 25 27 29 25 31 24 19 20 16 25 18 24 17 21 7 18 16 23 13 20 17 15 23 17 14 17 21 16 21 20 19 18
7.61519 18 11 14 16 13 5 9 13 5 7 6 17 9 13 7 15 14 7 10 8 3 9 2 10 3 10 15 8 5 4 9 12 8 16 14 6 17 6 7 5 7 12 14 15 1 18 10 19 18 16 9 15 14 11 12 7 10 8 8 9 8 6 7 9 6 2 10
7.58162 10 5 7 -1 4 6 4 15 8 11 3 8 0 7 10 12 5 8 12 8 7 14 11 10 13 7 6 8 12 5 10 4 2 8 10 12 4 4 10 9 10 0 0 1 8 5 5 4 1 10 7 6 10 3 6 6 7 6 1 9 5 4 1 9 8 8 0 0 8 5
7.54652EmKJ0j3MNmjN%klmMjLklJ0nkPpmjOoQNpMpPoKTMrPjKlp%OlLnOpPjoNjLlQj4LKJ%mNmQp
7.51192BMJmkNlJjLjOpJj%LKlLlOoMoOmKJjlQnp%jTJ1k%jOoPj1RoLmJPkOn%pNLlLoKJOmMqOlNp
7.47632IO%knJ0mjLJjLQJoRj1J5pM%PnRoQJ%QMQjJ4lJ8%K0J3J4K4K9L0L5M0M7L3TL1K1J4K4JJ0
7.44986E13pj6l7l0l3l4l8k6k4l0k1k2j2k3jj5qKmjNmJ2NLJ0J1PJ6K1J5K9L2L7M7N9O0O8P3O2
7.42951G01N9M7N2L0M0K1J1lk5k9m2Tm6l8o0n5o8n3n7m5m2l7l3k8l2j0k1rj6j2kTj3%J0j4J2m
7.41018A45J2oJ6MJ7J0J6J9K9M2L7N0M6N1L1L3J7J4J3MKjk1m8l2n4m2m4l2m6k2n0j8k9j9j2j3
7.39136A19k4j3Kj0Kpjj2No%jLj0kOmnLpJpNj1RqPn%JlOmoMpKL%Oj6RLkqLPjokOLmTRJrLlOKpN
7.35931B6ljmJ0jmJ2j0PlKpLMlQpJ5pPmL%JMTR%JLJ7lNMQRJ1UJ2J8K0L3K4L9L3M9M8M4M2K8K0
$$ plain form
7.54652 5 1 3 13 0 4 9 5 4 9 9 7 4 0 4 3 6 4 1 11 6 4 11 4 0 -1 5 -1 7 12 5 9 2 9 3 5 7 11 2 9 8 10 7 0 0 6 3 6 1 7 0 7 6 0 5 4 7 4 12 -2 1 3 4 4 0 5 1 9 2
7.51192 2 6 7 3 1 6 3 4 3 6 5 11 4 5 4 4 7 9 6 9 6 12 6 10 4 10 6 8 9 8 5 13 8 1 1 0 -1 10 8 8 7 13 7 14 3 12 6 9 5 6 13 11 17 12 12 5 10 13 10 13 7 9 10 16 12 16 8 14 11 16 9
7.47632 9 15 15 13 8 18 14 13 16 17 16 19 27 28 22 31 20 35 28 32 32 39 34 43 37 45 46 46 54 58 66 65 79 76 94 94 114 127 141 165 194 224 259 299 346 379 412 443 464 478 502 503 513
7.44986 513 506 490 453 423 390 356 318 292 268 238 217 195 183 160 159 144 136 138 134 133 138 134 146 151 154 164 175 182 198 219 234 263 295 332 379 438 498 566 639 701
7.42951 701 760 807 859 889 929 950 961 958 933 904 862 820 774 736 676 621 553 500 443 398 356 319 286 258 226 216 195 186 170 158 156 154 141 141 151 137 149 145
7.41018 145 157 151 167 171 188 198 214 233 262 304 341 391 437 488 519 552 569 583 596 600 602 601 580 532 500 446 404 360 328 282 260 210 192 163 144 132 119
7.39136 119 95 82 84 74 76 69 68 56 61 55 55 54 57 47 45 51 47 42 45 38 39 32 37 26 35 27 34 29 29 30 27 33 29 23 27 20 22 25 25 31 15 24 27 25 17 20 27 26 20 18 24 27 23 19 28 29 20 23 20 26 28 21 26
7.35931 26 23 22 18 28 27 23 35 25 32 29 31 24 27 31 28 36 29 44 37 44 40 43 43 44 48 52 61 61 62 65 82 79 84 88 96 105 116 127 138 150 168 188 221 245 284 317 366 414 458 500 528 548
7.33286E48K9J2J3TNok3k8m1m2Tl3l9k3l2l8k0k3k4qj4npTKTnJQKJ4JJ0RK3MK9K1M2L4M2N2N7
7.31098E13M5N3N0N6M6M3M6L5K2Mj2j3j2j7l3l7n8To0n9o1m5n1m0m5k1l8k2k1j6Tnj3mJj1%ljl
7.29064A39%MJ0J1RKK0K2J4L2K5L6TJ7J4J1MORmKqk7k6l0l5k7k1l6j6k4j6k9pj4j3qmomj1%mk%
7.26774E1rNnpQ%p%Jmj0KLo%TJ0rj1J4mJNj3KMpLlO%ojnNLj0RKjLkpOnJPmkKJK%mjLjklMTj0kO
7.23519A2lNp%NlJpJ3j1QoMj0J1jklLo%RLj2J0nmLnR%kKLqJNklKTj%pNKoMjLpMKUplRj5O%jLkl
7.20212@KMjJjKmTNJKlKpRjl%kNmQoLmKnjRpQnJ%JoNqLjJ0qLKjUkJLjJkmQnLnNjlLJKlMqNkKj0
7.16600dJ7r%Lk%qP%TjLjPj1NJm%lPoJQmjOqlJRrMjTkL%kTKjKJMpNoMmLlOqNTnlNnLKMj0LMlMq
7.13090aOqJ1rJTOMj1%MLjnJnNlLkL%jKlkLPj1JOknkJjQk%nQqPoN%KpNmjKoOJTk%j2J5mMlJ%KJT
$$ plain form
7.33286 548 577 589 602 615 620 614 591 563 522 480 438 405 366 343 311 273 253 230 206 198 184 179 172 165 167 169 164 165 173 175 189 190 200 209 232 236 265 286 328 362 404 456 513
7.31098 513 558 611 661 717 763 806 852 887 909 913 901 888 876 859 826 789 731 673 613 554 493 448 397 357 312 291 253 231 210 194 178 173 160 156 157 146 146 143 142 139
7.29064 139 139 143 153 164 173 175 195 217 231 263 288 324 360 377 391 402 406 412 421 417 419 411 384 358 328 293 266 245 209 193 169 153 124 117 103 90 82 78 72 68 57 57 53 51 51
7.26774 51 42 47 42 35 43 43 36 36 37 33 23 25 28 22 22 22 32 23 12 26 22 23 28 15 17 21 14 17 14 20 20 14 13 8 13 16 6 15 17 16 19 17 10 16 11 12 19 15 13 15 16 18 18 14 13 16 15 13 10 14 18 8 6 12
7.23519 12 9 14 7 7 12 9 10 3 16 5 13 7 11 1 12 11 9 6 9 3 3 12 15 3 13 8 4 7 2 11 11 9 11 14 6 7 12 10 7 9 11 10 10 3 8 10 4 8 7 10 3 7 9 11 13 6 3 12 -3 3 3 2 5 3 0
7.20212 0 2 6 5 6 5 7 3 -1 4 5 7 4 6 -1 8 7 4 4 2 7 3 11 5 8 4 6 1 0 9 2 10 5 6 6 7 1 6 -2 1 0 10 2 5 7 6 5 4 2 3 6 5 6 4 0 8 3 6 1 6 5 2 5 6 8 5 9 1 6 4 6 -4
7.16600 -4 13 4 4 7 5 5 -3 4 4 4 3 6 5 12 1 6 7 3 3 0 7 1 2 10 6 5 11 3 0 1 10 1 5 4 3 1 4 4 2 0 2 1 3 4 8 1 6 0 4 0 3 0 6 -2 3 8 3 0 5 0 3 5 9 -1 2 6 3 7 -1
7.13090 -1 5 -3 8 -1 0 1 7 11 0 0 4 7 6 1 2 -3 2 -1 2 0 3 3 2 4 1 -1 2 9 -2 -1 5 3 -2 -4 -3 -4 4 2 2 -3 5 -3 4 -2 3 3 5 -2 3 -1 -2 0 -6 0 1 2 0 0 -12 3 -1 3 0 1 1 3 4 5
7.09631Ej0RjJkT%kNnKlJKTpPnOLr%jJ9j5JjoO%NpM%k%LnNJmJ%KJmJjmJMLJoJ0rMjmN%pQo%J%k
7.06171bJKTLj0QlKJm%JLoK%JOmLn%jQokKLm%knQjkNljJLlMoQpO%ljKnMNrOmKkMpPkoL%K%Jl%K
7.02560Bj2J6mkJMqRpJkJ1j1PLj4PjJLMqKk%NJnjJKj%LpjoPmKML%ljJkNmLTqJmPjNnkTPnQoQoL
6.99151EkmjJTlLkKl%OkKJkl%nNKTnjJjpJ2qOm%NklJ0mjl%JT%NJlpMmLJj%TkLjJnJQmjnRknNMr
6.95590d%JM%JqKJQj2OMloNJTl%KmKkpMOLJmkPplLKNmJmlJKOmJTpQmj%LKmNljNjlJmjOnKJKkJn
6.91978dlOMjkJoMNmJNmTJnJ1j%mKk%j1J1lLnRr%MkKoRj%mMNj0NmJK%Uj%LmoNLjJkOjkTOjqMmL
6.88468akJTjLnOJmQp%TKpQlnJMkjJpkJ9j1NkJKkjmJ3j7J1j1J0j3RLjLj3J4rMJKn%JLjmK%MmNJ
6.85314DmLlTjOkjTKToOoMTnLjKnLkKqLMPj1JmJ1j0KMnMmJ0MpJoLkKTnLjlOklkOpOnJ1pJl%JjP
$$ plain form
7.09631 5 -5 4 3 4 2 0 0 -2 3 -2 0 -3 -2 0 2 -5 2 -3 3 6 -3 -3 -4 15 0 1 0 -6 0 0 5 -2 2 2 0 0 3 -2 3 4 0 1 1 3 4 0 1 0 -4 -3 1 4 5 -1 9 0 4 3 -1 4 4 -3 5 -1 -1 0 0 -2
7.06171 -2 -1 1 3 6 -4 4 1 3 4 0 0 1 4 -2 0 0 1 7 3 6 1 1 0 8 2 0 2 5 1 1 -1 -6 2 1 -1 4 1 0 1 4 1 5 -1 7 0 6 6 3 2 4 -1 3 8 -1 5 1 3 1 5 -2 5 3 -3 0 0 2 2 3 0 0 2
7.02560 2 -10 6 2 0 1 5 -3 6 -1 0 -2 9 -2 5 8 -6 1 0 1 4 8 0 2 0 0 5 6 1 0 1 3 2 2 5 -2 -3 -9 -2 -6 -4 0 3 3 0 -1 0 -2 3 -1 2 5 -3 -2 -6 1 0 5 0 -2 -4 3 -2 6 0 8 2 5
6.99151 5 3 -1 -2 -1 0 -3 0 -2 0 -3 -3 3 1 3 4 2 -1 -1 -6 -1 1 3 -2 -3 -2 -3 -10 2 -6 0 -4 -4 1 -1 -4 6 2 1 -2 -2 -1 0 0 5 6 3 -4 0 -4 -1 0 -1 -1 -1 -3 0 -1 0 -5 -4 4 0 -1 -6 3 1 -4 1 5 -4
6.95590 -4 -4 -3 1 1 2 -6 -4 -3 5 -7 -1 3 0 -6 -1 0 1 -2 -2 0 -4 -2 -4 -11 -7 -1 2 3 -1 -3 4 -3 -6 -3 -1 4 0 1 -3 -6 -5 -3 3 -1 0 1 -6 2 -2 -3 -3 0 2 -2 3 0 -1 4 3 0 1 -3 -4 2 -3 -1 0 2 0 1 -4
6.91978 -4 -7 -1 3 2 0 1 -5 -1 4 0 1 6 2 -2 -1 -6 5 4 4 0 2 0 0 -11 0 -3 0 -5 4 -5 -5 -1 -3 -1 -7 2 1 1 -3 1 6 -4 1 -3 -2 0 0 0 0 -1 -1 2 -2 -8 -3 0 -1 0 -2 4 3 1 -1 5 4 -4 0 -4 -1
6.88468 -1 -3 -2 -1 -2 1 -4 2 3 -1 7 0 0 0 2 -5 3 0 -5 -4 0 -2 -3 -2 -9 -11 8 -3 2 0 1 3 1 0 -4 9 -8 3 -8 2 -11 -2 1 0 3 -10 4 -5 -1 0 2 -3 -3 -2 1 0 -4 -2 -2 2 -2 3 4
6.85314 4 0 3 0 -3 -4 2 0 -1 -2 0 2 -4 2 -4 0 4 -1 2 1 3 -2 1 -1 1 -7 -4 0 7 -4 -3 -7 4 -6 -4 0 -5 -1 -5 5 9 2 3 -3 0 -2 0 2 -3 0 -1 -4 2 0 -3 -5 1 -6 0 -5 6 -1 0 -3 -3 -2 -3 4
6.81906DmTJlN%OqK%MknKjLjKkJTpOmJ0rQnTK%PoNnK%TLj3J1jlNPj1KJqN%MkOnMj5J1qJ0m%jl%
6.78599eK%jJkLlMNj2J0jnK%TjLlPnjJT%TjT%ToLTKLlj0M%K%JmNmOKl%JlK%k%K%J%ToJ1oMmJKk
6.75140@jNmJk%oOoPJoK%JKj0J1jTJ%LkmjOqOkoP%mJMj0QJnRkoMJ%mOlJjJTkjKl%j%kOLomPJN
6.71681Fj4PjMnJjNnjKjlOlMj%jqRoM%JlMjTKnkMTj%TnOKo%TOnK%jNnJpQoJ2nk%TqMlOmO%jkQ
6.68171Fj0JKJoLKkLlmKM%kJ%MmJoJ3j0j%QrQ%mkKlNjJ1nTJkjLlQj1LkKTkjkNKjj0MJUnQJkmM%T
6.64711@JjpNTmJlKmjJ%jTOjLkJjoQkLmLj%VJn%kMjTLJmJ0oJqQjTJjMlMj0NkLjJlOj0J4j3NmN%
6.61201@jlNnNmjJ%JOkmpONm%K%j0RjLnKJRj4RrKJj%JjTRj3RlLmMrRoMNpKqPJkL%kKkmPpQqRj0
6.57742hQlLqQlkLj%KLljoQlMj2QTj4OJjJjJTn%JOlTNljlPm%LJLnjJTKm%QjomPjTKomP%kLjpRK
$$ plain form
6.81906 4 0 -4 -3 -6 -1 -1 5 -3 -1 -1 3 1 -4 -2 -3 0 -1 1 -1 0 1 -6 0 -4 6 -3 5 0 -5 -3 -3 4 -2 3 -2 0 0 0 3 -10 1 0 -3 2 9 -2 0 1 -7 -2 -2 2 0 6 1 5 -10 1 -7 3 -1 -1 -2 -5 -5
6.78599 -5 -3 -3 -4 -3 -5 -2 -5 -1 4 -8 2 1 -4 -2 -2 -2 -3 0 -3 4 -1 -2 -1 0 0 0 -1 -2 -2 -2 -8 -5 -2 0 3 0 -10 -6 -6 -4 -4 -3 -7 -2 -6 0 2 -1 -1 0 -3 -1 -1 -3 -3 -1 -1 0 0 0 -6 5 -1 3 -1 0 2 0
6.75140 0 -1 4 0 1 -1 -1 -7 -1 -7 0 1 -5 -3 -3 -2 0 -10 1 0 -1 0 0 3 1 -3 -4 2 -6 0 -2 -8 -1 -1 -5 -4 0 -10 -2 -1 -6 3 1 -5 -1 0 0 -4 2 -1 0 -1 0 1 -1 -2 0 -3 -3 -4 -4 -6 0 3 -3 -7 0 1 6
6.71681 6 -8 -1 -2 2 -3 -2 -3 2 -3 -4 -2 -3 -6 0 -3 1 0 0 -1 -9 0 -6 -2 -2 -1 -4 0 -1 -2 0 -5 -7 -3 1 0 0 0 -5 1 3 -3 -3 -3 3 -2 0 0 -1 4 -1 0 -7 1 -5 7 2 0 0 0 -8 -4 -7 -1 -5 1 1 0 -2 6
6.68171 6 -4 -3 -1 0 -6 -3 -1 -3 0 -3 -7 -5 -1 -1 -3 -2 -2 2 -2 -1 -7 6 -4 -5 -5 3 -6 2 2 -2 -4 -2 -5 0 -1 10 5 0 1 -1 -2 1 -2 6 -5 -2 -4 -2 0 -2 -3 -5 0 2 1 -9 -5 -4 -3 -2 -7 1 2 0 -4 0 0 0
6.64711 0 1 0 -7 -2 3 -1 0 -3 -1 -5 -6 -5 -5 -6 -7 -1 -2 1 -1 0 -1 -7 1 -1 2 -2 1 0 0 0 0 0 1 -4 -4 -6 -2 -3 -4 -1 0 -4 6 0 1 -7 1 0 -1 0 -1 3 0 4 -6 -1 -3 0 -1 0 -3 3 -7 7 -6 -1 -5 0 0
6.61201 0 -1 -4 1 -4 1 -3 -4 -3 -3 -2 4 2 -2 -9 -3 2 -2 -2 0 0 -10 -1 -2 1 -4 -2 -1 8 -6 3 -6 -4 -3 -4 -4 -3 -4 -5 4 -9 0 -3 0 -4 0 -9 0 -6 -2 3 -4 -2 -10 -3 -2 -4 -1 -1 -3 -1 -3 -7 0 -7 1 -7 2 -8
6.57742 -8 0 -3 0 -8 0 -3 -5 -2 -3 -3 -1 2 -1 -2 -8 0 -3 1 -11 -3 5 -9 -3 -2 -3 -2 -3 -2 -1 -6 -6 -5 1 -2 -5 0 -3 -4 -7 0 -4 -4 -1 0 3 -2 -3 -2 -1 1 -3 -3 5 4 -2 -6 1 0 -1 1 -5 -9 -2 -2 -4 -1 -2 -9 0 2
6.54181BpN%jMjqKMpKLMpK%OrLMToJnL%KpPoKLmRj1Rm%nMoQKqOqJ3j0Qm%jLkTJ0n%j0ONj2J1pL
6.50875cMOp%mMKjpJ0ljoLjLnRl%NmJpJKLlTKLj0J2oMqJ0kJlTkOlOlTPojM%TlPqNjNoJoRjkLjk
6.47415@qJ3pk%O%qMjLjlOlNpK%nRj0J0l%UJjJmMkl%OkTNoLmOlkJK%lJLkJLrKJkPq%PjJTnJ0pJ
6.43905AlOnOj1OkMlmPJlMmLo%jkRl%lKk%KjlNnJKlQpKT%jJpJ0kJqL%jJlmPmPjMlTjlRmN%qLJl
6.40344doJ1oKTJlLNpjOlkJjlL%k%JPlJqOmJK%jKTqPpOqJ3j0NlLKoMjTJjJkJl%OnL%jkKkmNjKj
6.36834cM%LoRqn%JM%j%JlLkLpJ3qOpLoLkK%Lo%Okjm%Pkm%MjKk%Jj%jP%knJLmTJ1oLmLJLojMpO
6.33273alj%TNnoJ1qQkKl%K%j%jLo%Nj4J1%KlLkmJ0l%TmNJmo%J0%mLmKJ%TNplOkKpMTpKMJpNpQ
6.29865@kK%NrkLNmOpNqJMlMl%TjJMqOmN%KlnLlJ0nLlJjL%nOqNmMKkjoMPqLpPJMjonPkMjRj0Kj
$$ plain form
6.54181 2 -5 0 0 -1 3 2 -6 -4 0 -7 -5 -2 2 -5 -3 -3 3 -6 -3 1 5 -1 0 -5 -2 -2 0 -7 0 -6 -4 -1 -5 4 -7 2 -2 -2 -7 -3 -9 -1 1 -7 -1 -9 4 -6 2 -2 -2 -3 0 -2 -4 6 1 1 -9 -3 2 -10 1 -6 -3
6.50875 -3 1 7 0 0 -4 0 2 1 -6 4 1 0 -6 -3 -4 -1 -6 3 0 0 5 1 2 -5 -4 -2 1 -2 -5 -3 0 -10 2 -4 0 -8 2 0 1 -2 -5 -7 -1 -4 2 -1 -4 3 -3 -4 0 0 0 -3 4 -4 1 0 5 -1 0 -6 3 2 0 3 2 0
6.47415 0 -8 5 -2 -4 -4 2 2 -6 -2 -3 0 -1 -4 2 -1 4 -3 -1 -1 -6 3 -7 3 0 0 0 0 1 0 1 -3 1 -1 -4 -4 2 0 -2 3 -3 0 -4 2 -1 -3 -2 0 0 -3 -2 1 -1 0 3 -6 -4 -3 -5 2 -6 -6 1 0 1 2 -3 7 0 1
6.43905 1 -2 4 -1 5 -6 0 -2 2 -1 -5 2 3 0 4 0 3 -3 -3 -4 -6 3 0 0 -3 -1 -3 -3 -1 -2 -5 0 -5 -4 -2 -5 3 -4 -2 0 0 -1 0 -7 3 1 2 -6 -3 -3 -4 -3 -6 -10 -3 -7 0 -1 3 0 -3 -4 -7 2 -2 3 3 -5 -2 -1 -4
6.40344 -4 -10 1 -5 -3 -1 0 -3 0 5 -2 -3 3 0 -2 -1 -2 -5 -2 -2 -4 -4 -3 4 1 2 -6 0 -4 -3 -1 -1 -2 0 2 -6 1 -6 0 -8 5 -5 0 -3 0 2 -4 0 -1 -2 -1 -2 -1 -3 -2 -5 -5 1 -4 -1 -1 -2 -4 -2 -4 -8 -3 -4 -2 -3
6.36834 -3 1 1 4 -2 7 -1 -6 -6 -5 -1 -1 -2 -2 -1 -4 -1 -3 0 -7 6 -2 4 -3 0 -6 -3 -5 -3 -3 0 -6 -6 0 -2 -3 -7 -7 0 -2 -6 -6 -2 -3 -1 -3 -3 -2 -3 -3 -4 3 3 1 -4 -3 0 -4 -8 3 -3 0 -4 -1 0 3 -3 -4 0 -7 -1
6.33273 -1 -4 -5 -5 -5 0 -5 -11 0 -8 0 -2 0 -3 -3 -1 -1 -2 -2 -3 0 -6 -6 -1 -15 -4 -4 -2 -5 -2 -4 -8 2 -1 -1 -1 -5 0 1 -3 -9 -9 1 1 -3 0 -4 -2 -1 -1 -1 4 -3 -6 0 -2 0 -7 -3 1 -6 -4 0 1 -6 -1 -8 0
6.29865 0 -2 0 0 5 -4 -6 -3 2 -2 4 -3 2 -6 -5 -1 -4 0 -3 -3 -3 -4 -3 1 -7 -1 -5 0 0 2 -1 -6 -3 -6 4 -1 2 -1 0 -1 2 2 -3 3 -5 0 -4 0 2 0 -1 -7 -3 4 -4 -1 -8 -1 0 4 3 -3 -8 -1 -3 1 0 9 -1 1 0
6.26304@LjJrj%Rj1RJpJjLM%Loj%NmKo%LTMmJpPrLJJ0qMqOkKoOlMkMnLjkT%mJ3rNjlLoPnJTjJK
6.22794@Lo%MjoMjkJMK%mLqPlJUmJkNmJLoKJKlNrRkKrNjnJ0kLnkjOnJLKj2J3kqLTKkJnOkMolNl
6.19233eQoPnjJTLrOkLrQqOmJ0oL%n%JnQqJ2pkL%jK%jNmkn%KJNlkJKlKMlnQnMjJ%TjkQj1MkQrM
6.15723anjTNk%KnJTOnLTqQmKoMmMTrOmPm%JMmlLMo%TLjM%nKkpRkjJ%j%lLTqMJNmjJrQjNl%KkL
6.12060@kJpROpmJToJ1j3J3nLJmLjlKmMKJmMjLmpNJjmOKk%k%nJ0mMjrKJlJOjlJLnPkJTkl%JTjT
6.08601c%jJjkLJrJ4kToQm%Kk%MjmKnMnLOrQlKUmnOmKnJ0jj1PKJkJljKNJmkKmNJmTLTlLqQrPjn
6.05040hQOnlLj%pPoJMLlKpOmTQlLoOqJ1ljoNJMlklMJrPNoLnPnJ%JnNmQokNj0J0%jlMKrNLoNlL
6.01530@m%TJkLMj0NjJmMLqOLjTJnNK%j1J6j2jMlQoK%J%NpKpO%nNJm%lQJTnLjOolLjOn%nNnLlK
$$ plain form
6.26304 0 3 2 3 -6 -7 -7 2 -9 0 1 -6 -5 -6 -3 1 1 4 -2 -3 -3 2 -2 0 -6 -6 -3 0 4 0 1 -6 1 -8 -5 -4 6 -2 2 -6 0 -2 0 -6 0 -3 1 -1 3 -2 1 0 -2 -4 -4 -8 5 -4 1 0 -3 0 -6 1 -4 -3 -2 -3 -2 0
6.22794 0 3 -3 -3 1 0 -6 -2 -3 -5 -4 0 2 2 -2 1 -7 0 -3 -2 -1 0 -4 -3 -5 0 -4 -3 0 -6 -4 -3 -1 -4 1 -8 1 -1 1 -8 -3 -4 -9 1 -1 2 -3 -5 -6 0 -5 -4 -1 1 -11 2 0 -8 -5 -2 0 -2 -1 -6 0 -2 2 -4 -7 -2 -5
6.19233 -5 3 -3 4 -1 -2 -1 0 3 -6 0 -2 1 -8 0 -8 -2 -6 4 -2 1 1 -4 -4 -3 -8 0 -8 4 -3 -5 -2 -2 -3 -1 -1 -2 3 -1 -3 -8 -8 -6 -5 0 -3 -5 -4 -2 -5 -3 1 -2 -7 1 -4 0 -1 0 0 0 -1 -3 5 -6 -2 -4 4 -5 -1
6.15723 -1 -6 -7 -8 -3 -5 -5 -3 -8 -7 -6 0 -5 -2 1 -7 1 -3 -1 -7 -3 -7 -3 1 -8 -2 -6 1 -3 -3 -2 2 -2 -5 -2 2 -4 -4 -4 -1 -2 2 2 -3 -1 -3 -10 -1 -3 -4 -3 -3 -4 -4 -7 -4 -1 -9 -5 -4 1 -3 -4 -3 -12 -4 -5 0 -3 -3 -1 -3 0
6.12060 0 -2 -1 -8 1 7 0 -4 -3 -2 -8 3 -10 3 -2 1 2 -2 1 0 -3 -1 -5 -1 1 2 -2 2 1 4 0 -7 -2 -1 -2 -6 0 2 0 0 -2 -2 -7 3 -1 3 2 -7 -5 -4 -7 -6 0 -1 -4 -3 0 -5 2 0 1 2 0 -3 -3 -2 -1 -2 -3
6.08601 -3 -3 -4 -3 -4 -6 -3 -2 -11 3 1 -1 -7 1 -3 -3 -1 -3 -3 1 0 -4 -2 -7 -3 -8 -5 1 -8 0 -3 -1 1 3 -1 -6 0 -4 -2 -7 3 2 -9 -2 0 1 -1 0 -3 -4 -2 3 4 0 -2 0 -4 1 2 -2 -6 -3 0 -3 0 -8 0 -9 -2 -3 -8
6.05040 -8 0 6 1 -2 1 0 0 -7 0 -6 -5 -1 2 -1 1 -6 0 -4 -8 0 -3 0 -6 0 -8 3 0 -1 -7 -2 -1 3 0 -2 -5 -1 0 -9 -2 3 -3 0 -5 2 -3 -2 -2 -1 -6 -1 -5 3 -3 -5 0 -10 0 0 -1 -4 0 2 -7 -2 1 -5 0 -3 0
6.01530 0 -4 -4 -4 -3 -5 -2 2 -8 -3 -4 -3 -7 -3 0 -8 -2 1 0 -1 0 -5 0 2 2 -9 7 -5 -6 -2 -5 3 -3 -1 -1 0 0 5 -2 0 -7 -1 -1 -6 -1 0 -4 -4 -7 1 2 3 -2 1 0 6 0 -3 0 -1 5 0 0 -5 0 -5 -2 -5 -3
5.98070ckNjNj2QqNLkjJTkTMJjlLnJ0j0NljNjPj6OkPjkKmL%TKlKTnkOnNqRkTJ1j3PljKnLmJM%L
5.94713CkKlkKJkLj1QJ%kMpMoQlOljpOK%jJqOJjJTjmLTlJmPj3J4lnMJKJn%TjTOnK%jJkLl%lK%L
5.91203@l%K%mLkKTjlKLKkjlMKj3MKTnKMpRlk%LlJjnJ0kjJjKkQpJKmpPlkNjL%TJmkNjk%kPlKoK
5.87642cLlJKnOlOonOjpNMKjqQnN%j1RlMoMj0J2mJkJOmK%MJqJpPjNmjTkjOoPloLNJpJ0nMlknJ1
5.84233Cj0PjNnmJKk%OojOrRpQnJ1j3PjkmkO%lJ2j2kKJLjoM%mNQol%LnLmMjJTjpNkLkKLNpJKrL
5.80825eKmJTLTmKJ%jTpLJNkJLmjJj%TNnMlNlMj1PlkQm%kL%VnOlTMPj5QoPjKJTpKTlNrKNKjljL
5.77162@oQrMjNkNplMKJlkMlLlnKNpJ1j0N%jnNJLqO%Kj%TmK%lNjTKnNnOj0J0lKkLjMlKljKljlL
5.73703cKoOJ%qOKj%qNM%nMlLoPjMnkJlOnLOqmJ2lrJ2jLpPpl%MKqJ2j0jKOmTKL%KlKrOK%lLJqP
$$ plain form
5.98070 -3 -5 0 -1 4 -8 0 -8 -3 0 -2 -3 -2 -1 -3 -5 -1 0 -1 -4 -1 -6 4 -6 -1 -4 -5 0 -1 6 -10 -4 -6 1 0 -2 0 -4 -1 -1 -1 1 -2 0 2 -3 -5 1 -4 1 -7 2 0 -2 9 -4 3 0 -1 1 -4 -1 -5 -4 0 0 3
5.94713 3 1 3 0 -2 0 1 -1 2 -9 -1 0 0 -2 2 -5 -1 -7 1 -2 4 1 0 -7 -1 1 1 0 1 -7 -1 0 -1 0 1 0 -4 -1 2 -1 0 -4 3 -10 4 1 -4 0 1 3 4 -1 -1 -1 -2 -3 3 -2 0 0 -1 0 -2 1 -2 -2 -5 -3 -3 0
5.91203 0 -3 -3 -1 -1 -5 -2 -4 -2 0 -1 -4 -2 1 3 1 0 -3 1 3 -10 -6 -4 -2 -7 -5 -1 -8 1 -2 -4 -4 -1 -4 -3 -4 -9 1 -1 -2 -1 -2 0 -2 6 -1 0 2 -2 -9 -2 -5 -7 -2 -3 0 0 0 1 -3 -5 0 -1 -3 -3 -5 2 -1 1 -5 -3
5.87642 -3 0 -3 -2 0 -5 1 -2 4 -2 -7 -1 -2 -9 -4 0 2 1 -7 1 -4 1 1 -10 -1 -4 0 -6 -2 -12 0 -4 -3 -5 -4 2 -2 0 0 4 5 -3 -2 -9 -2 -3 2 -2 -3 -4 -6 -7 -1 -7 0 -3 -9 -6 -1 0 -7 3 -2 2 -1 -3 -8 3
5.84233 3 -7 0 -1 4 -1 -5 -4 -2 -4 -4 2 -4 -5 1 -8 1 -6 2 -3 8 -5 2 1 -1 -5 -7 -1 -1 -4 8 -4 -6 -4 -3 0 -1 -7 -3 -3 -7 -2 6 0 -3 -3 0 -5 -2 -6 -2 -3 -2 -1 -2 -9 -4 -6 -3 -5 -3 0 5 -2 -1 1 -8 -5
5.80825 -5 -3 -7 -6 -5 -2 1 -3 -1 0 0 -1 -2 -9 -6 -5 0 -2 -1 2 -2 -3 -2 -3 -3 -3 2 -3 1 -2 3 0 4 -7 0 -3 -5 3 -1 -1 -3 0 0 0 0 0 -5 1 -2 -5 -1 6 -9 -1 -7 0 -1 1 2 3 -4 -2 0 -3 2 -7 -5 0 2 1 -2 -3 0
5.77162 0 -6 2 -7 -3 -4 1 -1 4 -3 -6 -2 0 1 -2 -4 0 -3 0 -3 -8 -6 -1 -8 3 -7 -2 -2 -3 -8 -3 -2 1 -7 -1 -1 1 0 0 0 -4 -2 -2 -5 0 -1 -2 0 -5 0 -5 1 -9 1 -2 0 -2 1 0 4 1 3 0 -1 1 -2 -3 -6 -3
5.73703 -3 -1 -7 -1 0 0 -8 -2 0 -1 -1 -9 -4 0 0 -5 -1 -4 -1 -7 0 -1 3 -2 -4 -3 -6 0 -5 -2 4 -4 -8 4 1 -8 4 3 6 -1 6 -1 -4 -4 0 2 -6 6 -4 -5 -3 3 -1 -5 -3 0 0 2 -1 1 -8 -2 0 0 -3 0 1 -7 0
5.70244@%kKmKmMJ%JKnJKk%UKmnRlLnKjTOklKlTJ6j5OlMJoM%lPLpKlTJULlrN%O%JlKnKLJrJ2ol
5.66632enJ2nLj1ON%kJkL%jmNMp%J%KoMNnKoRj3J1nMkTmPpQpJNJkoNLkpMNmQnkpJ0%TnMpQ%TjK
5.63224Aj%LnjoRkK%kMom%MrJ1kLjLj%TnRpjNnLJkMkjJkJjJTlPnJkjTJMj1PK%UNj1OoPmMoO%l%
5.59663cJK%Mo%jJjTnR%NqLKPj1Lj0R%Tn%LkKOrKLmPmJkJ%mj%KL%m%J1omOklKLlkKTkjTMmj%Jk
5.56152e%MKmJKlJjJMpNj2J2lPrNjUMKrjTkLJMlNnMLl%pNJKqJ0oNnOolJ1mnNlkKTJlLlPmTKJTj
5.52642akMqRkTjNKmnMjJnRqJ1j0NmJjMqPnQnKk%TMj4PMnJ1j2NnQrR%nlJTLJKoKMjJmk%KLJnTM
5.49234emQJMj0J2pKj0O%KJj%jKjTlKLnKLrJ0MpLkMj1J1mMoJjL%nkPKmPj1OmOrM%TNrQnOlk%Tl
5.45927fMlLKjj0J0lTP%mLlKJ%JmLkTPmlNjJkNnLpNjO%j0J3qJTklPp%LJkpP%kJTKkMlkmQ%qRko
$$ plain form
5.70244 0 0 -2 0 -4 -2 -6 -2 -1 -1 0 2 -3 -2 0 -2 -2 -2 -2 0 -4 -9 0 -3 0 -5 -3 -4 -5 1 -1 -4 -2 -5 -8 8 -7 -1 -4 0 1 -5 -1 -1 -4 3 6 -1 1 -2 -5 -4 -3 -2 1 -2 -11 -6 -6 0 0 1 -2 0 -5 -3 0 1 -8 4 -2 -5
5.66632 -5 -10 2 -3 0 -11 -5 0 0 -2 -1 -3 0 0 -1 -5 0 4 -3 -3 -2 -2 0 -6 -2 3 -2 0 -6 3 -10 1 -4 0 -2 -4 -8 -1 -8 0 -7 -6 -1 0 -2 -8 -3 0 -2 -9 -5 0 -4 4 -1 -3 -10 0 0 0 -5 -1 -8 0 0 0 -1 1
5.63224 1 0 0 3 -2 -3 -9 0 -2 0 0 -2 2 -4 -8 -8 -4 -13 -2 -4 -1 -2 1 0 0 0 -5 4 -3 -4 1 -4 -1 0 -2 2 0 -1 0 -2 -1 -2 -1 0 -3 4 -1 0 -2 -3 -4 -3 1 -10 -3 -1 -1 -1 -1 4 -7 -1 -7 0 -4 0 -6 0 0 -3 -3
5.59663 -3 -2 0 0 4 -2 -2 -3 -2 -3 -4 -9 0 0 5 -3 0 2 9 -2 1 -9 0 0 0 -5 -5 -2 -4 -2 4 -5 -3 0 -4 3 -1 0 -2 -1 -1 -5 -6 -6 -4 -1 -1 -5 -5 6 0 -4 2 0 -3 -1 2 -1 -3 -1 1 -1 -2 -3 1 -3 -4 -4 -3 -5
5.56152 -5 -5 -1 1 -3 -2 0 -3 -2 -3 -2 2 -5 0 -12 0 -3 4 -5 0 -1 -2 -3 1 3 -6 -7 -8 -10 -7 -6 -2 -5 0 -5 -1 2 -1 -1 -8 -3 -2 0 -8 2 -4 1 -4 2 -4 -7 4 0 -5 0 -3 -5 -3 -1 0 -3 0 -3 4 0 -4 -2 -1 0 -1
5.52642 -1 -3 1 -7 2 0 -2 -3 2 4 0 -5 -1 -2 -1 -6 3 -5 6 -4 1 -3 -2 -3 1 -7 0 -5 3 -2 0 -2 -2 -2 2 -12 -5 -1 -6 5 -7 -2 -7 1 -8 1 1 -4 -7 -6 -5 -2 -1 1 -5 -3 1 0 1 -3 -5 -5 -3 0 1 -4 -9 -5
5.49234 -5 -9 -1 0 4 -6 6 -1 1 -9 -3 -3 -1 0 -1 -1 -2 0 -1 -2 -5 -3 0 -5 -3 0 -9 1 5 -2 1 -1 3 -8 3 -1 3 -3 -2 -3 0 0 -5 -7 0 2 -2 5 -6 0 -4 2 -7 -3 -3 -3 2 -7 1 -4 2 -1 -3 -3 -3 -6
5.45927 -6 -2 -5 -2 0 -1 -11 -1 -4 -7 0 0 -4 -1 -4 -2 -1 -1 0 -4 -1 -3 -5 2 -2 -5 0 -1 0 -2 3 -2 1 -6 -1 -2 4 4 -6 7 -1 0 1 -1 -4 3 -4 -4 -1 0 -2 -9 -2 -2 -4 -3 -2 0 -2 2 -1 -3 -7 1 1 -7 2 0 -6
5.42468fO%koQJknOnNlkRoKo%LlKJLoJ0nMlUNj%jLnNmKJLlnPljKkN%lJk%JnMkLJ%l%nLPlnlPLm
5.38805cRrLqMKTlLjK%qRk%KkJLpJlJkOjKjlnOmNJTjmNoLmJTPmlMLojJ%Lm%jMl%LmJLkJTLnLkJ
5.35143aljkOLmJTnkONrJ1j1%MJmOqNmPpNlKLklLjTKMnjKmjnJ3mNmMjnKTnjMmQqJQnljmQ%pMLm
5.31633dLkJnjJ3j1OoMkLJKlJlJTkjOmJ%qKNJ%LKoJKqNJKkJKknOjTL%lJkJOmkTLJljTPmjKJ%lM
5.28072Bnj%jQmJoKUnOklOlj%pRj0J3njKJoKlR%pLKjoNKMj1nJ2nQnKkKk%TLnmTJ0OoPn%pPl%Pk
5.24612Bj0MK%KjNo%lLk%LmMoOlMLj1OoQKTmoJrJ9j3OkJLnKNlJ%j2J6%knL%pJ0pJjKTkKjnNmMJ
5.21306@%jqjPLJmj%OoJlMkM%lLoKlNjJmlRoOk%TjN%nTQJk%jNmlLKlj%LkKjNpK%JTnkPmjMnMJk
5.17643bKoMjJTrJ3pLjMj0J0j1MQj1OJmN%TLkl%j%LlkJ1j4RmkLNlOj2OnMjmLTmkJ0j2%J0knOkj
$$ plain form
5.42468 -6 0 0 -2 -8 0 1 -1 -6 0 -5 0 -3 -5 4 -2 0 -6 -6 -3 -6 -4 -3 0 -6 4 -1 3 0 -3 -6 -1 -2 -2 -3 0 -5 0 -4 -2 -1 2 -1 -6 1 -2 -3 -1 -3 2 2 -1 0 -2 -2 -1 -6 -2 -4 -1 0 0 -3 -3 -8 -5 2 -1 -6 -9 -2 1 -3
5.38805 -3 6 -3 0 -8 -4 -2 0 -3 0 -1 1 1 -7 2 0 0 2 0 1 4 -3 -2 -5 -4 -6 0 -1 1 0 -3 -8 -2 -6 -1 0 1 0 -4 1 -5 -2 -6 -5 -4 3 -1 -4 0 3 -3 -4 -3 -3 0 -4 -4 -5 -1 -4 -4 -1 -5 -4 -1 -3 -2 -1 2 -3 0 -2 -1
5.35143 -1 -4 -5 -7 -1 2 -2 -1 0 -5 -7 -1 4 -5 6 -5 -5 -1 0 -4 2 -6 -1 -5 2 -5 0 -3 -1 2 0 -3 0 -1 -2 0 4 -1 -2 0 -4 -5 -10 3 -1 4 0 4 3 -2 0 2 -3 -4 0 -4 4 -4 -3 5 0 -3 -4 -8 0 0 -7 -3 0 -4
5.31633 -4 -1 -3 -2 -7 -8 5 -6 0 -6 -2 -4 -1 0 2 -1 0 -3 -2 -1 -3 -4 2 -2 -1 -1 -9 -7 -2 -1 -1 2 4 -2 -1 1 -7 -2 -1 1 -1 0 2 0 -5 1 0 -1 2 2 -1 0 -2 -1 5 1 -1 -3 0 1 -2 -3 -4 3 -1 -2 0 1 1 -2 2
5.28072 2 -3 -4 -4 -5 3 -1 0 -6 -4 -2 0 -5 1 -1 -4 2 -1 -2 -2 -9 0 -10 3 -2 -3 -1 0 -6 -4 -7 2 2 -5 -2 0 -1 -7 -2 0 4 -7 -12 0 -5 3 -2 0 -2 0 -2 -2 -2 1 -4 -8 -12 -2 4 -2 5 0 0 -7 0 -3 -3 4 2
5.24612 2 -8 -4 -2 -2 0 -1 4 -2 -2 -5 -2 -4 -4 -1 -5 -1 -7 -1 -4 0 3 -8 -2 -8 0 2 4 0 -6 -5 -14 5 -8 -2 -4 -3 0 -5 -3 2 -1 0 0 -12 4 4 2 -3 0 0 -7 3 -4 -3 -4 -2 0 -2 0 -1 -6 -1 -5 -1 0
5.21306 0 0 -1 -9 -10 -3 0 1 -3 -4 -4 2 -4 -3 -6 -2 -4 0 0 -3 0 -6 -4 -7 -2 -3 -2 -6 -9 0 -6 0 -2 -2 -2 -3 2 2 -3 -8 0 1 -1 -1 -2 3 -1 -4 -1 1 -2 -3 -3 0 -2 0 -1 4 -3 -1 -1 0 1 -4 -6 1 -3 -4 0 -5 -1 0 -2
5.17643 -2 0 -6 -2 -3 -2 -1 -10 3 -4 -1 -2 2 -8 2 -9 -5 3 -8 -2 -1 -5 0 0 0 3 1 -2 -2 -3 -3 0 -3 -5 6 -8 1 -3 -5 -2 3 0 6 -6 0 -5 -1 -2 -6 -3 0 -4 -6 4 -8 -8 2 0 -5 1 -1 -2
5.14540bKNr%JlOJljLkRj7J0%lPqL%lJMJjTknPlTPnOpNj0J1pJ1j7J5j2QNljnLkTNJklPmJoPlOo
5.11284cOlKk%VjmJJ0ol%J%kMnJ0j0PkNpkNmNJj2J1j0PnOjPoPj1Mn%MJ%VkKl%LjTJT%mNrQjKoK
5.07774cJKTnjLNqMlJj0PM%TlPj2PJToPknOlLToj%LjJnQrQjJlKMj1J2j0NoMjNnK%oPqKO%mQoKj
5.04366anNL%kMj1J0qMKMj3NLjTkJmKjTKJ%JkKjLNpjM%TPj3JTMoKkPpjKLMlLoOnKmN%UlLqMOkj
5.00855a%lMmLJ%lL%ToLTKomOkTMkTOnKTNmJkJmMnJ1mrJ2j0MJTj4J1jLkK%JNrLkOqNkOlk%LoMr
4.97447hLJTMJj%PqmKjk%Oj1J4j5J3pLmL%LnQmMklT%OnM%TjklOkLjTnkQjJqRlK%lL%UlLpJ3j4R
4.94039ApMTnmPLqNjnjTJ0mKqQ%UmKToPjpJ%jOJ%jmNJjkmK%MJmLKj1MNnlPkjoJ4qJ1pjnNpPJkJ
4.90529anPnRnj%NrJLJpJ1pLlLKTpNkJnkLKnPoMkKoPqMkOmMpQlKkjkOkoKMmOnQj1P%JKrKjQrOp
$$ plain form
5.14540 -2 0 5 -4 -4 -3 -6 0 1 -2 -3 0 -2 7 -10 0 0 -3 4 -4 -1 -1 -4 -3 1 2 1 0 -2 -7 0 -3 -6 1 -4 2 -5 0 -10 1 -6 5 -12 3 -9 -1 4 1 0 -5 -2 -4 -6 -1 0 -2 -5 2 -2 -1 -7 0 -3 3 -3
5.11284 -3 3 0 2 0 0 0 0 0 -1 -5 -4 6 0 -3 -3 -2 -2 -4 0 -5 5 -5 2 0 5 -2 -4 1 -3 2 3 -9 2 -8 -1 -6 0 -1 6 0 7 -4 0 -5 -5 -1 0 0 0 0 0 -2 0 -3 -3 0 -1 -2 -1 0 0 -4 1 -8 0 -1 1 -5 -3
5.07774 -3 -2 0 2 -3 -4 -1 4 -4 0 -3 -2 -12 -5 -1 -1 -1 -4 3 -9 -2 -1 0 -6 1 -1 -6 0 -3 0 3 -3 -4 -4 -1 -2 -1 -6 2 -7 1 0 1 -2 0 4 -7 5 -5 0 -6 -2 -3 2 -3 -1 -1 -7 0 -8 -6 0 0 -4 4 -2 0 -1
5.04366 -1 -6 -1 2 2 0 4 -7 3 -5 -1 1 5 -8 -3 0 -1 -2 -4 -3 -7 -5 -6 -7 -5 -4 -4 -3 -5 -3 -4 -1 4 -3 -4 0 0 0 7 -6 -5 -4 0 -6 -4 -6 1 -6 -7 -5 -2 2 -1 2 -4 2 -3 -1 -5 0 0 0 0 -3 0 -8 -4 2 0 -1
5.00855 -1 -1 -4 0 -4 -1 0 0 -3 0 0 0 -6 -3 0 2 -4 -8 -2 -4 -6 -2 -4 -6 0 -5 -3 -1 4 0 1 -1 0 -4 0 -5 6 2 -7 5 -5 -1 0 1 -13 -2 -3 0 -2 0 0 1 6 -3 0 -2 4 -4 1 -1 5 2 0 0 3 -3 1 -8
4.97447 -8 -5 -4 -3 1 2 1 1 8 0 -4 -2 -3 -5 -5 1 -10 4 -11 2 -5 -2 -6 -3 -3 0 -5 3 -1 3 1 -2 -5 -5 1 -4 0 0 0 -1 -3 -6 0 -2 1 0 -1 -6 -8 0 -1 0 -8 1 -2 0 0 -3 0 0 0 0 -3 0 -7 6 -8 1
4.94039 1 -6 -2 2 -3 -7 0 3 -5 0 -1 -6 -7 -8 2 -2 0 -8 0 0 0 0 -4 -2 0 -6 1 0 -7 -6 -6 -7 -1 0 0 -1 -5 0 1 0 -2 -6 -4 -4 0 1 -3 0 2 -9 -5 0 -5 -8 -1 -3 -4 -10 4 -4 7 0 -1 -6 -1 -8 -1 0 -2 -1
4.90529 -1 -6 1 -4 5 0 -1 -1 4 -5 -4 -1 0 -7 4 -3 0 -3 0 2 4 -3 2 0 1 -4 -6 -3 -1 -6 1 -5 -1 -3 -1 -7 0 -8 -4 -6 0 -4 0 -7 1 -2 0 -2 -3 -5 1 -1 -7 -5 -1 -5 1 -4 4 -7 0 0 1 3 -6 -4 -5 3 -6 0 -7
4.86968gJOpkPjOqjTOjlJKTmL%kNlKnJlOj0jPJjJLpJ1j0MOnmM%LqK%QoKoNJ%JlkLpPJ%rOLlKmK
4.83458cjLkPkpOl%TnLKjmjRljJjLqOoN%PmKqPrOPj1QrPoNJoKM%mMnNlOnJjkTNmQoMkj%mQKnJl
4.79846cPnm%lPnOmMjJqNTqOmKT%lkNjmN%pKNlL%nNmJKJkmQrNjMqJ1j0OnKlNjUMjJ%LlmLkTLmK
4.76234dLpPjkTQrOTj2J0pJMrK%OJjnKLKl%jlNj%Lj0OnJ0ml%L%jTK%JKpkPkM%mKpM%Op%M%lLlK
4.72775aj%JpQKlMnKjJ%nJU%NlkKj0J2kjknJ2j0O%mNkjPokJ%KqJ2j3J3qPj1J1lLoLmKJ%lMlLkN
4.69519CnmjPlNkTKoMmJTpPKJ%KlLKnjQrOmNoJKpjKNLmlMnOoOmMmkLTNj4J1mKNqNmK%kK%JnLkl
4.65958fOMpL%j0J0m%NjkoJ1pOkjmO%oRnOn%TJj%pNlPpJMqJ5j2Pj0Ro%jKM%mM%jTqJ0nKQnLlPr
4.62651bkJTMqRnKnkKLlJ1lpj%KnMjKTk%JmkOkOmLJMrJKpPLmKj%TKJq%MPj0OmKrOLTpJ%LMomQ
$$ plain form
4.86968 -7 -6 0 -7 -9 -2 -3 3 -5 -6 -7 -1 -2 -5 -4 -2 0 -4 -1 -1 -3 2 -1 1 -4 -3 -6 0 -10 -11 -4 -3 -4 -3 0 -7 4 -6 -2 4 -1 -5 -1 -1 2 -6 -4 -4 4 -2 0 -6 -1 0 0 1 -2 -4 -1 -8 -1 0 0 -9 -3 0 -3 -1 -5 -3
4.83458 -3 -4 -1 -3 4 2 -5 1 -2 -2 -2 -7 -4 -2 -3 -7 -8 1 -2 -3 -2 -3 0 -8 -2 -8 -3 -3 4 0 2 -6 1 -8 -2 5 -6 2 -7 0 -6 -1 0 -6 -4 0 0 -4 0 -5 0 -3 3 -2 -1 -2 -4 -6 -1 -5 3 -3 1 -1 -2 -2 -6 2 4 -1 0 -3
4.79846 -3 4 -1 -5 -5 -8 -1 -6 0 -4 0 -1 0 -8 -3 2 -6 0 -4 -2 0 0 -3 -5 0 -1 -5 0 0 -7 -5 0 -3 0 0 -5 0 -4 -3 -1 0 -2 -6 2 -7 -2 -3 1 -7 4 -6 0 -5 -3 -6 -1 -2 -3 -4 0 -1 0 0 3 0 -4 -1 -3 -5 -2 -6 -4
4.76234 -4 -1 -8 -1 -2 -4 -6 2 -7 -1 5 -7 3 -4 -3 1 -8 -6 -6 0 1 0 -5 -3 0 2 -1 -1 -2 -5 0 -1 -1 2 -8 -2 -7 3 -1 -4 -4 -1 -1 -2 -3 -1 -1 0 2 -5 -7 0 -2 2 2 -2 0 -7 -3 -3 3 -4 -4 0 0 -3 0 -3 -1
4.72775 -1 -2 -2 -1 -8 0 2 -1 3 -2 0 -1 0 0 -5 -4 -3 -2 -2 3 0 -2 0 -10 2 0 -1 -3 -8 4 -6 0 0 -4 1 -1 -2 5 -1 -3 -2 -2 0 -8 4 -9 4 -4 3 -8 3 0 3 -3 0 -4 -2 -1 -1 -4 0 -3 0 -2 3
4.69519 3 -2 -6 -7 0 -3 2 0 -2 0 -6 -2 -6 -5 -4 -11 -4 -2 -1 -1 1 -2 1 3 -2 -3 5 -4 2 -2 3 -3 -2 0 -7 -8 -6 -1 2 -2 -5 -1 -6 0 -6 0 -4 0 -4 -6 -3 0 5 -9 2 -2 0 5 -3 2 -2 0 0 -2 0 0 1 -4 -1 -3 -6
4.65958 -6 0 4 -3 0 0 -10 0 -4 -4 1 0 -2 -8 3 -4 2 0 -1 -5 1 1 -5 4 -1 5 0 0 0 1 0 0 -7 -2 -5 2 -5 -4 0 -8 7 -5 2 -8 1 -5 -5 -6 -4 0 0 -4 0 0 -1 -2 -10 0 -5 -3 5 0 3 0 7 -2
4.62651 -2 -4 -3 -2 2 -6 3 -2 0 -5 -7 -5 -2 -5 6 3 -4 -5 -5 -3 -8 -4 -5 -3 -1 -3 -3 -2 -6 -8 -2 -4 2 -2 1 2 6 -3 -2 0 -7 0 3 -1 1 0 0 0 2 3 -5 -5 -1 6 -4 2 -2 0 -9 -3 0 3 -4 -3 -3 0 4 -2 -6 2
4.59141Bj0PkMrO%j%KklOJTmLjnNjJ%TnOkmJkOjOn%MmMqLlNkJ%PqNp%TJnPnNkLmjKTnNKmK%TmN
4.55529ApPpKmJ0j1RKrQj%klPjqRoJ%kOoNkqJ0%Tm%MTj2QoJ0m%qJ2j2OLmMj2Q%mNlj3J1J8j3Mj
4.52477AMmKrOqP%JmNpOkK%klMJlKTJlKqQoNpLJTKqJ2nJml%Pj%kJKnJ0j1J1j0Nj0J0%nTQrJ1%L
4.49221Cj0JLPmqJ1njLjoOljN%JKnKLlj1%PJjMpJ5j1Ll%jnJ0mKmlQlNqOqKRoMj0RnJkQ%mKqJ1p
4.45965d%pJ1mjNnk%OMj0MLpJ1qMqJ%LjM%mOnMkMJTrNkJmKj%J0olLJoK%mQjnkOJjmK%LmnRoMJT
4.42506@klJMjJm%jJM%KqLlPjPj3MkRj2LOrO%lOj1PJKpN%L%qOnKLnKk%kNMpK%OrQmKmMTj1K%MJ
4.39047@%Mnl%MoMmLjL%mjkQkOk%pMNljTkjk%OnJKljOkTJjLqR%jKJkJlmPnTJ0nOnNk%kLkJmOpN
4.35435@LmoP%JkmNoPrOKkjkKTkL%jmLJ%JkJ%jMjj0RLlnQoMkJoMlJLkOljqPjkM%JlJLj%klOmKj
$$ plain form
4.59141 2 -8 -1 -3 1 -8 -2 -2 -3 -3 -1 -3 -6 0 1 2 -2 1 0 -5 0 -1 0 0 0 -5 1 -1 -5 -4 -6 0 -1 5 0 0 4 0 4 -4 -1 -4 1 -1 0 0 7 -1 4 -3 -3 -3 -2 -7 0 -5 0 -2 1 -3 -4 -2 0 -5 0 2 -2 0 0 0 -4 1
4.55529 1 -6 1 -6 -4 -8 2 -9 0 2 -7 1 0 0 -2 -5 2 1 -7 2 -4 -3 -3 -5 1 -5 0 -2 -10 0 0 0 -4 -4 0 4 -8 0 -6 4 0 0 -8 4 -8 -2 1 -3 1 -11 -3 -3 -7 -2 -5 -18 -7 11 -2 2 1
4.52477 1 5 1 3 -6 0 -8 -1 -1 0 -4 1 -6 0 -2 0 0 -2 -5 -1 0 -3 -1 1 2 -1 1 -7 1 -5 0 -7 -4 -3 -2 0 -8 4 -1 0 -4 -7 -7 0 -1 -1 -3 -2 0 -5 5 -6 5 -5 0 -10 0 0 -5 -10 -2 -11 0 0 3
4.49221 3 -7 -6 -3 4 0 -8 3 -2 -3 0 -1 -7 -1 -4 -5 0 0 1 3 -2 0 3 0 -11 -11 -4 -3 -4 0 -7 8 -3 0 -3 -3 -4 -9 1 -3 -1 -5 -8 0 -3 2 -6 0 -8 -6 3 -3 1 -9 0 -5 -4 -6 2 2 -2 0 -8 3 -4
4.45965 -4 -4 -11 0 -4 -5 0 -5 -7 -7 -1 3 -7 -3 0 -7 4 -4 0 -8 -7 -7 -4 -5 -1 -1 -5 1 -4 0 -2 2 3 4 -5 0 -2 -1 -5 -3 -4 -4 6 0 -3 0 1 -5 -3 -3 -7 1 0 -5 -7 -1 0 -1 -5 -3 -3 0 -4 -9 0 -6 -2 -1 0
4.42506 0 -2 -5 -4 0 -1 0 -4 -4 -5 -4 0 0 2 -6 -3 -6 1 0 7 -6 -2 -4 5 -7 -4 2 -7 -1 -1 -4 2 -9 -2 -1 1 -6 -1 -1 2 2 -6 0 -5 -3 0 -5 -3 -5 -5 -7 -2 2 -5 -3 -3 3 -6 2 -2 0 -4 0 4 -7 -5 -5 -1 0
4.39047 0 0 4 -1 -4 -4 0 -6 -2 -6 -3 -4 -1 -1 -5 -6 -8 0 -2 4 2 2 -5 -1 4 1 0 -1 -3 -4 -6 -6 0 -5 -4 -2 -5 -6 0 -2 -4 -3 -4 -1 -9 0 0 -1 1 2 0 1 -2 -6 1 -4 -9 1 -4 2 -3 2 0 0 -2 1 -1 0 -4 2 -5 0
4.35435 0 3 -1 -7 0 0 1 -1 -5 0 -6 1 -8 -2 0 -2 -3 -5 -3 -1 -3 0 0 -1 -5 -2 -1 -1 0 -2 -1 -1 -2 2 1 -9 0 3 0 -5 3 -3 1 -1 0 -6 -2 -5 -4 -1 -3 3 0 -1 -9 -2 -3 -5 -1 -1 0 -3 -2 1 0 0 -2 -5 1 -3 -1 -2
4.31823bljPmLoJTM%UJpNjlJkLNnOqPp%NKnL%qOKmLKj%KkJKlpJ4j0LkLmJlJMKkrPTj2JN%LTn%m
4.28262d%L%JMkm%JjJkKL%oRqjMmMmLJmM%JnNkJl%TLjJTpNJ%TJoJkmOM%Lj1QJmKLmKkKJjl%QlU
4.24600dNlNokN%j%TjJTjU%MnJlMlPmPrLlLTk%oMKJlkM%MoKmKJjJkJTkKlNklNMqkOkLk%koRlmM
4.20886bNLj0MqOKkj%mNnPmPlTmMkM%nK%Qj4RnJ0kTJjlJPlkj0J2KpLnKjKlKoRmMJ%j1RkPqRpkLT
4.17478Bn%LTkmnQkKlTMJ%nMKJklMokLRnTOkrJ1pNnJTPkolRLlkpNTnNlLk%LrOlKlKlKULmnLjJk
4.13815e%LJkKTj3J2j2J0mM%qQ%TJlKqJ1lKoO%l%LrPKrNJKmQoJl%M%MlJkjUMnM%K%kpN%TLmNnM
4.10356@KknJKPj4J2rOjoLTmNkKMlTJpQJpNlJjQpM%j1J5j2P%KlT%MjmRkm%TkJLmPKj2jMNn%jT%
4.06998fKOqP%pJ7j3KJkUOlkLJkJLlJkQqKjKMklRj2KjLpPjJljPrQpOkpNKjlNjTJTKnNkUNLjlNk
$$ plain form
4.31823 -2 -5 -6 1 -3 0 -6 -5 -4 0 0 0 0 1 -6 -1 -2 -5 -4 -6 -3 2 -3 3 -5 2 -5 -5 0 2 -3 0 0 -8 -2 0 -4 -1 1 0 0 2 0 1 3 0 -7 7 -3 0 -2 1 -3 -2 -5 -4 0 2 0 -9 -2 5 -7 -6 -1 -1 2 5 0 0 -4
4.28262 -4 -4 -1 -1 0 4 2 -2 -2 -1 -2 -1 -3 -1 2 2 -4 5 -3 -4 0 -4 0 -4 -1 0 -4 0 0 1 -4 1 -1 0 -3 -3 -3 0 -1 0 1 -6 -1 0 0 0 1 -5 -4 -6 -10 -4 0 0 3 -8 0 1 -3 -1 2 -2 0 -2 0 1 0 -3 -3 5 2 -1 -4
4.24600 -4 1 -2 3 -3 -5 0 0 -1 -1 -1 -2 -1 0 -1 -2 -3 -3 1 -4 -3 -6 -2 -5 2 -2 5 -4 -1 -4 -1 2 0 0 -6 -2 0 1 -2 -4 0 0 4 -2 0 -4 -2 -1 -2 -1 -3 -2 -1 -3 -1 -4 1 -1 -4 1 5 -3 -5 1 -1 2 0 0 -2 -8 1 -2 -6 -2
4.20886 -2 3 6 -4 0 -8 -2 0 -2 -3 -3 -7 -2 -7 0 -4 3 0 -3 -7 -3 -5 -1 -1 -6 -4 -4 4 -10 -1 -6 4 2 0 1 0 -3 -2 5 2 0 -10 2 4 -3 0 -5 -3 -4 -2 -5 -3 -9 0 -4 0 1 1 -10 -1 -3 4 -4 5 -2 -4 -1 2
4.17478 2 -3 -3 0 3 1 -3 -8 0 -2 0 -3 -6 -2 -1 -1 -6 -2 0 1 -1 -4 0 -6 -8 -5 4 -1 -6 0 -2 -11 0 -7 -2 -7 -6 -5 2 0 -6 -9 0 3 0 -2 -9 -4 1 -4 1 -2 1 -1 -1 2 -7 -1 -4 -2 -5 -3 -6 -4 -2 0 3 -1 -6 -3 -4 -3 -5
4.13815 -5 -5 -2 -1 -3 -1 1 -12 0 -12 -2 -6 -2 -2 -10 -2 -2 -2 -1 -4 -2 -10 1 -2 0 -6 0 0 -3 -3 0 -9 -2 0 -9 -4 -3 -1 -5 3 -3 -2 -5 -5 -1 -1 3 0 1 -1 -2 -3 -4 0 -5 -1 -1 1 1 -1 -8 -3 -3 -3 0 -4 1 -4 0
4.10356 0 2 0 -5 -4 -2 5 -9 3 -6 0 -1 -7 -4 -1 -5 0 -2 0 4 1 -2 -1 -8 0 1 -6 -1 -4 -3 -4 4 -3 1 1 -10 5 -7 0 0 2 -1 -4 -4 0 -1 -5 4 2 -2 -2 -2 -4 -3 0 -4 3 5 -7 -8 -4 1 -4 -4 -5 -6 -6
4.06998 -6 -4 2 -6 1 1 -6 11 -2 0 1 -1 -3 -5 1 -2 -4 -1 0 -2 -1 2 -1 0 -2 6 -2 0 -1 1 5 3 0 9 -3 -1 -2 1 -6 1 0 1 -2 -3 4 -5 3 -4 2 0 -7 -2 0 -1 -4 1 0 -1 0 1 3 -2 3 1 -1 -3 2 5 4 1 6 4
4.03386DJ0L%j5lOJkpPpQrNj4J5kTLTj0LMJqJ0qPjJj%jnNJk%KMoOMklOmPlJmNlkTJpPnl%LjTk%
4.00029bL%kJKk%qP%J%mkMjKLlJUn%j%QrNlM%mKJ%TLkj%K%mkMTmnLnOMjmlKMqQMr%kOpQ%oOlJ%U
3.96213ajKLpLMkpKjMqRpPqOkQrLkMoQjoJTKpJ0j2QkMpPLmjKl%JmM%j%Mm%TkM%TN%oNrOjKrMjJ
3.92652dMmMnNKmLqPJjTKlkLjkjLkPnoOLmjTLPn%oNLm%l%MkKnPjLnJrJ3oJLqMJKMqOlkL%kjnQo
3.89041fN%JK%nKkm%RpNmK%JoOjKlnQmjNmLlKl%N%kMnJPqJLjnPqNoQnJLnOmKkjNlJT%jlMKmTOn
3.85378eMjkLlL%JjPj1LjUKToNKj%mNnNnN%lKJjLl%jlTQmJ%NklLJjlNk%ljTN%jULmLTmKnMkOo%
3.81664cLKkl%PlKkl%Kj1J2nKTJlRoNrLMmTlRmMnLmPj3QjpJ1kOj0KL%jkJNmTL%TkLlMnQlnPJjL
3.78256En%pN%OnjJjKLJlnQm%KoL%nMKlLTpjNLk%jV%kJKjLmL%nPpQl%oJ5q%jTkMjn%NJ%TlKJKk
$$ plain form
4.03386 4 14 17 17 2 -1 5 6 4 -3 4 -3 5 -4 1 -13 2 0 -2 1 4 -6 -3 1 2 -6 4 -4 3 2 3 2 2 1 -4 1 2 0 0 2 6 0 6 10 8 5 11 7 14 11 12 8 13 10 8 6 7 0 7 2 -1 -1 2 1 0 -2 -2
4.00029 -2 1 1 -1 0 2 0 0 -8 -1 -1 0 0 -4 -6 -2 -3 -1 2 -1 0 1 2 -3 -3 -4 -4 4 -5 0 -3 1 1 -3 -1 0 0 0 3 1 0 0 2 2 -2 -4 0 4 0 -5 -2 -7 -1 3 2 -2 -5 -3 1 -7 1 5 -4 -4 -6 0 -7 1 1 -5 1 -2 -1 -1 -1 -1
3.96213 -1 -2 0 3 -4 -1 3 1 -6 -4 -5 -1 -9 0 -7 0 -8 -2 -4 4 -5 -2 -4 0 -6 2 1 -5 -4 -3 -1 -8 2 -10 -2 -4 0 -7 0 3 -1 -2 0 -3 -3 -2 -6 -2 -2 -3 -3 1 -3 -3 -3 -5 -1 -1 -1 4 4 -2 3 -6 0 -1 1 -8 -4 -5 -4
3.92652 -4 0 -4 0 -5 0 2 -2 1 -7 0 1 0 -1 1 -2 -4 -1 -2 -4 -5 -2 -4 3 -2 -8 -2 1 -3 -4 -5 -2 5 0 0 -6 -1 2 -2 -2 -5 -5 -1 -3 -1 -6 1 0 3 -2 -1 -10 3 -3 -2 1 -7 -3 -2 0 4 -4 2 -1 -3 0 0 -2 -3 -8 0 -6
3.89041 -6 -1 -1 0 2 2 -3 -1 -3 -7 -7 2 -5 0 -4 -2 -2 -1 -7 -1 -2 0 -3 -8 0 -4 -5 0 -4 -1 -4 -2 -5 -5 0 0 -2 2 -3 -2 5 -3 -2 1 0 -5 2 -6 -1 -7 1 -4 -3 0 -5 1 -3 -1 -3 -4 1 -2 -1 0 0 -1 -4 0 2 -2 -6 0 -5
3.85378 -5 -1 -2 -4 -1 -4 -1 -1 0 -1 6 -5 -2 -3 -4 -5 -3 -1 -7 -2 0 -1 -1 -5 0 -5 0 -5 0 0 -3 -1 0 -1 2 -1 -1 -2 -5 -8 0 -4 -3 -3 2 0 -3 0 1 0 -3 2 0 0 -3 -4 -5 0 0 -1 -2 -3 0 -4 -1 2 -2 0 -5 -1 -3 3 -3 -3
3.81664 -3 0 2 0 -3 -3 4 1 3 1 -2 -2 0 -11 1 -4 -2 0 1 -2 7 1 6 -3 0 4 0 -4 -7 2 -2 2 -3 0 -4 3 -10 -2 -3 -10 1 -1 5 -5 -3 0 0 -1 -3 -2 3 -1 -5 -2 -2 -2 -4 -1 -4 0 -5 3 0 -5 2 3 2 5
3.78256 5 0 0 -7 -2 -2 4 -1 -2 -1 -2 0 3 4 1 -4 4 0 0 2 -4 -1 -1 -6 -2 0 -3 0 3 -4 -5 0 3 1 1 0 -1 -2 -3 -3 -5 -4 -2 -3 0 -4 -1 -1 -6 1 -6 2 -1 -1 -7 8 0 0 -1 -2 -4 0 -1 -6 -6 -1 0 0 0 -3 -1 0 2 0
3.74542@pJ4lpKTmjL%KkNmjlKlRpL%lOnl%PoNKlJKoOpM%JqJOJjkOmnNLnJK%j%oNnOjLqPrJ0nJP
3.70981EnJjOqKmK%jJmNlOrM%LmjQlLoMjNnJnOmLlj%NjlJNoLj%TMmklPk%JjJjLoLJTnNklKkTNj
3.67319aNmKlNmMmljmJ2mJTkTK%qRJjkJTl%MKoPn%nQj0J0%mJjKm%JjLm%LPrOLnOoJKmOoLoLjJl
3.63809ckQnLjMnNnjJ%NqQoJ1j5OMqNLqNjm%KTlL%NmkmK%LnRm%mMTloLPoPj4KjPlKNrRqJ%LjJ%
3.60298@kJToPlPmjTLkJoLjLTkmLKkQq%TlLnN%KkjMJTj0JLmlJ3mjJLojL%MkjQrjTpJ3l%TJpPlJ
3.56788@lOlKJlMlMn%NpNpMJnOjMkMJokJ0jlQkOJRl%Kj0kLqKLmNj2J%nPpOnKJKpJ3j0KmLKJpOq
3.53380cPJ%jm%NkJNnlNpOoQpLlPoPlJo%PrMkKTkTOmk%kOnNKkrJ6j1MjO%r%TNJoMoMjQnRpjMkl
3.49819DmJ1n%MNj4PMpKOqnQ%Kj0NmPkJlLMmNkj%LnMJ0j1MkjljJ0rKmLnLJLoOo%Pj0MlKPp%NJ%
$$ plain form
3.74542 0 -7 7 4 -3 -1 1 -3 -4 -1 -1 1 -1 4 0 -1 -4 -2 -5 4 -3 0 0 -3 3 -2 -5 -5 2 -4 1 3 0 1 3 -3 3 -4 0 0 1 -7 -6 0 1 0 -2 4 0 -5 0 3 -2 -1 1 1 0 0 -6 -1 -6 0 -1 2 -6 1 -8 2 -3 -2 5
3.70981 5 0 1 0 6 -2 0 -4 -2 -2 -3 -2 -6 -1 -4 2 -7 -3 -3 0 -4 -5 3 0 3 -3 1 0 5 0 1 -4 2 -2 1 -2 -3 -3 2 1 -2 -1 4 -2 1 0 0 0 4 0 -2 -5 2 0 0 1 0 1 0 3 -3 0 1 2 -3 2 0 -3 -1 -3 -5 0 -1
3.67319 -1 4 0 2 -1 4 0 4 0 -3 -4 -8 4 0 1 2 0 -2 0 0 -8 1 2 1 -1 0 1 -2 -2 2 4 -2 5 0 0 -5 3 -7 3 3 -1 0 -1 1 -3 -3 -2 -3 0 -4 -4 -1 6 -3 3 6 1 7 1 2 4 0 6 0 3 -3 0 -1 0 -3
3.63809 -3 -5 3 -2 1 0 4 -1 4 -1 -2 -1 -1 4 -4 4 -2 9 -6 0 4 -4 1 4 -4 1 0 -4 -4 -2 0 -3 0 0 5 1 -1 -5 -3 -3 0 -5 4 0 0 -4 0 4 1 -5 -2 5 -1 6 -8 -6 -7 0 -3 -1 4 -5 4 -4 -3 -3 0 -1 0 0
3.60298 0 -2 -1 0 -6 1 -2 5 1 0 -1 2 0 1 -5 -2 -3 0 3 1 -3 0 2 0 8 0 0 0 -3 0 -5 0 0 2 0 -1 3 4 5 -5 -4 -1 -5 -8 5 1 0 1 4 -2 -3 0 0 4 2 1 9 0 -1 -2 -9 4 1 1 1 2 -5 2 -1 0
3.56788 0 -3 3 0 2 3 0 4 1 5 0 0 5 -2 3 -4 0 1 -4 2 1 5 3 7 8 2 0 10 9 6 14 12 18 19 28 25 25 27 17 15 18 10 12 15 11 16 4 5 5 0 7 0 6 1 3 4 6 -1 12 2 4 0 3 5 6 -1 5 -3
3.53380 -3 4 5 5 4 0 0 5 3 4 9 4 1 6 -1 5 -1 7 0 3 0 7 1 8 5 6 0 0 7 -2 2 0 2 4 2 0 6 2 0 0 -2 4 -1 4 6 4 -5 11 0 4 3 9 9 0 0 0 5 6 0 4 -2 2 1 9 4 13 6 5 9 7 4
3.49819 4 0 11 6 6 10 15 1 8 12 5 7 13 5 0 8 8 10 0 5 1 8 6 7 4 7 11 7 12 10 9 9 12 7 11 21 10 14 12 11 8 7 17 8 10 6 9 4 7 8 11 5 11 5 5 12 2 6 3 5 12 5 5 10 11 11
3.46512A1nJOnoJ2kRj2Qmk%JjnKLnKTJlJpPlO%TJjMnkONmjmQmJ%nMTrPkokQpNj0J0%jnMLpkJQq
3.43104FMKqJ2oJkLmPl%TjOnlN%J0oJLkojkOLlmKTljMjqJ2j6J6r%TLjMmj%KTJlPrJ1lmOMp%KkJ
3.39746B0kMjoJ0rRoLJMlNrQj0NTJoONLnJMlKlQ%pNJ0Ol%ojpNoOnMk%jOoKM%JmMJKTjTNpOjJ0r
3.36338E3RoLlkJ4nNPlPQ%KPkJ0pJ6pqNmP%LmPOjOl%J1MNOPjJ7nPQJ8nJ0NJ8%K3RJ9QJ9J7J6K7
3.33438C63J8K6K8K6M9L5N2N7O4Q4Q2Q7R2R4P2R4Q1R6TJ00J16J27J56J71K15K43K90L46M09M94
3.31912D263O02P63R50J238J616K125K794L652M543N011M015J195k049l873m292m005l516k952
3.30997A2080k382j865j466j138q80o93n37m46l43k84k36j85j66j42j12j05q0q7p1o7n7n4m2l7
3.29776F05k9l4k7k3k8j3k9j2j6j0j4j3mj9npj0k3nj6j2rj1rk1%qj0n%j7lnkopnpjKrNqKpnQrj
$$ plain form
3.46512 11 6 7 13 8 2 14 12 21 9 17 13 11 11 12 11 6 8 11 6 8 10 11 8 9 2 9 6 12 12 12 13 12 16 11 9 15 20 16 15 11 19 15 16 16 11 15 19 10 17 15 9 7 15 8 13 3 13 13 12 7 11 14 7 5 6 14 6
3.43104 6 10 12 4 16 10 11 9 12 8 15 12 12 12 11 17 12 9 14 14 24 18 19 22 20 14 13 11 17 20 17 13 15 17 14 13 17 16 8 20 4 20 11 11 11 14 13 17 13 12 12 14 16 17 14 21 12 23 20 16 22 26 19 19 21 19 20
3.39746 20 18 22 21 15 25 16 25 19 22 23 27 24 29 20 28 18 23 28 29 23 29 34 37 32 33 37 34 36 33 41 41 34 39 49 55 52 52 46 45 38 43 37 43 38 42 40 40 39 45 39 41 45 45 46 42 46 47 49 51 50 49 54 47 53 52 62 53
3.36338 53 62 56 59 56 54 68 63 68 75 72 79 87 87 89 96 94 104 97 113 106 98 103 99 106 106 109 105 112 118 117 123 120 120 131 135 140 146 153 152 169 164 171 179 197 192 202 207 225 225 248 257 276 284 303 320 336 363
3.33438 363 381 407 435 461 510 545 597 654 718 802 884 971 1063 1157 1229 1323 1404 1500 1596 1696 1812 1939 2095 2266 2481 2724 3014 3360 3769 4263
3.31912 4263 4865 5628 6578 7816 9432 11557 14351 18003 22546 27557 31572 32767 30718 26845 22553 18548 15032 12080
3.30997 12080 9698 7833 6367 5229 4349 3656 3119 2673 2330 2046 1810 1625 1459 1317 1205 1100 1020 933 862 795 738 684 642 605
3.29776 605 576 542 515 492 464 451 422 410 394 384 370 357 353 334 329 322 312 289 284 268 256 247 236 227 206 206 198 188 183 183 166 163 158 156 150 143 138 131 130 132 123 128 120 122 115 110 118 109 108
3.27283A08lpj0P%qRj0PqMj0PnJ4j8MK%JrJqJ1mlkQj0LjOkTN%lmLJ3jQLJ0OK2J0J6J4kk2ol3o
3.24536A05j8j0j3oqJLqjkmLlMnlJj0ROlLoKmjQnJLlRnjPMKlJ0jLT%J2j2jj0Oj3pKlpTNnNp%TJ
3.21433B3%Oj3J0jqKMrMJU%TnoJ1kJLj%TkNnl%kL%OpOJjlk%QKj0MqQnKJjTJLKLqMKj2QJOmL%TK
3.18024B9kojpJ1njJKqOlTQjmlN%JlRojKjNo%mMOpNj%RmMnJLJlLJklnNj0Lk%j0MjOkqOj2Lkm%k
3.14616eOPjKJjJ2pn%TKL%mL%JNj1JUPj1RJKkKj3OkMlLlJkJK%Nj0M%TnLkPnLkmLTjMpQrNqJ1j3
3.11259CJ4qLrNPklpJ1n%LoKQj0Nl%pN%KOoPloMTmJTnNjTP%j7R%NnoJ1rQqMmLKLnlMNKpJ2j6QK
3.07952A5J%pNnJ2lKMokNTjNnQ%lOlK%jTknMj0NoKlJjOj2LqMnRpQqNn%K%kTM%lLjmoNkOTnJjTl
3.04493EkKTJjk%L%UnMj%OnNoOj2J2pOjljTJJ0nrJ0jqQnjJMoNkjOn%kR%jpnQqNlRonJ0rQmjTOm
$$ plain form
3.27283 108 105 98 88 95 95 87 96 86 93 85 89 79 86 81 95 77 81 83 83 84 75 76 68 79 75 72 70 78 68 71 70 76 74 72 77 77 74 70 73 86 85 93 96 106 112 134 144 160 174 172 150 144 111 105
3.24536 105 87 77 64 58 50 51 54 46 45 43 39 42 39 43 38 35 36 26 35 41 38 41 35 37 33 32 40 35 36 39 36 45 40 39 46 50 52 49 59 58 61 64 64 76 64 63 53 59 46 39 41 38 31 24 29 24 29 22 22 22 23
3.21433 23 23 29 16 26 25 17 19 23 14 18 19 20 21 21 21 16 10 21 19 20 23 22 22 22 20 25 20 17 17 15 18 18 24 17 23 24 23 20 18 18 26 28 18 22 14 22 17 19 20 19 18 19 22 24 27 19 23 25 13 21 22 28 24 27 27 27 29
3.18024 29 27 21 20 13 24 19 18 19 21 13 19 16 13 21 20 16 13 18 18 19 16 25 19 18 20 19 24 18 18 14 18 24 17 22 21 21 30 26 30 25 26 29 30 27 30 31 29 26 21 26 16 19 17 17 7 11 10 16 14 6 12 0 3 1 -3 -3 -5
3.14616 -5 1 8 7 9 10 9 21 14 9 9 9 11 14 14 10 13 13 14 19 8 9 10 11 18 7 16 17 19 17 19 6 12 10 14 11 14 11 12 10 11 13 13 18 8 12 12 12 7 10 8 15 10 13 11 7 10 13 12 16 9 17 8 13 5 16 3
3.11259 3 17 9 12 3 8 15 13 10 3 14 9 9 12 6 8 16 6 11 8 8 1 6 6 8 14 8 15 12 6 10 14 10 11 12 7 12 11 10 17 17 0 9 9 14 9 3 14 5 13 5 9 5 8 10 13 8 5 9 14 16 9 21 5 13 15
3.07952 15 16 16 9 14 9 21 18 20 24 18 16 21 26 25 30 25 33 33 30 36 33 35 35 34 33 31 26 30 20 25 19 21 18 19 18 24 12 15 7 11 6 15 8 16 8 13 8 8 10 10 8 6 10 10 7 10 9 5 -1 4 2 8 14 9 10 9 8 5
3.04493 5 3 5 7 8 7 5 5 8 8 8 8 3 7 6 6 12 7 12 6 12 0 12 5 11 10 7 6 5 6 16 11 2 12 11 3 11 6 5 6 10 4 9 7 6 12 7 7 5 14 14 13 6 1 9 1 6 3 12 6 1 11 2 10 6 5 4 10 6
3.01034FLjMJ%r%LnJOlkMNlj0J2nkJjKjM%oNjKMj0O%Nj0MkKm%LMKj2RpPKmlKLjKmKjmMl%lNJK
2.97676A1j0R%Nj4J0%mO%nLJoJ0mlNj0QjLkmlRpLkNmkLjOn%Qp%OnTMnJ3oTPjVJNlJnNL%jnJ0lk
2.94319A6JKoQKmkMkNKJoKLJkj%KlLkoPkmMTkTOlKLKljlPq%NmQrOjKrRj1MOkQj1N%lOLmlOjTLj
2.90808C6MQ%j1J0rMJKMKUlKlJKOLmN%kPlKLKP%lPjO%JJ2JLkNJ7kLPLJ3NOQORJ1QJ4RJ0J6J3K3
2.87705B88RK8J4K2K4K9L4L6M1M5N2M7O4O0P8O9R5R6J17J33J39J77J89K35K63L02L52L77M11
2.86230C826M25M02L76K94K35J16L5o9j60k39k94l49l68l60l58l51l28l18k82k61k31j99j63
2.85060A379j52j21j09r3p9p3o4n9m7Tm0l9l0k3l2k0k7j3j6j4k1qj5j3pj1oj7j0LnTj2rlj2mnj
2.83076A20npmjkrJNorj%qNj0PonJ1r%nplRnk%TjQj1nOpPjKqJkLj3J1pRlTPrLpQmnkP%Lk%UNJl
$$ plain form
3.01034 6 9 8 12 13 13 4 4 7 2 3 9 6 4 8 13 10 0 12 7 5 6 5 7 6 10 10 4 9 8 10 14 4 10 10 15 5 9 7 9 5 5 8 12 14 2 11 4 11 13 9 6 8 11 10 12 8 10 9 5 9 6 6 3 8 9 11
2.97676 11 1 10 10 15 1 11 11 7 13 13 8 11 12 6 16 12 9 14 4 12 11 14 12 8 5 14 7 10 8 13 9 7 10 9 15 10 10 18 11 11 17 12 7 11 6 19 13 7 14 13 12 11 10 11 16 13 14 9 14 17 17 16 11 21 18 16
2.94319 16 17 19 13 21 23 19 17 21 19 24 26 27 21 23 26 27 25 24 24 26 23 26 24 18 25 23 19 23 27 25 23 29 26 28 31 33 30 29 26 33 25 25 30 26 34 25 31 30 32 23 32 21 25 31 29 37 26 31 31 28 34 37 33 30 36 35 34 37 36
2.90808 36 40 48 48 37 47 38 42 43 45 49 51 53 55 52 54 51 52 54 60 63 59 64 64 62 69 66 68 71 73 80 80 77 84 83 89 89 90 102 103 106 104 109 126 124 127 134 137 150 155 161 169 175 184 195 203 217 226 236 252 265 288
2.87705 288 297 325 339 361 385 414 448 484 525 570 622 669 733 793 871 940 1035 1131 1248 1381 1520 1697 1886 2121 2384 2686 3038 3415 3826
2.86230 3826 4251 4653 5029 5323 5558 5674 5709 5640 5480 5241 4947 4598 4230 3870 3512 3161 2833 2515 2233 1972 1741 1542 1379
2.85060 1379 1227 1106 997 904 825 752 688 629 582 535 495 456 426 403 371 351 324 311 295 281 260 252 237 224 217 206 200 183 173 176 171 166 154 145 142 130 126 121 120
2.83076 120 115 108 104 103 101 92 93 98 92 83 82 82 74 79 69 76 70 65 76 67 67 62 55 52 61 56 54 54 54 53 61 50 45 51 44 51 50 52 44 45 43 46 33 44 37 46 43 40 47 38 41 34 42 38 33 31 38 38 41 39 39 39 39 44 45 42
2.79718D2OjLqRlNkljkTnJ%moPo%rPkjTJTjTkMj1J3qKmKkJLmPmJ2j1J0j7J0m%KLoRnmLlKMqJTn
2.76463A5jLKnklMNj1PLj0M%LlKnMJl%mMjKj1J4pNjkLkLj1J5pjlJ0nonJ0%KkjlOLm%KNqkNoJMm
2.73258HNJrOlLk%QpOnjLmKNLrMLjKlJoKJKNmkMnjlLj%OlkJNTj4J1qMoN%j0J1MomkJUoOoNkoKT
2.69748FOqkLnNmQlm%LKkTKjTLkUOkOrNnjL%Mj%jTKLKlpPkKNj0NkTLKrLNnOj2NlPkMJOj3N%UjK
2.66136HJjJmPokJ0%TljMr%LJTJ3J%JmMLMjLKmKoPolOj1OklTjnLMpJ%j3R%JLnoKJLqOnKjk%PoM
2.62677FjKkjmMjNqPjo%QqLkQmlLpPrJ5j1N%J%oKMnLkTQMj2J0MomkJ0nLqMjKmOoJTLjrOJ4j3%n
2.59370@LkM%TlOoQoKokLnJ1nKmPljOj0Ql%l%MJ%lMTj1JlJ1pKjL%mLKjMk%TrMkOpJ6rLqLKOj3K
2.56013BQkljOpLk%MmLlKjKTlNmLmMnJ%joJ0lKjJoOojQlJnR%m%kMjJKLrLKkJjPkjlKOnmL%TLoO
$$ plain form
2.79718 42 48 47 50 42 51 48 53 51 48 47 45 43 38 39 39 35 29 36 30 30 21 28 26 25 24 25 26 25 24 22 26 15 28 20 22 18 20 18 19 22 18 25 21 33 22 32 15 25 21 21 23 26 20 29 24 20 23 20 22 26 18 19 20 15
2.76463 15 14 17 19 14 12 9 13 18 7 14 17 7 11 11 14 11 13 8 12 13 10 10 6 10 9 11 0 14 7 12 11 9 12 10 13 2 17 10 9 6 16 11 5 0 10 10 12 10 9 6 12 15 11 11 13 18 10 8 13 7 8 12 8
2.73258 8 13 14 5 11 8 11 9 9 17 10 16 11 10 13 9 11 16 19 10 14 17 16 18 15 16 10 12 13 15 20 16 14 18 13 12 9 12 11 11 17 14 12 13 18 23 9 20 12 16 10 15 15 5 16 20 14 10 8 9 10 11 5 11 5 10 8 2 4 6
2.69748 6 12 4 2 5 0 5 1 9 6 2 2 5 7 5 3 5 4 3 6 4 2 0 6 4 10 1 6 1 0 3 3 7 6 6 5 4 6 9 11 8 1 8 6 8 13 3 8 6 4 7 9 0 3 8 3 9 -3 2 -1 6 4 8 9 15 2 7 7 7 7 6 8
2.66136 8 9 8 9 5 12 6 4 14 14 14 11 10 14 5 5 8 9 10 23 24 24 25 21 25 28 32 31 34 36 32 34 28 35 29 26 32 21 27 25 22 19 18 13 16 20 13 14 14 1 10 10 11 14 9 3 5 6 9 1 7 2 4 3 1 1 8 2 6
2.62677 6 5 7 5 4 0 4 3 8 0 7 6 0 0 8 0 3 1 9 5 2 5 -2 5 -4 11 0 5 5 6 6 0 2 6 1 4 2 0 8 12 0 10 14 8 4 2 12 7 10 2 6 5 7 3 9 3 4 5 8 7 -2 4 18 5 5 0
2.59370 0 3 1 5 5 5 2 8 2 10 4 6 0 -2 1 -4 7 2 4 0 7 4 3 9 -1 7 4 4 1 1 5 6 6 3 7 11 0 1 -2 9 2 4 3 6 6 2 5 7 6 10 8 8 8 -1 3 1 7 0 16 7 10 2 5 7 13 0 2
2.56013 2 10 8 5 4 10 3 6 4 4 8 4 7 4 6 5 7 9 6 11 7 10 6 10 5 6 6 5 -1 9 6 8 7 8 2 8 2 1 9 6 7 2 11 11 7 7 5 9 8 9 11 14 5 8 10 8 9 8 15 13 12 9 11 17 12 8 11 11 11 14 8 14
2.52401A4jMJTj0OjQm%K%KjNJMoOJ0J%NmJ1RMLJ2MJ6QK0K1L1K8L8K4L0J8J4MJ2J4K4TL4L6N7L6
2.49857E75N1J4J7lj0kOJ7K3M3M7M1L8K1j0k5l9m0k5k9j0lLpJ1k1j7l5n0m0l6l8k4j8j7ok2j6
2.47924C64l3j2l0l7k3k1k3k4j6k1j3j7j1pj1j2Jnj2Nj0nQj2NJkJoj%KkjqNKmQj0JjLnmTRKj0
2.45431DJ2j1OpM%jKmP%jj0OlKlKkL%TKJLoJlkPnOj0J0lkmLJMmJj0J6qKmPkmOqOKklLoOJk%mLJ
2.42125FnKMl%mLJNpLnJ0j0RkKojk%J3j3PpRo%KNklLrO%MnPmj3J1OpLmTN%oKMnRj0JKMkjJ%k%T
2.38818Aj%JlJ0qjKj%LkljLOqQojLjTmQ%kjPqMnjQrPmLTpJ1j0Qnj%MlkJLqRljT%mP%lKkjL%TnN
2.35308Ckj%mLTm%TLNlKmjOmkJLjkjkKNnRrPpJoMPmjMmJKmMmK%kM%j%TJUo%UKmJ2j0%oPrJ8omj
2.31696aJ%oKLKk%KMnOokMPmn%Jm%JOm%JKNq%NlLj1RLoLoL%MlNnlK%LnKJmKLkJk%JmJj%NTjloM
$$ plain form
2.52401 14 13 17 18 19 9 15 14 22 18 18 20 20 22 21 26 27 31 25 31 41 42 42 47 43 54 63 67 70 82 86 102 110 130 151 182 210 248 272 302 320 334 338 350 364 388 412 446 482 539 575
2.49857 575 626 640 657 654 644 642 648 665 688 731 778 819 857 878 868 843 804 764 739 710 700 697 700 693 704 683 666 631 581 541 505 467 443 425 408 402 380 364
2.47924 364 331 319 289 252 229 208 185 161 145 124 111 94 83 76 65 53 54 49 37 42 32 27 35 23 28 29 27 28 22 21 21 23 21 20 12 17 19 15 23 13 14 13 16 11 7 3 12 14 4
2.45431 4 16 5 11 4 8 8 7 9 5 12 12 11 1 7 4 6 3 5 3 6 6 6 8 9 12 6 7 4 2 9 4 10 0 10 7 5 1 4 5 9 5 6 -4 12 4 6 2 9 7 3 9 1 7 9 7 4 7 1 7 8 6 6 2 5 6
2.42125 6 1 3 7 4 4 0 3 4 9 2 5 0 10 0 9 7 9 3 2 0 0 13 0 7 0 9 3 3 5 10 8 5 8 -1 5 5 9 4 11 7 -6 5 11 4 7 3 -1 4 4 -2 0 4 -1 8 -2 -1 1 5 3 2 3 3 1 1 1
2.38818 1 0 0 1 -2 8 0 -1 1 0 0 3 1 -2 -3 0 6 -2 6 0 -1 2 1 0 -4 4 4 2 1 8 0 4 -1 -2 6 -3 4 0 3 6 -1 10 0 8 3 2 2 6 3 1 2 5 -3 6 3 2 1 1 -3 4 4 1 3 1 0 3 3 3 -2 3
2.35308 3 1 0 0 -4 -1 2 -2 -2 -2 1 6 3 5 1 0 6 2 0 1 4 3 1 0 -2 0 5 0 9 0 7 0 1 -5 -1 6 2 1 5 1 2 4 0 4 0 2 2 0 4 4 3 3 3 4 5 6 0 0 0 0 2 -2 10 0 0 -6 1 -8 10 4 0 -1
2.31696 -1 0 0 -6 -4 -1 1 -1 -1 1 5 0 6 0 -2 2 9 5 0 0 1 -3 -3 -2 4 0 0 1 3 8 0 0 5 2 5 -6 3 6 0 3 -3 0 0 4 1 6 1 -2 0 0 3 -2 0 1 -3 -1 2 0 1 -1 -1 0 -4 -3 -4 -4 1 6 5 2 -4 0
2.28084@JkjMLpkQnJLNj2RnLjOo%L%nOKkljJj%MTqLJj0MN%kMlMpPlkP%qKlPoRpOj2K%MoMnQpKj
2.24574amJ0kjkTK%OqJjP%qJ1j3QnKNlmlJ5j5J4j6J4rLj%LkMoJmLjMqOLl%kjJ1q%nOnQoNnKJnN
2.21369AnNmLkNljKoOp%TO%UlLmKkMKmKmMjOnKlKmOnJTpJ1mLrJLMnPmlPlj%j%LoM%kPj0NkMJmJ
2.17757@kMkLj3J2lJ%KljLj1J3n%N%jmL%nJNlJjTJlMkNqNTl%jUJ%pJOKJqOoMkTMOj0J0pLKn%Lk
2.14349ajLJk%TmMmkOj%lMlMjmNkQrKm%LMl%UOqJ%Kj%qJ0%TMokTMKlTMjOolJ0okKJmkKJMpRmLp
2.10737dPqOkJkMm%kJKnQkJlNlkLjkjL%jkKMoL%KpJM%MpJjRo%nLN%loPMoOklLn%KlTPKmKj1J0J
2.07176AkJ%MoJUkLloMLoNmPjlOn%UJKpPLqLNkqRj0Rjk%Ll%mOmJOj0KmO%KmkN%TlJ%LlMmnOKm%
2.03513cL%lN%j0QlNkUQoOj3R%TL%moKLTjMkmNpPnNokOlKmM%mLOpKJloJJ2oPokMjUkLmJ0rJjKo
$$ plain form
2.28084 0 1 -1 -2 2 5 -2 -4 4 -1 0 3 8 -4 5 0 3 2 8 2 2 5 5 0 6 8 6 3 2 3 2 2 6 10 2 5 6 -4 0 5 5 3 7 4 8 1 8 5 3 10 10 2 4 1 8 2 11 4 10 -2 0 0 4 -2 2 -3 5 -2 0 -1
2.24574 -1 -5 5 3 2 0 -2 0 0 6 -2 -1 -2 5 5 -3 8 -5 3 -2 0 5 2 -2 -5 10 -5 9 -7 7 -2 1 0 0 3 1 5 -1 0 -4 -1 -2 2 -6 0 3 0 0 -2 -3 8 0 0 -5 1 -4 4 -2 3 -2 0 1 -4 1
2.21369 1 -4 1 -3 0 -2 3 0 -1 1 -5 1 -6 -6 -6 0 0 0 0 -3 0 -4 -2 -4 0 2 -2 0 -4 0 -1 5 0 2 -1 1 -3 3 -2 -1 0 -7 4 0 3 -6 -5 -2 2 -3 4 0 -3 4 1 0 0 -1 -1 2 -4 0 0 -2 5 -5 0 -2 2 3 -1 0
2.17757 0 -2 2 0 3 -10 2 -1 0 0 2 -1 -2 1 -10 3 -2 -2 3 3 2 -2 1 1 -4 -3 2 -1 0 -1 -2 -1 -4 0 -2 3 -5 0 5 2 2 1 0 -1 0 0 -7 -6 0 2 3 -5 1 -5 -1 -3 -5 -1 5 -5 5 -2 1 3 -2 -2 1 -1
2.14349 -1 -2 1 2 0 0 0 -4 0 -4 -6 0 -1 -1 -4 0 -3 1 0 -4 1 -1 7 -2 0 -4 -4 -1 3 0 0 0 0 6 -2 -1 -1 1 0 0 -8 2 2 2 6 0 -2 -4 0 2 -1 -4 0 -1 5 -1 -4 6 0 -2 0 1 -3 -5 -3 -2 2 -5 4 0 3 -4
2.10737 -4 3 -5 1 -1 0 -2 2 -2 -2 -4 -3 -1 -6 2 0 1 -2 3 0 -2 1 0 -2 -3 0 0 -1 -3 -1 3 -3 0 0 2 -5 -4 0 0 4 -3 -2 -3 6 0 0 -5 -2 3 3 0 -6 1 5 -1 5 3 0 3 -2 -2 0 -3 -6 1 3 -1 1 -10 0 1
2.07176 1 -1 0 0 4 -2 -1 0 1 -1 2 -1 -7 -3 0 -6 -1 -5 2 1 -2 4 -1 -1 -1 -1 0 2 -5 2 5 -3 0 5 3 -5 4 -6 3 2 0 0 3 0 0 -4 2 -2 -1 5 -5 -3 -7 -1 -1 1 -3 -5 0 0 0 -3 -2 -2 1 -2 2 -2 -7 -1 1 -3 -3
2.03513 -3 0 0 -3 2 2 -8 0 -3 2 0 -2 -4 4 -2 4 -9 0 0 0 3 3 -1 -7 -5 -2 1 0 4 2 -2 3 -4 3 -2 3 -3 -5 1 -2 0 -4 0 0 -4 -1 5 -2 0 1 -2 -8 -7 5 -1 6 0 -2 2 1 0 -1 -3 0 -4 6 -3 -2 -3 -1 -7
1.99952gR%jNpjkjOJ%MqMkLTnjj1J0LkNk%KjJRj0MJJ2mOLJ0KJ5J0r%j5%oJqkUp%oLmKnlTKMl%N
1.96646ElK%o%Nl%kQj0KUkQj0OmNoK%TlNmJjJKjmPpJ0j0NkJpMOnOJqOkTjKlMkJkQo%nOpNJkJkj
1.93136cMLnJNnKl%LNnqJMnLT%kPrMjJqJ0jlKLlTjJOJTlqKJPkoKnMlO%JkJ%Kjn%kKJLnP%jJn%j
1.89524dPjlNj0J4qmJTLklMOrmRnLmLjNrQkmQj0J0j2J8j1kNlJ%lMTmjT%oNMLnlNpOjNj4J6rOnm
1.86319eRrJ2j1J3j3RmKj0QJmMkJjOqJTnPKljJmMj3RNqPk%KjTmlQjlKTkMl%pJ0kKklmOkLKnlO%
1.83012@nkMkL%lKOmj%NoLoKOkjTnNjLnN%lNkKJkjTJoKLPj3P%lmP%mML%mQj0KTjkJKoNoRnPj7
1.79553a2J3nKlQlTkQolKnQMqLkKmjMKJnNnL%kNk%kNoMJklLQj7J3lKloQlNqjPkjKTjJKj0O%jlM
1.76145@nOlMLknKoKL%mO%oMoOJMj0NJknJ0mLmKT%nLMmjNkoJOqQ%TjnJkOmKTknKMkJlJ3rPj2Lj
$$ plain form
1.99952 -7 2 2 1 6 -1 -2 -4 -5 1 2 2 6 -2 2 0 3 6 1 0 -11 -1 2 0 5 3 3 5 4 5 14 4 8 9 21 17 23 26 36 38 53 63 54 54 39 39 33 34 26 24 22 20 13 13 7 10 6 8 3 0 -3 -1 3 0 0 5
1.96646 5 2 4 4 -2 -2 3 0 0 -2 6 -4 -2 0 2 0 8 -2 4 0 5 -1 1 1 1 -2 3 -1 0 -1 0 2 1 -3 4 -3 7 -3 2 0 1 -6 -2 4 -1 5 6 -2 4 2 0 -1 1 -2 2 0 1 -1 7 1 1 -4 2 -5 0 1 -1 0 -2 -3
1.93136 -3 1 4 -1 0 5 0 2 -1 -1 2 7 2 -6 -5 -1 -6 -3 0 0 -2 5 -4 0 -1 0 -8 2 1 -2 0 3 0 -3 -4 -3 3 4 5 2 -6 -4 -3 4 2 -4 -2 -7 -3 -6 0 0 1 -1 0 0 2 1 -4 -4 -6 -4 -3 0 -5 2 2 1 2 -3 -3 -4
1.89524 -4 3 2 -1 4 -6 8 0 -4 -3 -2 1 -1 -4 0 6 -3 -7 2 -3 0 -4 -1 -2 3 -6 2 0 -4 4 -6 4 -8 10 -1 -3 2 -1 0 0 -3 1 5 1 0 -1 -1 -7 -2 2 5 0 -3 2 -5 1 0 5 -9 7 -2 4 -1 -5
1.86319 -5 4 -5 7 -4 9 -4 5 1 3 -7 1 2 -2 2 0 1 0 6 -2 -1 0 -5 2 4 1 0 1 -3 1 -12 -3 2 -6 1 -1 -1 1 0 -1 -5 -8 0 -1 -4 -2 0 -2 2 -1 -1 -8 2 0 2 0 -3 -7 -1 -3 0 2 -3 -6 0 0
1.83012 0 -5 -7 -3 -5 -2 -2 -5 -3 3 -1 -2 -2 3 -3 0 -6 -4 2 0 -1 -2 -7 -2 -3 0 -5 0 0 -3 2 0 2 3 1 0 -1 0 -6 -4 -1 6 -7 0 0 -3 -7 0 0 -4 0 3 3 -1 7 -3 -1 1 0 -2 -1 1 -5 0 -6 3 -2 5 -12
1.79553 -12 1 -4 -2 -5 3 0 -3 -5 3 -3 -6 -4 -9 -1 3 -5 -2 -4 -2 -6 -7 -3 -1 0 -5 0 -5 -2 -2 -4 1 -1 -1 -3 2 -4 0 1 -1 -4 -1 7 -10 3 0 2 -1 -7 1 -2 3 -5 -6 1 -1 -2 0 2 1 2 4 -6 0 0 -1 -4 0
1.76145 0 -5 1 -2 2 5 3 -2 0 -6 -4 -1 -1 -5 1 1 -5 -1 -7 -1 0 4 -6 -1 0 -2 -7 3 -1 2 -2 0 2 2 -3 0 4 0 -1 4 2 -4 -3 3 -5 3 3 3 2 -3 -2 -4 2 -2 0 2 0 -5 -3 1 -1 0 -3 10 1 8 -4 -1 -2
1.72686bOqLmj%JNTj1PnMKklKMpNmMlK%TKnL%kqJ3mRj3O%Lj2RoLKLklRpokNJLKp%PqJ3okM%j0O
1.69328@nNTjkpKlMKMrOnQpKTjTQqMl%jLmMkLpJ0oLl%JnMKl%Mm%Ml%VlKNqLJjJ%TLlLqLmQrJ0l
1.65665@jJjPqMjLoj%KRj3NjJjJkK%LoLkLqOLk%kjJlN%TJpOnQM%pTPlMkmKL%jNmqPMnKJj%J%nP
1.62053CqKNkJjlJTMkjlLmJ0kokKNqMlTP%jkjQmjnLTmL%JLjJnKo%JTKJTLjqOkjL%jnOqJ1j4J3q
1.58594fMKnN%njLTkMj0%NOoPmKj3J6rJ0p%JnLJLjTLnNnlL%KTjnPmKJoNj%jJ%oPkJkOoNjNnkrO
1.55135cKLMoKkJKqOk%LnlOoRJTnjJTlMk%jJmN%lJ0j1MlLJ%k%KJqJ4oKoQj1J2pLJpKl%OLj1LMk
1.51777@lNnKT%jTmJMNoPojJLoMJjkRpJrJ0n%TNo%KjLj%ULmjlN%l%KjKNj5PLrN%OpKjOklLkmOm
1.48166dMJKpP%TqNlLJmKLTnOjnkOoJKjT%LMm%ljkQjqMJKJk%jJjJoRm%KnK%NrQlMlJoMJkLoQmJ
$$ plain form
1.72686 -2 4 -4 -1 -5 -6 -6 -5 0 5 -6 1 -4 0 2 0 -3 -1 3 -4 1 -3 1 -2 0 0 0 2 -3 0 0 -2 -10 3 -1 8 -5 1 1 4 -8 1 -5 -2 0 3 1 -2 7 0 -6 -8 -3 -2 1 3 -4 -4 3 -5 8 2 0 4 4 -6 0
1.69328 0 -5 0 5 4 2 -5 -3 -6 -2 0 4 -5 1 -4 4 -3 -1 1 0 -1 7 -1 3 0 0 -1 2 -2 2 0 3 -4 6 0 3 0 0 1 -4 0 2 -1 -1 3 -1 -1 3 0 0 0 0 0 -3 -1 4 -4 -1 0 -1 0 0 0 3 0 3 -5 -2 -6 2 -7 3 0
1.65665 0 -1 0 -1 6 -2 2 1 4 -2 -3 -3 -1 8 -5 0 -1 0 -1 0 -2 0 0 3 -3 0 -2 1 -7 -1 2 0 0 -2 -3 -2 -5 0 0 0 1 -6 0 -5 3 7 7 0 -7 0 -3 1 -1 -5 -3 0 0 -1 4 0 -8 -1 3 -2 0 1 0 0 1 1 -4 3
1.62053 3 -5 -3 2 0 1 0 -3 -2 -1 3 1 0 -3 0 -4 6 4 -2 -4 -2 3 -5 -1 -4 -7 0 0 -1 -3 -4 4 0 -1 -6 -3 0 -4 -1 -1 0 3 2 3 -2 0 -6 -6 -5 -4 -2 -1 0 3 2 -6 0 -2 -3 0 0 -1 -6 0 -8 3 -11 2 -6
1.58594 -6 -2 0 -5 0 0 -5 -6 -3 0 -2 2 -8 -8 -3 3 -3 4 0 2 -11 5 -4 6 -1 -1 0 -5 -2 -1 2 1 0 3 -2 3 -2 -5 -2 -2 0 2 1 -4 3 -1 1 2 -4 1 0 0 -1 0 0 -6 1 -1 0 -2 4 -2 3 2 7 2 0 -9 -3
1.55135 -3 -1 2 6 0 2 0 1 3 -5 1 -1 -1 2 -3 -6 0 -6 3 4 5 0 -1 0 1 -2 2 0 0 -1 0 -4 1 1 -2 8 -3 1 -2 1 2 2 0 0 2 3 -5 9 3 5 -1 7 -4 8 1 4 5 -2 0 -3 -3 3 6 -5 -2 2 0
1.51777 0 -3 2 -3 -1 1 1 0 -1 -5 -4 0 5 -1 6 0 -1 0 3 -3 1 2 1 -1 8 1 2 -7 3 -2 -2 -2 3 -3 -3 -1 -2 1 0 0 0 0 3 -1 -2 -5 0 0 -3 -3 -1 -2 0 5 -10 -3 0 -9 -4 -4 2 -5 -3 -4 2 0 -3 0 -2 -6 0 -4
1.48166 -4 0 1 3 -4 3 3 3 -5 0 -3 0 1 -3 -1 2 5 0 6 5 0 -2 4 -2 -1 1 0 -1 -1 2 6 2 2 -1 -2 -4 4 3 -5 -1 0 2 3 1 1 0 1 0 1 -5 4 0 0 2 -3 -1 -1 4 -5 3 0 4 1 2 -4 0 1 -1 2 -4 4 0 1
1.44503AlLKjUKk%KrRkTpJ1mKlQnJLmrQLlJLmKTnkMkQpJLqjLNj3J1k%mMLmL%JTLmjKj0J7r%jk%
1.41044cL%TJjJ%lMlnLjLJ%J%TnOk%jQj5LKjM%JT%k%LpPlPJmJpMkQj1J0pJj%NoMmJ%pP%TKkTQ
1.37584Fj1QnOpLjlKMk%LjlPp%lOjTKnLlJ0nkPo%MjpNpJ0l%kJPqQj4%J0jpQmlL%Pq%JPrLmJKLl
1.34176@Nm%j%LlJTmKJTnL%kJT%mJ7j2mLQqKnMk%OrONp%UKoM%TlLKOj0JVm%jL%MkT%TjTKJMklQ
1.30513Hj2QnRqLlLJm%TkQpJoMoJ4rLNnOoPkmNmjlLTmJNqJOlk%kJ2j0LKJmKJnOrJ3moLlPmkJkL
1.27105CK%ljJkMjlLJjPnOj0%PoJ%MpQoJTLToPo%TkJ1j3LJNnMjJlPqkRnlLKTl%TlPjJMlTOpKmJ2
1.23595A9pQrJ0j2N%NpNkqMmNj%OJTqJ0j8J6rMKljL%jlKLpLmMmJOln%JMpOjOj3lOLoJ1rJUknJ%J
1.20237CLn%TKlKkNnMlJlOnNk%OmPOmKJ%nJoKOqLTmoMnLnOpPmKoQoPoMTnk%Mo%LknNLMlNMNMKTn
$$ plain form
1.44503 1 -2 1 3 2 1 0 2 0 0 2 -7 2 0 -2 -9 2 -2 0 -3 5 0 1 4 0 -9 -1 2 -1 0 3 -1 1 3 -2 -4 0 -2 6 -1 0 3 -5 -6 -3 2 -11 0 -2 -2 -6 -2 1 -3 0 0 1 2 5 1 0 2 -8 9 0 0 -1 -3 -3
1.41044 -3 0 0 0 1 0 1 1 -2 2 -1 -6 -3 -4 -1 0 0 1 1 1 -4 2 0 0 -1 7 -8 -5 -3 -4 0 0 1 2 2 0 0 3 -4 3 0 7 8 4 5 -2 2 0 8 -3 7 0 1 0 0 5 -1 3 -1 0 0 -7 0 0 0 2 0 -2 6
1.37584 6 -5 3 -2 4 -3 0 -1 -4 -2 2 0 0 3 2 -1 6 -1 -1 -4 2 1 0 2 -3 0 -3 7 2 0 7 1 1 5 4 -3 2 -5 5 2 2 0 1 8 0 8 -6 -6 4 3 -4 4 0 -3 0 0 7 -1 -1 0 7 -2 1 -3 -2 0 3 0
1.34176 0 5 1 1 0 0 3 0 1 2 -2 0 1 2 -3 0 0 -2 -1 0 0 -4 13 1 -3 0 8 0 2 -3 1 -1 -1 5 -4 2 7 0 0 0 0 2 -4 0 0 0 -3 0 2 8 -2 -1 0 1 2 -2 -2 -3 0 0 4 2 0 0 0 -1 -2 0 1 5 3 0 8
1.30513 8 -4 4 -1 8 0 3 0 3 4 0 0 0 -2 6 -1 0 -6 -2 -8 6 -3 0 5 0 6 0 7 5 1 6 2 1 -2 1 4 0 1 6 -2 -1 5 2 0 0 -2 10 0 3 5 6 2 4 5 0 6 -3 10 6 0 3 0 7 3 1 2 0 3
1.27105 3 5 5 2 1 2 0 4 3 0 3 4 3 10 5 11 1 1 8 2 3 3 7 0 8 2 3 4 7 10 4 11 5 5 5 3 14 1 4 5 10 5 9 8 9 6 13 5 3 12 7 4 7 9 11 8 8 8 5 12 11 12 16 13 10 16 9 11 7 19
1.23595 19 12 20 11 21 9 14 14 19 12 17 15 7 11 7 12 11 11 17 18 19 11 21 3 19 10 14 16 13 12 15 15 14 11 13 16 9 12 8 12 8 9 15 12 7 7 8 12 5 11 10 16 3 0 6 9 3 14 5 6 7 8 6 1 2 2 3
1.20237 3 6 1 1 1 3 0 2 0 5 0 4 1 2 -1 5 0 5 3 3 9 5 12 18 14 16 17 17 12 13 7 9 15 7 10 13 9 3 7 2 5 0 6 -1 6 2 4 -2 6 0 7 1 5 9 4 2 2 6 0 0 3 1 -4 1 4 8 5 10 14 19 23 25 27 22
1.16524B2J0opJTloJTnqJ1qLmMlTJ%MoRj0LJkJ%LnPp%LoRkjLKmKJ0LqOMj3%KlRmolKj%KkMqPpM%
1.13115DmkJ0ojkKjlOnOmpP%MqMjKjOn%mPrOn%NnMJnNjTmJkTQnNJkNm%ToOLlNpMjMqL%jNjlOnkL
1.09453BkmMNnljNjOoJmjLlLTkMlJlL%kjPnKlkPn%kQ%j1MoPqQmMpJ2n%TMmqQ%NqJ0rJ0j1N%TojM
1.05993aJK%Mj0OqOKjlOmNm%JToOlKLjj0LNjkKOrkM%nQJkTPj1MmKLjLl%pQlLmOlMrMqJ6qKqOKjV
1.02382cMkLJpQmnJ0mlTN%TjKjkTMNn%mjOjJj%lNpJjNJl%JU%JnJKJk%KjMj2J0kmOk%lOnK%ljkOj
0.98770aMmnNlJ0rkMkJKmN%TkjljkPkJ0pmlLQpOmMpM%J%kTOoPjlNqQnmjKlMOnjKmMlKnLPo%Nl%N
0.95158EpLKmJn%NJ0j3LMmNn%kKnNlPlkJTjpjLTKlMjJnM%mTMJ2j3N%NqkO%LlkPojPoMlrOTkTlTN
0.91648akKlMLkTKk%JrRJjl%JQjj1J3j1PnK%jLlJ%TmMkj%L%TlLk%JlQqMkLjKlLjljRmklQ%noNlJ
$$ plain form
1.16524 22 32 26 19 20 21 18 12 13 14 9 1 12 4 7 3 7 4 1 2 2 6 0 9 -1 2 3 1 2 2 5 0 7 0 0 3 -3 6 4 3 6 8 4 6 16 19 11 17 21 8 8 10 7 16 12 6 3 5 4 4 6 4 8 0 7 0 4 4
1.13115 4 0 -2 8 2 1 -1 1 0 -3 3 -2 4 0 -7 0 0 4 -4 0 -1 1 0 6 1 1 -3 4 -5 1 -4 -4 1 -4 0 1 -4 1 0 -1 -5 -4 -6 -8 0 -5 0 1 -1 4 0 0 0 -6 0 3 0 5 -2 2 1 5 -3 0 0 -1 4 3 0 6 1 -1 2
1.09453 2 0 -4 0 5 0 -3 -4 1 0 6 0 1 -3 -4 -1 -4 -1 2 0 4 1 2 -1 2 2 0 -1 6 1 3 0 -2 5 0 0 -2 6 6 -5 -1 -7 0 -8 0 -4 0 -7 5 0 0 0 4 0 -8 0 0 5 -3 7 -2 8 -3 2 2 2 -4 -5 -1
1.05993 -1 0 2 2 6 -4 2 -6 0 2 1 -2 4 0 5 1 1 2 3 -3 3 0 2 5 4 -6 -3 2 1 -1 1 7 -2 -4 0 0 -5 3 4 2 0 7 -4 0 -4 -2 1 0 3 0 0 -7 1 -2 1 -3 3 0 4 -5 -1 -9 7 -1 1 -7 -1 1 0 -1 -2 -3
1.02382 -3 1 -1 2 3 -4 4 0 -5 5 1 -2 -5 0 0 0 -1 1 0 -2 -4 0 5 0 0 -4 -5 1 0 1 0 0 -3 2 -5 -4 -5 0 1 -2 -2 -1 0 1 1 2 -3 -2 0 1 -1 -1 1 0 4 -8 2 0 -4 2 0 0 -3 3 -2 0 0 -3 -4 -6 0 -1
0.98770 -1 3 -1 -6 -1 -4 6 -3 -5 -1 -3 -2 0 -4 1 1 1 -1 -2 -5 -6 -8 -1 -3 7 0 -4 -7 -4 4 -3 3 -1 3 -4 0 0 1 1 -1 -3 3 -3 4 3 0 5 -3 5 0 -4 -5 -3 -6 -2 4 -1 -2 0 -4 0 -3 -1 -6 -3 4 -2 -2 3 0 0 5
0.95158 5 -2 1 3 -1 0 -5 -5 0 10 -3 0 4 0 5 0 0 -2 0 -5 0 -3 4 1 -1 0 1 0 -7 -8 -5 -2 0 -3 1 0 1 -4 0 0 -4 -8 -4 8 -5 0 0 5 -3 -5 1 1 4 1 -1 6 0 -1 6 0 4 1 -8 -2 4 2 0 -3 -6 -1
0.91648 -1 -3 -1 -4 0 3 1 -1 1 -1 -1 0 -9 0 1 0 -3 -3 -2 6 5 -6 7 -4 3 -2 0 0 -1 2 -1 0 0 0 -4 0 -2 -3 -3 0 0 0 -3 0 -2 -2 -1 -4 4 -4 0 -2 1 0 2 -1 2 1 -2 -3 6 2 0 -3 5 5 0 -6 -1 -4 -3
0.88087cPjkPj3Q%lNMrjNJK%KqPpQlTLmJ0qkLJ1k0J0jTMlpJ4qmMJjMKkpOl%MqPlOkLMklOJTMjoK
0.84678A7m%jLjm%LmlMojJMpKLnLNJmjJLKmNnpRnqQLlQoOjlQj1J0m%nOlJTPj0nMlRolOmLr%JNoK
0.81168BljOj0PJKl%LmNn%LjkJ0j0%TKk%jLjTkKJK%Mj1PoKj%MkLlKT%qOlLnTJ0JlkmPj%TlM%pL
0.77760cJ0o%jK%kKnMmNmnMJlKRkmjJ%JK%oNkMj1J4qjJ%K%j0Q%kLnLkQmKoQj2J3oJMqMl%MTj4Rj
0.74402alRnknPKkmKT%JnLkKJjk%TLjlPmJ%KpJKmOJLqMlL%mOmMnJmJ0nLn%PmLkjoLlKMOorPLJTm
0.70740a%JjmQ%Orj%Lj0RoO%LqMpPjJoJOmJUjKjmJKJoKM%TnMJTj%JoMkPlLjrQj0QlNpNjJTjlLml
0.67077gKOmLnMkjRmjkKjJlMlKjKnMkRpTNjJLljTkMJlJlOjnKLKoNmMqPJrJ5rLJjnKNjljTMLlkOm
0.63414@KnL%jOj3MQmk%jnP%JjJKJnKrPJLoQm%jL%kTKklKJKJjL%lK%nkMlOkMpLl%MpOlnLjOkMkl
$$ plain form
0.88087 -3 4 3 1 8 -5 3 3 0 5 9 0 -1 4 5 7 7 9 1 8 1 9 6 3 6 2 12 4 2 5 16 -4 6 5 4 8 5 -2 12 4 0 4 5 4 8 10 8 1 7 4 4 8 0 7 4 10 8 11 15 13 10 16 17 18 22 21 15 17
0.84678 17 13 13 12 15 14 10 10 13 9 6 10 4 3 4 8 1 3 6 1 4 9 10 6 5 6 9 11 7 12 7 0 9 4 -4 4 7 4 12 6 12 11 8 16 5 15 11 11 6 12 9 10 11 18 8 3 7 4 13 7 4 10 6 9 0 0 1 6 0 2
0.81168 2 -1 -2 4 -6 1 2 4 1 1 4 0 5 0 0 3 2 0 10 0 0 0 2 0 0 -1 2 1 0 -2 0 1 3 3 7 -4 3 -3 -1 -2 -2 2 0 3 0 2 4 4 -4 2 -1 2 -3 -8 2 3 0 -2 -6 1 0 0 0 -3 1 1 -6 -3
0.77760 -3 7 1 1 0 2 2 0 2 -3 1 -3 2 -2 -7 -3 -2 -5 -3 6 4 0 -1 0 0 1 3 3 -3 2 0 4 -7 7 -1 -2 -1 -1 1 1 -9 -1 -1 -3 0 -5 -2 -4 4 0 2 -4 4 -8 5 -1 0 4 -4 0 -3 -3 1 5 -9 0 -1
0.74402 -1 -4 5 0 -2 -7 0 2 0 -4 -2 0 0 1 -4 -1 -3 -1 0 -1 -3 -3 -3 0 -1 -4 3 -1 0 0 2 -5 -4 -2 -6 0 1 4 -4 0 -3 0 0 -4 2 -2 2 -3 -2 -6 4 -1 2 -3 -3 4 0 3 1 0 -6 -3 -6 -4 0 6 0 -9 -2 1 2 3 -1
0.70740 -1 -1 0 -1 -5 3 3 9 0 -1 -1 2 -8 1 -5 1 1 4 -4 0 -7 0 -1 0 -6 -5 1 -3 -2 -1 0 -1 1 0 -4 -3 -1 0 -6 -4 0 0 0 -5 -1 0 1 0 0 1 -5 -1 -3 4 1 4 3 -6 2 -8 0 -3 2 -5 0 -1 0 1 0 -3 0 -4 -7
0.67077 -7 -5 1 -3 0 -5 -1 -3 -4 5 1 0 -2 0 -1 0 -3 1 -2 0 -1 1 -4 0 -2 7 0 -7 -2 -3 -2 1 -2 -3 -4 -6 -2 -1 -4 -3 -6 0 -1 -6 -4 -1 1 -5 0 -4 0 -8 -1 0 -9 6 -3 0 1 0 -5 -3 2 1 -2 -3 -4 0 3 0 -2 4 0
0.63414 0 2 -3 0 0 -1 5 -8 -4 4 0 -2 -2 -3 -8 -1 -1 0 -1 0 2 3 -2 0 -9 -2 -1 2 -4 4 0 0 -1 2 2 0 -2 0 -2 -5 -3 -2 0 1 0 3 3 0 2 2 -3 -5 -1 -4 2 0 4 -3 0 -3 -3 1 -6 0 -3 -8 -5 -6 0 -2 2 0 -3
0.59752cLJomJ0mJNkljMjljMlK%j%JKqPjKjUKjqPOj0OJLmJqRnLJkJmKMqRloQjT%MmkNlkKmPlj%J
0.56089@%oOljTPkmL%OoPqjJmMTlMrO%TnJ1qjKlPoOlnjRlLojMmKkTM%TJrJ2mkLjkK%jOpMpQjJMo
0.52477amNk%KkKNnOoj0J0nJ0j0MlLjJ%ljKNj1OMkJmJ2j1J%JjkOmKTklL%TjJVnKnOk%qJ2rN%jTm
0.49069gJ0qOqRoQm%jKTnjKMkKmKlM%nkJjNkTQmOmj0NOrNKknL%LnKkTNMmlPoJjL%kJ0pKlJjLjmL
0.45508@jJlKjKl%jLlNnPpLlMjkL%kPrQpMnNj0O%lJNTj2PKkoMLoPkNnKoM%JmLnOqOLpKMlLkTmMJ
0.41896b%TmkJ1kl%OmlLnkPoNnOjJpJ0jmkpJ2m%KL%kTLoMjKLjmLkT%M%KpKjLOj0nOLKkjLn%TLJm
0.38386cMlmPpRpMjKjKl%TLknJjKMj%kTKnRlLqOnLjlTKJ0mMlTJkKJlkPkJpQn%LlNlJlLKTmnOnQl
0.34723@klK%JjJjUlJ1%l%pKjNjkjMJkLmLkQj3kPlLNnMjlpR%lLKl%mNoLT%UqJ0%Jj1NnPJNolMLJ
$$ plain form
0.59752 -3 0 1 -5 -9 1 -3 -2 3 1 -2 -3 1 0 -3 -4 0 -3 -1 -1 -2 -2 -1 1 -7 0 -1 1 0 -1 -2 0 -1 -9 -2 4 -6 0 1 4 0 1 -7 2 -3 0 1 -1 0 -4 -2 2 -6 3 0 -6 2 1 0 0 4 0 -2 3 0 -2 0 -4 3 0 -1 -1 0
0.56089 0 0 -6 0 -3 -4 -5 2 0 -4 -1 -1 5 -1 6 -2 -3 -2 -6 -2 2 -1 3 -6 0 0 0 -5 6 -2 -3 -1 -4 3 -3 3 0 -5 -6 3 0 3 -3 -4 0 -4 -2 -4 -6 -2 -2 -2 -1 -10 2 -2 -4 -1 -2 -4 -2 -2 -3 3 -4 0 -7 1 0 1 5 -1
0.52477 -1 -5 0 -2 -2 0 -2 0 5 0 6 0 -10 0 -5 5 -5 -1 -4 -1 -2 -1 -1 -4 -5 -3 2 -9 -3 1 -1 0 -4 8 -3 -2 -2 -1 -2 -4 2 -2 0 2 0 -3 0 0 0 -1 0 1 2 3 -2 0 -5 1 -1 -1 -9 3 -6 -1 -1 -2 -3 -7
0.49069 -7 3 -5 1 -7 2 -4 4 0 0 -1 1 3 -2 -3 -1 3 1 3 -1 1 -2 2 2 -3 -5 -4 -5 0 -2 -4 4 0 6 2 -8 -3 3 -6 -1 1 -1 -6 -3 -3 0 -5 -3 -5 -7 -2 2 -2 -5 2 -4 -3 -4 -1 -1 -3 7 0 2 -1 0 -1 2 1 -3 0
0.45508 0 -1 0 -3 -1 -2 0 -3 -3 -4 -1 -4 1 -4 3 -4 -1 -4 0 -1 -3 0 0 -2 5 -4 4 -3 1 -4 1 -9 -3 -3 -6 -5 0 5 -7 0 2 0 -6 -2 1 -5 2 0 5 0 2 -4 0 0 1 -3 0 -5 1 -7 -1 2 -5 -3 1 -2 1 -1 -3 -7 -3 -2
0.41896 -2 -2 -2 -6 -8 3 1 -2 -2 4 0 -3 0 -5 -7 0 -6 -1 -6 0 -1 0 -7 3 2 -2 -4 -11 1 -3 -3 -1 2 2 0 -2 1 -5 -1 -2 0 3 2 -2 1 -1 -3 -3 1 1 3 -4 -2 -3 0 6 -4 -9 -3 0 2 0 -1 2 -3 -3 -3 0 1 -3
0.38386 -3 1 -2 -6 1 -6 3 -4 0 -1 1 0 2 -1 -1 -1 2 0 -5 -4 -5 -3 1 0 0 -2 -4 -2 -7 2 -1 2 -6 0 -5 -2 -3 -6 -9 -7 3 -1 3 0 -3 -2 -4 -2 -1 -4 -6 1 -1 0 -7 1 -4 -4 -1 -4 1 -2 -1 -4 -1 1 3 -1 -6 0 -5 3 0
0.34723 0 -2 -5 -3 -3 -2 -3 -2 -3 -4 -5 -8 3 3 0 0 -7 -5 -6 -1 -2 -4 -5 -1 0 -2 1 -3 0 -2 6 -7 -9 -2 -5 -2 3 -2 2 1 -2 -9 0 0 -3 0 2 -1 -1 -5 0 -6 -3 0 0 0 0 -8 2 2 3 -8 -3 -8 -1 0 5 -1 -4 0 3 4
0.31111DnOml%TjNklLJMoLkJpkMQlKnjTNlL%kmNKmOmLrOl%mKMlLlJ1j1Mk%K%nLlJOqPkTMkMpOm%
0.27499bKjJkJnQrQmLKNpJ%j%TpKNkLnOoJL%lLMj0Nm%OjlnRpPnKnQjTOlnM%mKJ%klOpKmQKoLkOp
0.23836dJ0j1OnMkJkKk%KjkNmKLk%jMmjnJ1rO%KoOlpOkMp%JOj0QLpjL%LkK%JkJk%KkTJ0qMrQkjo
0.20377hJ0mTLK%lNpOJMnlJK%j%joKNl%Po%LlO%nKpJ0%o%UKTn%TOkjlL%J%lJ0j1NqRnL%lkN%lMp
0.16816fNToKlkLKpOJKlnlJ1kmLTpLTj%oMOmlMlPj2RkjoJ0mNoK%j0J3j4J0mOkLnkOoNnNjTk%MlR
0.13459FojoPoNjNkrJ0oNkjTOlLloQlJmOk%L%lm%N%j%mNmNlkL%jKpLKjkOkoMkOrMkNMj0KLkPljk
0.09847bL%jKqNKjlTkQKkJLm%KjTmKTqPjOnljJ%JjMlK%oOoQj2J5mQrlPKm%j%mJ%JTjJTjLnL%jO
0.06286Ej1J0mMj4RlOklLKmnJOKkTMkMmLnOmJk%TjKkoLJNmNmkMjKnMKnjM%mLj0J3lOqJoQKoKJTj
$$ plain form
0.31111 4 -1 5 1 -2 -2 -2 -3 2 0 -3 0 1 5 -1 2 0 1 -6 -8 -4 4 1 3 -2 -3 -4 1 -2 1 1 -1 -5 0 2 -2 4 0 3 -6 0 -3 -3 -7 -5 -1 -4 -1 -4 7 -4 0 -2 -2 0 0 -5 -2 -5 -4 2 -6 1 -1 -3 1 -1 3 -4 2 -2 -2
0.27499 -2 0 -1 0 -2 -1 -6 2 -7 1 -3 0 2 7 0 1 1 0 0 0 -7 -5 0 -2 1 -4 2 -4 -3 0 0 -3 0 4 -6 -1 -5 -5 1 0 -3 -8 1 -6 1 -4 -2 -7 1 0 -1 5 2 -3 1 1 -3 -1 0 0 -2 -5 1 -6 -4 -8 0 2 -4 -1 -3 3 -4
0.23836 -4 6 -5 1 -4 0 -2 -1 -3 -1 -3 -3 -1 -2 -4 1 -3 -1 2 0 0 -1 3 -1 -2 -7 4 -5 1 1 3 -3 3 0 -7 -1 -3 1 -6 -6 -5 1 -9 -1 2 -5 -6 -3 -3 0 -2 0 0 1 -1 0 -2 -2 0 -2 -4 6 -2 2 -7 1 -1 -2 -8
0.20377 -8 2 -2 -6 -3 -1 -1 -4 1 -6 0 1 5 0 -3 -2 0 0 -1 -1 -2 -8 -6 -1 -4 -4 3 -3 -3 0 -3 3 3 -2 0 -7 3 3 -3 -3 -3 -3 -1 1 -4 -4 -4 2 0 -1 -4 -1 -1 0 0 -3 7 -4 1 -7 2 -3 0 0 -3 -5 0 0 -3 1 -6
0.16816 -6 -1 4 -2 0 -3 -5 -2 0 -7 -1 0 2 -1 -6 -9 2 0 -4 -1 2 -5 -2 1 0 0 -6 -2 4 0 -3 1 -2 5 -7 2 0 -1 -7 3 -1 4 -2 0 0 -10 3 -11 -1 -5 1 -1 2 -3 -5 1 -5 0 -5 0 -1 -2 -4 -4 0 -3 6
0.13459 6 0 -1 -7 0 -6 -1 -2 3 1 -8 2 -4 1 -1 -2 -3 3 0 3 0 -6 2 -1 0 -4 2 0 0 3 3 0 -4 -4 1 1 0 0 -4 1 -3 2 -1 -3 0 0 -1 1 -6 -3 -1 -2 -4 2 0 -6 -2 -4 2 -7 -3 -5 0 4 -6 -4 -1 -3 4 1 0 -2
0.09847 -2 1 1 0 2 -6 -1 1 0 -3 -6 -8 0 2 0 1 4 0 0 2 1 0 -4 -2 0 -8 -1 -2 4 -1 -4 -5 -4 -4 -3 -4 0 -3 -1 -1 -7 -1 -7 1 -11 4 0 8 -1 -4 3 5 1 1 0 0 -4 -3 -3 -2 -1 -2 -1 0 -1 2 -3 0 0 -1 5
0.06286 5 -6 4 0 4 -10 -1 -4 2 0 -3 0 2 -2 -7 -6 0 2 0 -2 2 0 4 0 3 -2 4 0 1 -1 -1 -1 -2 0 -2 -8 -5 -4 1 -3 2 -2 -4 0 -1 1 -4 0 2 -3 -4 0 0 -4 -1 -11 2 -1 5 -3 -2 -8 0 2 -4 -2 -1 0 -1
0.02827aJ%mKTlL%TJkTKMmpQj%mJ0nkLKkjLTkmnMlJkOnPnLkJNpKlQqLJkoPoOpNjJLrNnQlLkj%p
-0.00785a0J0mQmjTRnrOnKQnlkOjLmJj%lkNPj1NMlTjUJKOmkLOj7LTRrNmJLjoPMmoTJ5jnjMlL%Jm%
-0.04295cLnNJMlnNlNp%LTmJ1rlKmNjTKjKJrQrPjTLmKjKL%oLnM%LKoKoQnMmnNPqLkKJKqOk%kLJjJ
-0.07958@lKTOqMkTKkLqO%qQ%TMnjJnOjPjljqLM%mOJlTJUjOqJLJmnRkJpMK%lLJlRn%JknjMJMlmj%
-0.11722dNpMjnMT%TnNoM%lOjoPJk%MjrPjJjQqLm%Pj4J6j0JjUMTm%JqOlNKl%pPKLqJ0qk%JTj0J2p
-0.15182fPj%kTNJmkJ4j1Ml%TJmK%kPj2RpMTjkKToONrKmKlQrQj0J3rJKjm%LmOMnMLrmJ2j0KTkJlO
-0.18539ArPk%TjPmJ0j0kMkJTl%oQmNrNLTmJNmj%oL%JMkljNqQlLjTkj%LmJKJKjoLTKkjMlkJTLpJQ
-0.22151Ekl%KqOmNJqLJOmpJ3pRq%JT%qjJJ2pJpRpJ2j2LlNLmLj2P%JKoMTmlRojMlJmJ1j2J0rO%j%T
$$ plain form
0.02827 -1 0 0 -4 -2 0 -3 0 0 0 1 -1 -3 -1 3 -1 -8 0 -1 -1 -5 5 0 -2 1 3 1 0 3 6 4 0 -5 -1 -4 -3 -5 1 -4 3 -2 1 -1 0 5 -2 0 -3 5 -3 0 1 -1 -7 0 -6 0 -7 -2 -3 -2 1 -8 -3 -8 0 -3 0 -2 -3 -3 -10
-0.00785 -10 0 -4 4 0 -1 -2 7 2 -7 -1 -6 -4 4 -1 -4 -6 0 -1 2 -2 -1 -2 -2 -5 -7 -2 5 -6 -1 3 0 -3 -4 -5 -6 -5 -3 3 -1 -3 0 6 -11 -8 -5 4 -5 0 -4 -3 0 -1 -7 0 4 0 -6 -12 3 2 -3 -4 0 -3 0 0 1 -3 -3
-0.04295 -3 0 -5 0 1 5 2 -3 2 -1 4 -3 -3 0 3 -1 10 1 -2 0 -4 1 0 -1 1 0 2 3 -6 2 -7 0 -1 -2 1 -3 -1 -2 0 3 3 -3 0 -5 -1 -1 2 4 -2 0 -6 2 -3 1 -3 -8 -3 4 -4 -1 -3 -1 0 2 -6 0 -2 -2 -4 -1 0 -1 0
-0.07958 0 -3 -1 1 7 -1 3 1 -1 1 -1 2 -6 0 0 -8 0 0 0 4 -1 -2 -1 -6 0 -1 6 5 2 1 -7 -4 0 0 -4 2 3 0 -3 -2 -1 0 -1 5 -3 -2 1 2 -2 -7 2 0 1 -6 -2 0 0 -3 0 1 -2 7 2 2 3 1 -4 -5 -1 0 4 1 -3 -4 -4
-0.11722 -4 1 -6 -2 -3 -8 -4 0 0 0 -5 0 -6 -2 -2 -5 1 0 -6 1 2 0 0 4 3 -6 1 0 1 0 8 0 3 -1 -1 6 -8 8 -2 -1 -2 -3 -4 0 4 0 0 1 -7 -1 -4 1 3 0 0 -7 0 2 5 -3 7 -1 -3 -3 -2 -1 -11 1 -6
-0.15182 -6 1 0 0 -2 -4 1 2 -2 -4 10 -1 3 0 0 0 1 -3 -1 -1 -3 4 -8 1 -6 -2 2 1 -1 1 3 -3 3 8 -1 1 -3 -1 -4 4 -5 3 -7 6 -3 -2 0 -1 -5 -5 -2 -6 0 4 -1 3 6 -3 -7 5 -5 -3 -1 -3 -2 -5 1
-0.18539 1 -8 -1 -3 -3 -3 -4 3 -1 9 -1 -3 1 -1 0 1 -2 -2 -8 0 -4 1 -8 -3 0 3 -1 0 5 1 0 0 -6 -3 -3 -2 2 0 -3 -4 1 -7 1 -2 1 0 -1 -3 -4 -4 -1 -5 -4 -2 -1 1 0 -6 -3 0 2 0 -1 3 0 -2 -1 0 3 -4 -3 5
-0.22151 5 3 0 0 2 -6 0 -4 1 2 -6 -3 -2 4 0 -7 6 -1 8 0 0 1 2 2 -6 -7 -6 6 -1 0 -7 2 -5 7 -5 -2 -5 0 3 -1 2 -10 -3 -3 -2 0 -6 -2 2 -2 -5 4 -2 -3 1 -2 -1 -5 6 -6 4 -5 1 1 0 0 0
-0.25509@mPm%Kk%LJjU%kJ%MmPoNpjJ0pqMoJ3oLoMqLPKlJ%Ukj%LjJTlNj0PlJKlKNoKMlnQklMLj0O
-0.29120BpQkRj4Qm%TkJmRnkLkJjKJl%KLmTJPj1J0%K%nknN%TJ1qrJ1kJj%mQo%lNJ0j5MoP%JjkOmK
-0.32478Bj1J3qOJrO%kTMk%KTmnNKjJlJlOnM%TKm%JT%jULj2RNkK%k%J%kmJKTmLmMLKnjJlKLkKmJj
-0.36090cQm%pNmjPlPnOj0Kj%L%k%lRj3OmPmKTjJoN%J%oNJjKmMLm%UjTQj0MlPj3OjMkKjJjk%LmJL
-0.39651@ljKkJ1j1NjTJk%JLlLTmkNmJKjmJkL%jkLlkPj3J5n%TlJ%KrJ3j2OlOlJ0j2MJNrMjTlOpNJ
-0.42957@jkNkjlQpL%Mj1PqPnLkNpJ3pnM%Pj1RoNjmNmKnN%K%pKLTr%kRoNKnL%j%KJlJLqNLoLJnMk
-0.46518bJkJkKJkKlM%TmJlJ0mnLjNnJLkl%jJ3qTJ5pkNJpnPjlRmKlnMnQlK%jTK%kmOmRn%KmNrLJ%
-0.50079bLTlrOLjnNlOljkKlPmKLlmLmJ0pKpNnLTKlkL%Kk%jmPklMlTLjT%JKkLNplNmJ1j0LlQqjM%
$$ plain form
-0.25509 0 -4 3 -1 -1 1 -1 -1 2 3 2 1 0 0 -2 -1 -1 3 -1 6 0 5 -2 -3 7 0 -8 -4 -10 3 -3 0 -6 -2 -10 -7 0 2 -1 0 0 0 0 -2 -3 -3 0 -1 0 1 -2 3 -7 0 -3 -2 0 -3 -1 4 -2 0 4 1 -4 4 2 -1 3 6 -4 2
-0.29120 2 -5 3 1 10 -4 4 0 0 0 -2 -1 -5 4 -1 -3 0 -2 -1 -2 0 1 -2 -2 0 3 -1 -5 -4 3 -8 2 2 4 4 -1 -3 -8 -3 -3 -3 8 0 -9 2 0 1 0 0 -4 4 -2 -2 -5 0 10 -5 -1 -7 0 0 1 0 -2 4 0 2
-0.32478 2 -9 4 -4 2 3 -6 0 0 -2 -4 0 -2 -2 0 2 -2 -7 -2 0 -1 0 -3 -2 -5 1 -4 0 0 0 2 -2 -2 -1 0 0 -1 -2 -3 0 -12 -3 2 0 2 2 0 0 1 1 -1 -5 -4 -2 0 -4 -1 -5 -1 2 4 -1 -2 -1 -4 -2 1 -1 1 -3 -2 -3
-0.36090 -3 5 1 1 -6 -1 -5 -6 1 -2 5 0 6 -4 -2 -3 -3 0 0 -2 -2 -5 4 -9 -3 -7 0 -4 -2 0 -1 0 -6 -1 -1 0 0 -6 -1 0 -1 1 -3 1 4 0 0 0 0 -1 -2 6 -4 0 -3 4 -9 -3 -4 0 -2 0 -1 0 -1 -3 -3 0 -4 -3 0
-0.39651 0 -3 -4 -2 -4 7 -4 1 0 -1 0 -2 -2 -1 2 -1 2 5 1 -1 4 0 1 3 2 -2 -1 -3 0 0 -1 -3 0 -3 -5 2 -11 4 -1 -1 -1 -4 -3 -3 -1 -10 3 -9 -3 -6 0 -3 7 -5 -1 0 5 -4 0 -1 -2 -5 1 -6 -1 0
-0.42957 0 -1 -3 2 0 -1 -4 4 -3 0 0 4 -7 0 -8 -1 -6 -3 -5 0 -7 6 -1 -6 -2 -2 5 -6 3 -3 2 1 -3 2 -2 0 -5 0 0 2 2 -5 -3 0 3 -6 -6 -8 1 -5 0 2 -3 0 0 -1 -1 1 2 -1 0 3 -5 0 3 -3 0 1 -4 0 -2
-0.46518 -2 -1 -3 -2 -4 -2 -1 -3 -1 -4 0 0 0 -4 -3 -6 4 0 -5 -2 -3 2 -3 -2 1 -1 -4 -4 -5 8 0 -8 7 0 -2 3 4 -3 -8 -1 -2 -5 4 0 2 -1 -6 -2 -7 1 -2 0 0 -1 -2 0 0 -2 -6 0 -4 5 0 0 2 -2 3 -6 -3 -2 -2
-0.50079 -2 1 4 1 -8 -2 1 0 -5 0 -3 3 0 -1 -3 -1 -4 3 -1 1 4 1 -3 0 -4 6 -1 1 -6 -1 -6 -3 0 2 -1 -3 0 0 2 0 0 -1 -5 2 0 -3 1 -2 -5 -2 -3 -4 -4 -3 -1 -3 0 5 -2 -5 0 -4 7 -3 0 -3 5 -3 -4 0 0
-0.53640@MoOm%oJ2qNokMj%KoNJoRKrMjNnk%jM%nNJojLKmKPpNlJlLlL%jTnQmJ2j0%ljL%K%lJK%J
-0.57150Aj0QPpJjmNkTJ1j1%jN%MnJqJ0qMlM%mJ0nkOnNj0QpNnMpQ%LoKJ%rJ1j0J0m%LlMkTlNJlKj
-0.60406aLokLK%jmOkLkLmJjJ0nkTJnMrRJ%Omk%TkjkN%TKlJj2J1JTp%OmjJOjmPmLpJ2qLj5R%jJOm
-0.63865aoJ0nmJ1njQj0Qj4QjMkMmMLj4Q%lJUMj0LJLjMj1J0m%jkoRJjmM%LljmOLnJmJTjTJ1rKjJN
-0.67172EmTPmomRNlJoQj0RrQmOrNjlLT%mQj0J1q%j0LNmRjTk%jL%TkLkJKkKJnlNpQj0J2lKlKkKTl
-0.70580@mOrNKjl%LOj0PjTMpPmjMljKk%j0RKTJloLToRmOoKjkJnMTk%NlklOolKPmjNk%joOnOKjkl
-0.74192cN%nL%kLjLoKjMmJOj3RpOlK%KTmLkOknJ%TkJjQLj4KTlJ%kNlJKLl%jMkpPj1J0PJj1LmMnl
-0.77651hJ4j0jKkKUnQpQn%qJ0nkMmJ0q%NljTLnM%JMj0J2rMjkJnPJjqOjKkJPr%TnP%J%Pj2jRqNlL
$$ plain form
-0.53640 0 4 -2 4 0 0 -6 6 -2 3 -3 -5 -1 -2 -2 0 -6 -1 0 -6 3 5 -4 0 -1 4 -1 -3 -3 -4 0 0 -5 0 1 -5 -6 -3 -1 -5 -3 4 -3 2 -1 0 -3 0 -3 0 0 -1 -2 -7 1 -3 9 -1 -1 -4 -5 -2 -2 0 0 -3 -2 0 0 1
-0.57150 1 -9 -1 6 -1 0 -1 -5 0 -2 -4 7 -4 -4 -5 0 0 4 -1 0 -8 2 -6 -2 -5 -1 -1 -5 5 0 -2 4 -1 4 -6 2 -5 0 -5 -1 -8 0 0 3 -3 -1 0 0 -9 2 -8 2 -2 -2 1 -2 2 0 -2 -5 0 1 -2 0 -1
-0.60406 -1 2 -4 -6 -3 -1 -1 -2 -6 0 -2 1 -1 2 -2 -1 -2 8 3 1 -1 0 -5 -1 -10 -1 0 0 6 2 0 0 0 -2 -3 -5 0 0 0 2 -1 0 -12 -1 0 1 -6 -6 0 -4 -5 -4 2 1 -3 4 0 3 -4 8 0 3 -12 -3 -3 -4 -3 3 -1
-0.63865 -1 -7 3 -2 -6 5 0 -1 7 -3 5 -9 -1 -2 2 0 4 0 4 7 -7 1 1 -2 -1 0 1 5 -5 -2 -1 2 1 5 -6 4 0 0 -1 -3 -9 0 1 0 -4 0 0 3 0 -1 -5 1 4 -1 0 -4 -3 -2 -3 -4 7 -2 0 -1 0 5
-0.67172 5 1 -3 4 0 -6 -10 -1 4 1 2 -4 4 -6 3 -6 2 -2 4 -5 0 -1 -4 -1 2 2 -2 6 -4 7 -1 -1 -11 -8 -3 -7 2 1 0 -2 -2 -3 0 0 0 -2 1 -1 0 2 0 2 3 -2 -5 0 -7 1 -9 3 0 2 -1 1 -1 1 3 0
-0.70580 0 -4 2 -7 -2 0 -1 -4 -4 -1 5 -5 2 1 0 4 -3 4 0 -1 3 0 -1 1 -1 -1 -11 -2 0 2 3 0 -6 -3 0 -6 3 -1 5 -1 1 0 -2 -1 -6 -2 2 0 0 5 2 0 -3 3 -3 -6 -4 3 -1 -2 3 1 1 0 -6 0 -5 1 3 2 0 -3
-0.74192 -3 2 2 -3 0 0 -2 1 0 3 -3 -1 -2 2 -2 -1 5 -8 1 -6 0 -3 -1 -1 1 3 -1 2 0 6 4 -1 0 0 0 -2 -1 -2 6 9 -5 -3 -1 -4 -3 -3 -5 0 -3 -2 0 3 0 0 -1 3 1 -6 1 -10 0 7 8 -3 0 -4 0 -5 -8
-0.77651 -8 6 -4 -5 -3 -5 -3 -1 1 -4 4 -3 5 0 0 -8 2 -3 -5 -1 -5 5 -3 -3 2 -1 -2 -3 0 -5 -1 -1 0 4 -6 6 -3 1 0 -2 -1 -6 1 2 1 -7 -1 -2 0 -2 -1 6 -3 -3 -3 -8 -1 -1 0 0 7 -5 -6 3 -5 0 -3 0
-0.81060@nOpOLj4RmLTM%pLoOKJqNOn%LNj0J%JKqJ3j1NmjKnLJKjKjK%mlQ%j2MLTJmJMqMmOlKNo%j
-0.84519bMj1QpQjKoKLNj0OkKoMkJoJ3nmP%l%kKkMjMrNnLkKlQml%QpKpJ0oLNkj1Pj0J2kJkjLJlPm
-0.87877AJm%OrjJ3mnlRJnok%J3j0PmkJjTLKkPrjOLqlKQJmnLrJ2nRpPpNjqPljNoRpLjTJKkMrPkKm
-0.91387bMkKNj0MKLj3J2j1J1q%mNJKjRj6OmQlkJl%OjMqPqMoOjqQJKmOrQrOnQkjnTQOj1Pk%MKnlKT
-0.94795@%kTLmNlOpM%NjmjOj1PlJKmLMpQnLoLOoKTmkKlLqPJmQojKNln%jNKTpLMmLmMjl%LlJmKTL
-0.98458CoJL%qNlKTjKlJ2j6NjTRrMoJ2rkRoOj4J0oOj%JJ0j2%KnMJj1J1%kNlpOKJkMnPrQj0KLnOn
-1.01663dRnknRLqOpjQnOpOlLl%l%JLToKkJk%JmQlkNpPnLJjMrN%rLJJ3j7J3nJ%UkKj5J8oLlMJkTj
-1.05173c%jKJlOj%kLjJmkjMoPkLjnNLqKLrJ3pNnMkK%j%JmLjMoNj0J0nLjmNnOmOoLjLj%jTJLoPnQ
$$ plain form
-0.81060 0 -5 1 -6 0 3 -11 -2 -6 -3 0 4 4 -3 0 -6 0 2 3 -5 0 6 1 1 4 9 -1 0 0 1 3 -5 8 -3 2 -2 -3 -1 -6 -3 -2 0 -1 1 0 2 2 -2 -5 3 3 -9 -5 -2 1 2 -2 -1 3 -5 -1 -5 1 -2 0 5 -1 -1 -2
-0.84519 -2 2 -9 -1 -8 0 -1 1 -5 -3 0 5 -5 1 -1 1 -5 -1 -3 -2 -8 5 0 -4 3 3 0 0 -2 0 -2 2 1 5 -4 1 -4 -1 -3 -1 -4 4 0 -3 -3 5 -2 0 -7 3 -3 0 5 3 -8 -1 -11 1 -1 0 -2 -3 0 1 -2 5 1
-0.87877 1 2 -2 -2 4 -5 -6 7 3 -2 -5 4 5 0 -6 -8 -8 5 -5 2 -2 -4 -3 -4 -5 -2 0 -2 5 -4 -5 1 4 -4 -7 -5 3 4 0 -5 -2 -11 1 -4 5 -2 5 -2 3 2 -6 1 -2 -3 2 -4 5 -2 1 0 -1 0 2 0 4 -5 2 0 2 -2
-0.91387 -2 2 0 2 7 -3 1 3 6 -7 5 -6 5 -3 -3 -7 -2 -1 1 0 9 -7 -1 -5 3 0 -2 -1 -4 -4 2 1 5 -3 4 -4 0 -6 0 -1 -9 -1 0 2 -2 4 -5 3 -6 0 -5 3 1 0 -5 -10 -2 4 -7 0 -2 -2 2 4 -1 -4 -2 0
-0.94795 0 0 -2 -4 -1 -5 0 -3 3 -4 0 0 5 4 0 -1 5 -6 1 -2 -1 1 -3 0 4 -3 5 0 3 -3 0 6 0 2 4 0 -2 0 -3 0 -8 -1 0 -4 4 -2 -3 -1 4 1 -4 -4 -5 0 2 4 -3 0 4 0 3 -1 3 2 -1 -1 2 -1 0 -4 -2 0 3
-0.98458 3 -3 -2 1 1 -7 -2 -5 -3 -1 -2 0 -3 9 -7 -2 -3 -4 5 -4 0 -6 6 -3 -5 4 -2 4 -10 0 -6 0 -1 -1 0 10 -2 -2 0 -5 -1 0 -11 0 0 -2 3 0 -7 -1 1 2 0 4 -1 6 -3 5 -5 -3 0 -5 1 -4
-1.01663 -4 5 0 -2 -7 2 5 -3 3 -4 -5 3 -2 4 -3 3 0 3 0 0 -3 -3 -2 1 4 -2 0 -2 -1 -3 -3 -2 -6 2 -1 -3 2 -5 2 -3 0 1 0 4 -5 0 0 -9 -6 -5 8 -9 4 -1 0 0 0 0 -2 0 -15 3 -3 0 -3 1 2 0 -2 -3
-1.05173 -3 -3 -4 -2 -1 -4 2 1 1 -1 2 1 2 -2 -4 -5 -1 -7 0 -2 1 0 -5 0 3 -5 -3 0 -9 4 -3 2 -3 1 -1 1 1 0 0 1 -3 0 -1 3 -3 2 -8 2 -3 0 -1 -5 0 -5 1 -3 3 -3 0 -1 2 1 1 0 -1 0 3 -3 4 -1 7
-1.08734Gj0LoOJNjnlNj6QOmKLkLjlMj2QPojmP%kKmOqKjKMJplPLo%KJKmTMjJMlnO%JkNmjKpJ0pNm
-1.12244bM%kjKj%UrJ0Jj%JoOkjLpNlMnK%TKjTlNLlkj%jKToOKkNj7J2%m%RKj2LK%MmjJkLklL%TOm
-1.15805AOj4OKjJpKjN%mKPoKrLTK%lJ%KlMKTpNj1MKMnOqJUOnJnJ%Qk%jT%kQj4OmJKLmJkOJk%qJ4
-1.19366FrMjMkTJjmTPJKnNrJ1jmMjnLKMj0MjNnlMjTKnRqPlLqRrJ0lojN%kmJ0jKklJlLkMKnPlj1Q
-1.22825Aj%MlJmLKoL%KoMmQqNjljMnM%MJmkRplLnMoLM%ljMlLlN%Jn%Njj0QMnMoL%Tj%JTj%UkNjk
-1.26539@MrnPJjQnljkNOj4J0koLMJoNkMmNoQqkPljTJkMPj4PlMlK%oPj%mLOj1%Oj%Oj2PnJ4j4P%T
-1.29896BkL%oNmKkjoPqRlMjKjmOmMjl%RqJ%TjLkLrMKoPNkj0JMJ%Mq%MjLmMKrjOJjKTpOlMjTklJj
-1.33559cLlkKQj1POkqOl%LlkKjJ%k%jLTmJMnQmoQj0J1j3J0mKj%J0j4%TNLMj1PljTKjMpL%Oj0LjK
$$ plain form
-1.08734 7 -3 0 -6 0 1 6 5 0 -3 2 -14 -6 0 -4 -2 1 -1 2 1 -2 2 -10 -2 5 -1 -2 -6 1 1 -1 1 -3 3 -5 -3 -4 -2 2 3 -4 -7 0 3 -3 -3 -1 0 2 -2 -6 -2 -3 -2 2 -1 -6 0 0 1 -1 4 0 -1 1 -6 4 -3 2 -2
-1.12244 -2 2 2 0 -1 1 0 0 0 0 -9 1 2 1 1 2 -4 2 0 -1 2 -5 0 -3 1 -4 -2 -2 -2 0 -1 -2 -5 0 3 0 -2 -3 -3 -4 -2 0 -6 0 2 0 5 -12 0 0 -4 -4 5 7 -5 -2 0 0 4 0 -1 0 -2 1 -1 -4 -1 -1 -1 5 1
-1.15805 1 7 -7 -1 1 0 1 -6 -4 -5 0 0 -4 -2 5 -1 1 -8 -5 -2 0 0 -3 -2 -2 0 -3 1 3 5 -2 3 -8 -4 -2 2 -3 3 -5 -4 -3 -2 4 -1 0 -5 -4 -4 4 2 2 1 0 0 -2 6 -8 -2 -6 -5 -3 0 -4 -3 -5 1 2 0 0 -8 6
-1.19366 6 -3 1 0 4 2 0 1 0 -4 -8 -1 0 2 -3 2 -7 4 3 -1 3 2 -3 0 2 6 -4 0 -1 4 -1 -4 0 -1 -2 0 -5 4 -4 3 0 3 -5 4 -5 5 2 -4 -5 0 0 -2 -6 4 3 5 3 0 1 -2 1 -1 3 5 0 7 4 -7 1
-1.22825 1 0 0 4 1 2 -2 1 3 -3 0 0 2 -4 0 -4 4 -4 1 0 -3 -4 0 -5 -1 -1 3 4 0 -2 7 0 -3 0 -5 -1 -7 -4 0 0 -3 -4 0 -3 0 -3 2 2 3 -2 -2 3 2 -8 0 4 -1 3 -3 0 0 0 -1 -1 0 1 0 0 0 0 -2 3 2 0
-1.26539 0 4 -5 -10 -3 -2 -3 5 0 -3 -4 -6 -1 5 -9 1 -1 -7 -4 0 1 -5 0 -2 2 -2 3 -3 5 -3 -5 2 -1 -2 -3 -2 -4 0 7 -7 0 -3 1 -2 0 0 -6 1 0 0 -4 -1 5 -6 -6 0 -1 -1 5 -7 0 -5 9 -5 2 2 2
-1.29896 2 0 3 3 -3 2 -2 0 -2 -3 -9 -2 -10 -1 -4 0 -1 1 0 -4 2 -2 2 1 -2 -2 7 -1 0 0 0 -1 2 0 3 -6 -2 0 -6 1 6 4 -6 -5 -1 0 0 4 -4 -4 0 -1 2 -2 2 4 -5 -6 0 1 0 2 4 -3 3 0 4 3 2 0 -3 -2 -3
-1.33559 -3 0 -3 -5 -3 5 -6 1 7 5 -3 3 0 0 3 0 -2 0 -1 0 0 -2 -2 -3 0 3 -1 0 4 -1 7 3 -3 5 -5 6 -7 3 -1 1 0 0 10 -4 -4 -4 1 4 8 -3 4 1 0 -1 1 0 4 -3 0 0 6 -4 -1 -2 0
-1.36815@oQlKlrJ1%nOLm%KjkKoJ4roL%TOnMmLn%MTrOnNKlKnMrPJTmQqlRnNnLlJm%Q%p%MQq%LnLn
-1.40427dNkJ%njOMJKj2J1njmJMjkK%TjJMjl%MlQj4NKJl%mNKMj0K%KjpLMRqoNklMNmJjlpOTnLjRq
-1.43937@KrjJ2mlPojKlJTOmJoJ1oNnMojmJ2jpKmNkMkTO%moQ%TqLJJ0pqJTjONnmLkL%pRkpLMoO%l
-1.47447cLnLKkNqO%pJ3qMj4J5mkKTj1PTlkKl%MlLpMKjMoKLnJkoJ1JlpkPJLnNoJMlnMTKj0J1nlm
-1.50753gJ3jlTM%Nj2MNoPnkJKkMr%TK%kMkL%J%m%jPqLJ%NlkKj%nRm%j0NPLnjTMLj3J2mkjNj0QqJ
-1.54162gPOlo%J1j0JkRnMlLpKTl%ljLKkJjKJkJnJ1oLj0J0mJKqOkK%LmMlJlKMjmTKOkNkTmMpL%Kl
-1.57621cLMmLOqoJ1pkMJkm%OlJ%JnNpPlK%jmjJ0oOrRmoLJTj%Nj0RnQlojMLJ%mkL%TlK%mLjJ%JqQ
-1.61182ajQj0jTM%lM%kKjKnN%j%TJTjKj0J5olNrRpPlj%JPj7QnJ0rJ0oKlL%kOn%LK%pMlLnLKlMlM
$$ plain form
-1.36815 0 -6 2 -1 1 -2 -11 0 0 -5 1 4 0 0 2 1 -1 1 -5 9 0 -6 -3 -3 -3 3 -2 2 -2 1 -4 -4 0 4 -5 1 -4 1 3 0 2 -3 1 -8 -1 0 1 -3 5 -3 -6 3 -2 3 -2 1 -2 -1 -5 -5 3 3 -4 -4 0 8 0 0 3 -2 1 -4
-1.40427 -4 1 -1 0 0 -5 -6 0 4 5 7 -5 6 1 0 -4 -3 1 0 -2 0 0 0 -1 0 4 3 0 0 4 1 9 -5 0 2 3 0 0 -4 1 3 7 -3 -1 -1 1 0 -7 -4 0 9 1 -5 0 -2 -5 -1 4 0 1 0 -3 -10 -4 2 -3 0 -1 8 0
-1.43937 0 2 -7 -8 4 0 -3 4 -2 -3 -1 -4 -3 -2 4 0 1 -5 6 0 5 0 4 -2 -3 -7 5 4 -3 -1 -5 0 -2 2 0 -2 4 4 0 -6 2 2 2 -6 -3 -2 8 1 -7 -6 -5 -6 0 5 0 -4 -1 -3 0 0 -7 2 0 -7 -4 0 -6 0 0 -3
-1.47447 -3 0 -5 -2 0 -2 3 -5 1 1 -6 7 -1 3 -11 4 0 -2 0 2 -9 -2 5 2 0 2 -1 -1 3 0 3 -4 0 2 1 5 -1 1 4 -1 0 -2 -8 3 4 1 -6 -8 -1 0 3 -2 3 -3 -2 2 -1 -6 -2 2 4 -6 5 0 -3 -7
-1.50753 -7 6 5 2 -1 3 3 8 -4 0 5 -1 6 1 -1 0 2 0 4 -5 -5 -5 -3 -3 -5 -1 -3 0 0 1 1 -3 -3 -4 3 -5 -2 -1 -1 4 1 -1 1 0 0 -5 4 0 0 -10 -5 2 5 0 -1 -2 2 5 -8 4 0 -2 -3 2 -8 0 -8 -7
-1.54162 -7 0 6 3 -3 -3 8 -2 -1 -3 6 1 5 2 5 -2 0 2 -1 -1 -4 -5 -2 0 -2 -1 -2 0 1 -1 0 -5 6 0 3 -7 3 -1 0 2 -6 0 -2 0 0 3 -1 3 0 1 -2 0 4 3 -1 -5 -3 3 1 6 4 2 -2 2 -5 -2 -2 0 -3
-1.57621 -3 0 4 0 3 9 1 -5 6 -1 -3 1 2 0 -4 -4 2 -1 0 0 1 -4 1 -6 1 -2 0 0 -1 -5 -6 4 -2 4 -5 4 0 -6 -3 -2 -1 -2 -2 3 -7 2 -3 5 2 -4 -5 -1 2 3 3 -1 -3 0 0 0 -3 -1 -1 -5 -2 -3 -2 -2 -1 -9 -1
-1.61182 -1 -2 6 -4 -5 -6 -2 -2 -5 -1 -1 -3 -1 -2 0 -5 0 0 -1 -1 -1 0 1 0 2 -8 7 1 -2 3 -6 3 -4 3 0 -1 -1 0 7 -10 -2 -7 3 -6 4 -2 0 -3 0 0 -2 4 -1 -1 2 4 4 -3 1 -2 1 -4 -1 1 -2 2 -1 3
-1.64590CoN%KmJoNKjTK%joQMpMj0Oj%KjLj0J4oQj0oOkLMNj2J1j2PlJKkTnO%MpKLklkN%jm%NMmTO
-1.67948BqPmKkLTpMlJ1nlnJMJkTLKnLTKj5J5j1QmOj2J2nJ0j0J%njO%lNj4R%NJoOkjlKlOjKkmNKl
-1.71204AoJ%LT%UoL%nO%KjkJkOjkqPkKOpJ%KlnRnMkjlPmPoOj3J1nkMLnKjnJ4rpJ0JqMkQkJnJkKT
-1.74765CjkjkMJlJ%OqjMlNKnklOnMNqMKTrJ3j1MoRnOKpjKJ%rRmMolOKJmJlQnkLjm%lNLJl%KM%nT
-1.78376ePj1QNp%JjPmNmJTlJnLJNJ%qOrRmJj%JT%jLmTNJmMk%jLTlkjNnKj%KjmMmNkLKmkJjJ0oOr
-1.81988@%jKl%Kj%JmJ2mJqKMJmJlKTJoJLNoNnJjPj0LjLk%nOpOTj1jOklJKT%mMlKMLj1%lJJ0Jkjm
-1.85447cK%jnJ0lNnJjLlPlLj4LJTKlLKjTlkjO%MmTPkJlKkjLKlL%TjknJ1lkKqQ%qKPnKJTmLpPJlk
-1.89008bJT%MoMlNnmKPj1OlMmJ1nTJOMoMo%kjQnjkNjklkNMKj2J5plTLJKnOkKkLrO%j0J0JjLToMq
$$ plain form
-1.64590 3 -3 2 2 4 0 1 -5 0 2 1 0 2 2 1 -5 3 7 0 4 -6 0 -1 -1 1 0 3 -7 7 1 9 -1 -7 -1 -3 0 4 9 -3 8 -4 3 0 1 3 1 -1 -6 0 0 4 -3 -1 2 0 -3 -5 0 0 -1 -5 -5 0 4 0 -4 2
-1.67948 2 -6 1 -3 -1 -3 0 3 -4 0 -3 8 3 0 -5 -4 0 1 -1 -3 0 2 -3 0 3 5 -10 5 -6 2 -2 4 -8 4 -1 9 -1 0 0 -5 -6 0 0 -3 2 -12 -3 -3 2 3 -3 3 1 0 -3 -1 -4 2 1 3 1 -3 2 4 1
-1.71204 1 -5 -4 -4 -1 2 2 2 2 -4 -1 -1 -6 0 0 2 1 -1 0 -2 4 3 1 -7 0 -2 0 6 -1 0 0 2 -1 -6 3 -2 2 0 -1 -4 3 -1 6 0 6 -7 4 -1 -3 1 4 -1 1 0 -5 9 0 -7 3 4 -4 0 -2 6 4 5 0 1 -1 1 3
-1.74765 3 2 0 -1 -3 1 2 -1 0 0 6 -2 -3 1 -2 3 5 0 -2 -5 1 -4 0 5 -3 1 3 5 -4 9 -2 2 -4 5 0 6 8 1 0 2 3 3 -6 3 -1 3 -3 -6 0 2 3 -1 0 -3 5 0 -2 1 0 -4 -4 -7 -2 1 2 -1 -1 1 5 5 0 -5
-1.78376 -5 2 -9 -1 4 -3 -3 -2 -3 4 0 5 1 2 3 0 1 -4 -1 0 5 6 6 -2 4 -5 4 0 1 0 0 1 2 2 1 4 0 -4 1 2 -2 2 0 0 -1 2 5 2 0 -1 4 -1 1 0 0 2 1 -3 1 -3 2 0 3 5 1 -1 0 -1 9 3 9 0
-1.81988 0 0 -1 1 -2 -2 0 -1 -1 0 -4 8 4 5 -3 -1 3 4 0 1 -2 0 2 3 -3 -2 1 6 0 5 0 1 0 7 -3 0 -1 2 0 0 -5 1 -6 0 6 -5 -6 0 -2 -5 -4 -2 0 0 -4 0 -3 -1 3 6 -5 -5 -8 -7 3 4 2 1 -3
-1.85447 -3 -1 -1 -2 -7 3 0 5 0 1 0 3 0 7 4 7 -7 -4 -3 -2 0 -3 0 2 1 0 -3 -5 -6 0 0 4 0 -4 3 1 2 -1 1 -1 -2 1 3 0 3 3 3 2 0 -5 6 3 1 3 -5 3 3 -5 -3 4 -1 1 2 3 -1 2 -5 2 3 0 -2
-1.89008 -2 -1 0 0 4 -2 2 -1 4 -1 -5 -3 4 -7 -1 -4 0 -4 7 2 -3 -2 4 8 2 6 0 0 -2 -3 5 0 -1 -3 2 1 -1 -4 -6 -1 3 5 -7 8 1 -2 -5 -2 -1 1 -4 2 0 2 0 3 -6 0 0 -10 0 1 0 3 6 0 4 -4
-1.92417dLJkKMjq%PmlN%jJ2j2JkKjPo%JToRpLjJj%NpOm%jNmkMkTJPrL%lJ0j0Qj0NkMkLnNnJKMjn
-1.95876aNnkLJjPp%Oj1LPnkJTRj0kNoMJ%J%kjKoJ5j1NnLJknTRjLlJLJjlmOkLkTLjTMmnOTrOqJ2
-1.99284Hj1LNn%MqNljTL%LkK%TpNTnOoJ0j6J0JlJnK%J%MnKkQj3MoQo%OoPoMlkJ%J3j4KOlMm%K%k
-2.02642@LoLTmLkLnJkLT%jLj0NpJ2kTljLmJ0j0MkKjJTmJ3qlKj%jnOKjkOpkNJnO%moJ3rNlk%NlnM
-2.06050b%K%LlNnKmK%lLTkMopLKQ%nLkJKojkKQJqJ0j1MJTmLJqNoNJLoNkmJ0oKnPjJpLNmjnJ2rNo
-2.09560cRj3J5pTJQmlOJmoJOlLlM%J%UoJ0jnLlOlOj2lJ0pPLqjMlKjKn%JLkKlOmlNkjJQj4PjJkmR
-2.13020DJoJ%KjJLoJTKjOj2M%JqRoOklOpN%Rj2NlkLQmJq%TM%JjMj4J1m%oNK%QmlLlj%jJQJqnJ5
-2.16428A1j5NJqOMmOoKjLojTMKk%TMlQr%kNk%nJ2q%qJ6pj%KpRmLpJ3lqpJ3m%PqKNq%Kk%NJqO%Kn
$$ plain form
-1.92417 -4 -1 0 -2 0 4 3 -5 -5 2 -2 -5 0 0 -1 11 -1 0 -2 0 -1 6 0 0 1 2 -4 5 -2 1 0 1 0 0 5 -2 4 0 0 -1 4 0 -2 2 0 -2 -1 6 -3 0 0 -3 7 -3 5 -5 0 -2 2 0 3 -2 3 -2 -1 1 5 4 -1
-1.95876 -1 4 -1 -3 0 1 0 7 0 0 6 -5 -2 5 0 -2 -1 0 9 -1 -3 2 -4 0 1 1 2 2 0 -1 1 -5 10 -1 4 -1 2 3 1 -4 -9 0 -1 2 -1 0 3 4 3 0 -4 2 0 3 1 -1 2 1 0 4 0 -5 1 7 -2 4 -4 8
-1.99284 8 -3 0 5 0 0 4 -4 1 -2 -3 -4 -1 -1 2 0 2 2 2 -5 0 5 0 6 0 10 -6 4 5 2 3 -2 0 0 1 1 5 0 2 0 8 -5 -1 -7 1 -5 -5 1 -5 2 -4 0 -3 -5 -4 -4 9 -5 -3 3 0 4 0 0 2 2 0
-2.02642 0 3 -3 0 3 -1 2 0 3 -2 -1 -3 0 3 3 2 5 -5 0 -7 5 3 1 -2 -3 0 -4 6 -4 0 -2 0 -1 0 1 -3 10 2 -1 1 0 0 -1 -6 0 2 1 -1 5 -2 -4 1 2 -3 3 3 -1 -7 6 -3 2 -1 -3 -3 2 -1 -6 -2
-2.06050 -2 -2 0 0 3 0 5 0 2 -2 0 0 -3 0 3 1 5 -1 -8 -5 -3 5 5 0 3 1 2 4 -2 -3 -5 -3 5 6 -2 8 -3 1 2 3 -1 2 3 -5 0 -6 -1 0 3 -3 2 0 -4 6 0 2 -3 4 3 4 -3 0 5 1 0 -5 7 -2 3 -3
-2.09560 -3 6 -7 8 1 -6 -5 3 -1 -4 2 3 -1 -7 -6 0 -3 0 -3 1 1 2 2 2 2 -4 6 5 0 3 0 6 3 9 -3 -6 4 -3 4 7 -1 -2 2 -1 1 0 2 -3 -3 -2 1 -1 1 -2 4 0 -3 2 0 -1 0 8 -6 1 0 1 -1 -5 4
-2.13020 4 5 -1 0 0 2 1 2 5 -1 0 1 3 2 8 -4 0 0 1 -7 2 -4 2 0 -3 3 -4 1 1 10 -2 3 0 -2 1 9 5 6 -2 -2 -2 2 2 3 2 6 -8 3 -1 -1 -7 -2 0 0 8 4 1 4 1 0 0 -1 0 8 9 1 -4 11
-2.16428 11 -4 1 2 -6 0 4 0 6 0 2 1 4 -2 -3 -4 0 2 0 0 0 4 1 9 0 0 -2 3 1 1 -4 8 0 0 -8 8 1 0 0 2 -5 4 0 3 -4 9 6 -2 -9 4 0 0 7 -1 1 6 -2 -2 0 -2 -2 3 4 -4 2 2 4 -1
-2.19836a%WM%TlKkJjpJ1qOk%mMKkKj0J1jnPJMj8RLlPnmkJJ0j0LoOMlNoJlNjKmkPnLqN%kPj1Qk%K
-2.23347BjlK%jJ0j8J2oLKjnMn%OjkQpKqQkMrJ2KnTOkQj0LT%j0MLl%NlrQkMlLoLTJ%mNmjJLnLKmn
-2.26755eRjj1PLJmLmPmTL%TKJmJT%MKkmqJ1qNj%LkljPoMlRj1PmMpQmkNjljNjpMLOpjmKoJ1klKjN
-2.30265Eo%KjOqJ0okmLlJ4qk%nOkRj1NkLm%L%lkN%n%LKlJTlPlkJJ0j4J1nPoljoJ4j2LOjKj2J0jlT
-2.33521cLjL%k%J0oqPnK%UJTKrLoJ5j3QmjPmJ0rnPjmKkLjJ%KnOnNmqQOpLrJ5j3OnMLjTOoPpkM%N
-2.36980HnT%Oo%OokKJjOpMmLkOJjpLm%OjmOlj2J3nNjMnQrJoPmRpN%LpMnJQo%jNklKoMoPjoJ2pJ%T
-2.40592@LlLnNnQo%mRklnkPlOlUJ1mjkKlMnNmKOj1J1qJ1j2J2lLpjLPj0%UPrLQmT%ljKJ%MjmJkLn
-2.44051dJ2qlLKJTnLjTLmKjJMnKoMJ%jkOKJ%ojPKrPrPmjmMLTrMjKjNkKrPm%JjJnRJmLmJLlJmNkT
$$ plain form
-2.19836 -1 -1 -1 -1 -1 -1 3 3 3 0 2 0 1 0 -7 4 -4 2 0 0 -4 0 2 0 2 -8 3 2 -3 4 5 9 -9 0 3 0 7 2 -2 -4 -3 7 -3 0 -6 0 4 1 6 0 1 -2 3 2 4 0 -2 5 0 3 -5 0 0 -2 5 -6 2 0 0 2
-2.23347 2 1 -2 0 0 -1 9 -9 3 -3 0 2 1 -4 0 -5 -5 1 0 -2 6 -1 1 -7 1 -1 3 -6 6 8 3 -2 4 2 10 0 3 6 6 -4 0 3 0 0 5 2 -7 1 -1 3 0 3 -3 0 3 4 4 0 5 1 0 1 4 -1 2 4 0 -5
-2.26755 -5 4 3 -8 -1 2 3 -1 2 -2 5 1 -3 0 0 0 2 3 -1 0 1 1 5 7 5 1 -7 4 -4 1 0 0 3 1 -2 -3 4 -2 2 -1 8 -3 4 0 4 -3 5 1 -1 4 3 0 -1 4 3 -4 0 3 9 2 1 -3 -1 -7 4 2 -1 1 0 5
-2.30265 5 -1 -1 1 0 6 -2 8 2 0 -4 -1 -4 10 2 0 0 -5 1 -1 8 -3 2 0 3 -1 -1 2 2 -1 -3 2 2 -3 -3 0 2 -1 0 1 -2 5 2 0 1 11 -3 8 3 10 4 1 0 -6 8 -4 -1 5 4 6 -6 4 3 0 -3
-2.33521 -3 0 -1 2 2 0 0 10 4 -4 3 -2 0 0 0 0 1 2 4 -5 -2 -8 7 -6 2 -2 -3 4 0 10 1 -4 3 2 -2 0 -2 1 0 1 1 3 -2 4 -1 4 0 -8 0 6 -1 2 -7 8 -5 1 -4 0 3 2 1 7 1 8 1 -1 3 3 8
-2.36980 8 3 -2 -2 4 -2 -2 4 -2 -4 -2 -1 -2 4 -3 1 -3 0 -2 4 5 4 -3 0 -4 -4 2 1 -3 3 0 -12 1 -4 1 0 4 -1 7 -2 -1 -7 0 -4 5 -2 3 3 6 -1 3 -2 -1 7 1 1 0 5 3 0 2 -4 0 -6 1 0 -6 6 -1 0 0 0
-2.40592 0 3 0 3 -2 3 -2 6 0 0 -4 5 3 0 -5 -7 0 -3 3 0 -3 -6 5 1 0 -2 0 -3 1 -4 1 -3 -1 5 -6 5 -3 8 -4 8 5 8 1 0 3 10 0 0 0 0 7 -2 1 9 5 1 1 -2 -3 -1 0 0 4 3 -1 0 -2 1 -4
-2.44051 -4 8 0 -3 0 2 3 4 -1 2 1 0 3 -1 1 0 1 5 0 2 -4 0 1 1 0 -2 4 6 7 7 1 0 7 9 0 7 -2 5 1 0 -4 0 3 6 -3 1 0 2 1 6 4 6 -3 4 0 0 1 0 1 -4 5 6 2 5 1 2 5 2 3 -1 4 2 0
-2.47714@%Jj%OmpLMkTNRj3%LnLJMlklLnML%mMklPjnNKmj%Ojj0LO%oPnKLnjJOj0RJnJnRj1J1oLK%T
-2.51224EpLmQnKjoRlKToNJ%nNnQjTrNKm%LNrPjj1OJjMLjrNjMpOokKNQj1MlPj1LMm%jKlQoKmMKmM
-2.54785DmNnjJLUmqKJ0j0JMpJNlkJ0nlKoJ1p%lO%lQj0RlmMpLjLkNnLmL%kJ%KMj0L%NqLlLJLm%Ll
-2.58244@OnJjmPkTLnLjMmQrLMrjNmL%LpQln%TJ1qlQm%MkJpMOj1K%LMm%kPjl%jkLTmOnRj0JKmOMp
-2.61805BjMjnJ0rMmJMpKjOm%MmJTpNKLjn%LlNnJjL%qJ4pJlOKjoLrP%jnPl%Ll%LlMnlQoJjPj1OjK
-2.65366ALjTk%kK%TKjJlKTkKlKjTMl%KnMpPkNl%LnLNj0mJ3kjmlMlkMLmJQrMm%TMTnmKkJ1qNlmLK
-2.68927DmOoLjKoLoPkPklkOqM%JMpLjJjMrJ1nkQn%LmKrR%Jj0J7j2jLToOojPlTJj%LOo%jLoPoJoN
-2.72437@JKkmMj%PpL%Kn%mP%JnJ0q%MTrRkjpOjojJ0JljOnjMpjKJoQkLoJKPj0LnJ0nlmJ2j2%LkLK
$$ plain form
-2.47714 0 0 1 0 0 6 2 -5 -2 2 0 -2 3 12 -1 -1 2 -3 0 1 5 2 0 -3 0 -5 -1 2 2 -2 2 0 -3 4 3 -2 3 5 1 0 0 6 5 -5 -2 4 4 -2 5 0 2 5 0 -1 0 6 -4 5 6 1 2 -3 6 -5 6 0 3 5 5 5
-2.51224 5 -2 1 -3 5 0 2 1 -5 4 1 3 5 -1 4 5 5 0 5 0 8 7 6 -3 2 4 0 0 3 8 -1 6 5 -6 0 1 0 4 7 6 -3 2 1 5 -2 4 -2 -4 -2 3 11 0 4 1 8 -3 0 4 0 0 -1 1 -2 6 0 2 -2 2 4 0 4
-2.54785 4 0 5 0 -1 0 3 6 9 5 -3 -1 9 -1 0 4 -3 -2 3 0 -2 8 3 0 2 -4 7 0 0 -3 3 3 0 8 -2 7 4 0 4 -3 0 -1 2 0 5 0 3 -1 2 2 0 1 1 3 7 -3 0 0 5 -3 0 -3 0 1 4 0 0 3 0
-2.58244 0 6 1 2 1 -3 4 2 0 3 -2 1 0 4 0 8 -1 2 6 -3 -4 1 -3 0 0 3 -4 4 1 -4 -4 -4 7 -1 -4 4 0 0 4 2 3 -4 0 6 -5 -3 -3 0 4 0 0 -2 5 4 1 1 0 -2 1 4 0 6 1 10 0 1 3 -1 5 9 2
-2.61805 2 1 5 4 -1 9 0 4 0 1 5 -2 0 -1 5 1 1 5 1 2 3 -4 1 3 6 5 0 0 3 0 5 0 1 0 3 3 -5 9 2 3 0 6 8 7 1 4 -5 2 2 1 -4 3 0 0 3 0 0 3 0 4 -1 -4 4 -2 -1 -2 5 -6 0 -1 1
-2.65366 1 4 3 2 0 0 -2 0 0 0 2 1 2 -1 1 3 1 3 0 2 1 0 4 1 1 3 -2 2 -5 2 0 5 2 2 5 0 3 8 -2 -6 7 5 4 0 -3 1 -2 -4 0 3 -1 0 8 -1 3 -1 -1 -1 3 7 2 -2 0 -2 9 1 6 3 -1 2 4
-2.68927 4 0 6 0 3 2 4 -2 1 -5 2 0 7 5 2 0 6 -2 2 2 3 7 0 3 2 3 2 6 -3 8 3 1 9 4 4 7 3 5 -4 5 5 6 -4 13 1 0 3 6 0 6 0 -1 6 3 0 1 0 0 3 9 3 3 2 5 -1 6 0 1 -5 0
-2.72437 0 1 3 1 -3 1 0 0 7 0 3 3 5 0 0 -4 3 3 4 -1 9 1 1 5 9 0 9 7 6 -1 5 4 -2 -3 7 8 5 4 10 5 4 8 1 0 2 3 -3 5 3 6 0 1 3 10 0 3 -2 8 3 0 -4 8 -4 -4 -1 -3 0 2
-2.75846BmKLjkKjnLJQqOo%k%QnMmKkTNm%UJKJjl%TNnPj1QlOnTPjmjOJ%k%J%MqPlmjPLqOjTkKpKR
-2.79559Iqj%MjUL%pMJ%TmO%JoMoRpQplJ3qklRmKmQrkLlLJLPrLj1Q%Ml%LoMoQjJj0NjQoRmnLMql%
-2.83171bKNKoJjPqQpjJKqJ4rJlLnJ0rMTnMlKkjOnjPnKjljKQqLnQmMlUMJTm%LlOqJ7j2j0J1JnlOm
-2.86630akMlOjNj1J4j0LlqQLJ%onOJjKkNkTJ0j6J2rPnOolKTMjmN%kjlNjl%KTLJmrKL%LpMLTNj2j
-2.89988bOJlMrOlOmTQnPqNoKjNmNkTJ1j4RrMmQnkLlMJlLklMj0PjOloOmjJjJJ0j2kMmNL%oNTp%TO
-2.93447FJkoMNqPlMJloLjMrJ0nM%pkLTkMljNj2J0%mMmJ2j0MoNnkL%k%JMKj0JLOpK%PpjNlMoKkPJ
-2.96855HpjQmkqQkjTKLlMmNlKJLj0Nl%NoN%KlLjkrJ5j1%Nk%j%KMnKmNnJ2qNmMpkJ9j7NnkTO%jlO
-3.00264E%nLlNOqkLm%KmOkmMLmJkRrjJ0nkTLT%kLpKNknMKj0LRoJnKMLlT%lL%MlLmJn%LN%JmM%To
$$ plain form
-2.75846 2 -2 0 3 2 0 2 1 -4 -1 0 8 0 6 0 0 -2 -2 6 1 5 1 3 1 -1 4 0 0 0 0 1 3 4 3 0 0 0 5 0 7 -4 4 1 7 2 -3 4 3 -1 -2 4 5 5 3 3 4 4 8 0 7 4 0 -1 6 9 1 7 6 5 3 5 -2 0 9
-2.79559 9 1 0 0 4 3 2 1 4 4 -3 1 2 2 2 -2 4 4 5 -1 3 -3 6 -1 7 0 -3 10 2 0 -3 6 2 4 0 8 -1 -3 0 -3 0 1 4 11 2 5 -6 2 2 6 3 3 6 0 4 -2 6 5 6 -4 1 0 8 2 11 7 2 5 9 1 -2 -2
-2.83171 -2 0 5 7 1 2 1 8 0 8 1 0 1 3 -5 9 0 1 -2 1 -4 6 -3 1 5 0 4 1 3 1 0 6 1 0 7 2 4 3 0 -1 1 9 1 4 -1 7 3 7 4 1 -2 2 3 4 0 0 3 0 6 -2 15 3 -7 4 5 0 -3 3 -1
-2.86630 -1 -3 1 -2 4 3 8 -3 11 1 4 1 -7 1 4 5 5 -1 -6 0 1 0 2 0 5 3 1 11 -5 7 -2 5 0 6 0 -3 -1 1 5 4 0 5 5 3 2 -1 4 3 0 0 2 4 7 8 4 -5 -3 0 0 3 -4 0 3 6 11 -1 -2
-2.89988 -2 4 5 2 6 -3 3 0 6 2 -2 6 1 8 0 5 -1 1 0 5 1 6 4 2 13 -1 8 -1 3 -1 7 2 0 3 0 4 5 2 5 3 0 4 -6 1 0 6 3 -3 3 -1 -2 -1 -2 -1 9 -3 -5 -1 -5 0 3 3 -3 2 7 0 0 0 6
-2.93447 6 7 5 -1 3 8 0 7 4 8 9 6 0 3 2 6 -3 7 2 6 6 -1 -3 0 3 1 5 2 1 6 -6 4 4 0 4 0 12 2 6 0 5 0 -2 1 1 -1 -1 0 4 6 -4 -3 0 6 -1 1 1 8 1 0 5 2 6 0 2 0 7 8
-2.96855 8 1 0 8 4 2 -6 2 0 -1 -2 0 3 0 4 0 5 2 4 5 8 -2 3 0 0 5 -1 4 4 6 3 6 5 3 -6 9 -2 -2 3 1 1 0 0 2 6 1 3 -1 4 -1 11 3 8 4 8 1 -1 18 1 6 1 -1 -3 3 3 2 -1 5
-3.00264 5 5 0 3 0 5 11 3 1 4 0 0 2 -2 4 2 -2 2 5 1 2 0 9 0 -1 9 4 2 0 3 6 6 4 7 0 2 7 5 0 4 6 -4 -1 8 2 3 -2 0 4 7 4 1 1 -2 1 1 5 2 5 1 2 -3 -3 0 5 5 6 2 6 6 6 0
-3.03876@J3j7PjLmKjPlnKkLmP%oKnOjJlNkmQnOm%TnKJjlL%OqJKNj3N%kMJl%jMj%jJKlM%oJLJmOJ
-3.07437Gnk%RnJlk%mJ0nLJkJmOoNMnlTLkLkOj0MTmOj1J6j5Qj0J6r%jTLklOpQJPp%lj%Kk%JK%m%
-3.10743@J5j6MJ%pQqPlOn%MoMrJ2j1NJTMmLNj1LTnOlnNmjKj%TOpkJ0mOp%TLl%JLqLJPr%MmJqP%N
-3.14152EmLmNmOlJoNKmkKTmlMLjMqMlMlMkjLkTLMjKn%mJNoNmjPmTPljLmj%NmnO%kJ0j0OoKlMmNo
-3.17763bOpRmk%KlJ%TJjLlMn%RjToP%njNjmMOpmkPmPqJ5rNj1lQoLQrJMqQJnQj1QjkJnKjKnLlOmK
-3.21324BjM%kmLjJMJj1R%mOpNj%lnO%JoO%TkLTlJn%RnNrQj1J0oOpMpJ0nNnLkTLKmk%jMpPnLOnJL
-3.24834Fj%m%jPnjTLJmNJjmLMjmqRkNpMTlKkJoMlJNoJLJ%KnKjkKkjKN%lj0QlPmLJjkmPrMJm%J0l
-3.28446F%nNjMnmQmkoRlNLqJ%k%K%NpjKTlKkLkKTmNlLoJj%JKPj1NkJkJ1qLnLj0J0jT%kMoLKT%lm
$$ plain form
-3.03876 0 13 -4 3 2 5 1 3 2 9 6 1 3 1 4 0 7 7 1 3 -2 4 3 4 1 6 4 0 8 3 9 5 5 5 0 2 3 2 -1 2 2 8 0 1 3 8 -5 0 0 -2 2 3 0 0 -1 3 2 2 1 2 4 1 5 5 -1 0 3 4 0 6 7
-3.07437 7 2 0 0 9 4 5 2 0 0 -4 6 1 4 5 3 4 0 6 0 5 9 4 1 -2 1 -1 2 0 6 -4 0 4 0 6 -5 11 -4 4 -6 10 1 1 0 -1 2 0 -3 3 -4 4 5 12 5 5 2 1 1 3 1 1 2 4 4 0 0
-3.10743 0 15 -1 3 4 4 -3 5 -3 4 1 7 2 2 6 0 4 -5 7 -4 1 2 3 7 3 6 11 0 3 6 1 7 4 -1 4 0 -1 1 0 0 0 6 -1 -3 7 3 9 2 2 2 5 2 2 3 6 -2 1 2 9 0 0 4 0 1 -7 0 0 5
-3.14152 5 1 4 0 5 1 7 4 5 -1 4 6 2 0 2 4 0 -3 1 4 3 7 -1 3 0 4 1 5 3 2 5 3 1 4 8 7 9 4 4 0 1 6 0 5 1 0 7 3 -1 6 3 2 5 1 0 0 5 1 -4 2 2 0 10 0 6 0 2 -1 3 -1 4 -2
-3.17763 -2 4 -3 6 2 0 0 2 -1 0 0 0 1 0 3 0 4 -1 -1 8 7 6 0 7 7 2 1 6 5 1 5 11 4 0 -2 5 1 8 0 15 6 11 0 -3 5 -1 2 10 1 2 6 -2 6 7 2 10 -1 7 6 4 5 0 2 1 3 -2 1 -2 4 0 2
-3.21324 2 1 5 5 3 -1 2 1 2 6 7 -4 5 5 1 7 0 5 4 4 1 -4 2 2 3 -3 3 3 3 1 4 7 4 5 0 0 9 4 9 0 8 -3 7 1 7 0 4 -3 7 2 7 2 5 3 1 4 6 2 0 0 -1 3 -4 3 -2 1 7 2 3 6
-3.24834 6 5 5 1 1 0 7 2 1 0 3 4 0 5 6 5 1 4 8 7 3 -5 4 2 7 0 4 8 5 7 5 6 0 4 1 2 7 1 2 5 6 6 8 3 5 4 2 4 2 1 3 8 8 5 -5 3 0 7 3 6 7 6 4 0 7 -2 2 3 -1 -1 9 6
-3.28446 6 6 1 6 5 9 4 0 8 4 2 -4 5 2 7 10 2 3 3 1 1 3 3 8 1 0 2 4 1 3 1 4 2 4 6 2 7 4 7 1 2 1 1 2 4 11 0 5 3 4 2 13 5 8 3 6 -4 6 5 4 4 2 6 0 3 5 7 7 4 0
-3.31956@ONj1M%KoNpJ%J5k0J3qJ1njTl%KlJ2j0PpNMlJkmj0J2pPLo%J%ToMKkKTLmJQrOj1RJrJ0nlL
-3.35161DjTLJNo%oJ5j1MjkmKlRlmKjQKoJmKOj1kKOnMnKTNjLTj3Ll%Ljl%TLj%KTjLqRqQrNnQmlMoK
-3.38722AjQj5J1JOqNqQj5J3Kj0OlLKOj0kKjNj1J1lLmkPjOj2%QrJKLmlNJNjrMOoJjOoKljTOoLlPoL
-3.42029DJ%oLKlKmKN%oN%KmLoMjPnMlqKTLn%J4j0k%ToMKNJlTjKjmPmOqRqJ2j0PnMqKLMLj2NPpJnL
-3.45539DnJ0olPJTlKnJ%oLPpQpJLnNnLKLjl%m%NmkKkOLnLpOo%LJ2j6LjOnJlMnNkmK%MkMKlnQrJ0l
-3.49100FmLrJ5mKj0O%rJ3JnmQpnJ3j1Pj1J9j8J2ojMnKk%J2j0J%mMkmJ2kpJ2mNj2OjkJn%TRj5RKTj
-3.52101Fk%TKPrOonPlMlLrNRp%mQjnMlqJ1Rj1%lpJ3oPqkJJ1pK%mJKlQj1MJMnjTNkLkMoK%LmNrLjN
-3.55612GlLNkoJ2j1%nPqJTKRj0KJlOnKMqNMnlkJRrQoMrPklKOMpPpOmTkMnOkj%kPJnKoQjlJRqnMnR
$$ plain form
-3.31956 0 6 11 0 4 4 6 0 5 -2 -1 -1 14 -6 7 -1 10 5 4 3 0 0 2 -1 11 1 8 1 6 10 7 8 6 2 -8 4 -3 4 7 1 1 2 2 2 -4 0 2 0 2 4 7 3 4 12 3 9 -2 7 8 -1 9 4 1 4
-3.35161 4 3 2 5 6 11 5 5 -1 14 3 7 6 4 0 2 -1 8 5 1 3 2 10 12 6 7 3 5 11 0 -2 0 6 1 5 0 2 4 9 8 11 14 1 4 1 1 4 3 0 0 0 3 2 2 4 6 5 8 0 9 1 9 0 5 0 8 4 1 5 -1 1
-3.38722 1 0 8 -7 4 5 11 3 8 0 8 -7 6 8 -2 4 1 4 6 12 2 0 2 1 6 -5 6 3 6 2 0 7 6 12 0 0 8 -1 0 2 5 1 -2 3 4 9 8 -1 3 9 3 4 3 9 3 5 2 1 0 6 0 3 0 7 1 4
-3.42029 4 5 5 -1 2 4 1 3 -1 1 6 6 0 5 5 7 3 6 0 4 3 10 5 9 6 -2 0 2 5 0 0 14 4 2 2 2 -4 0 2 7 8 5 2 1 3 2 -2 5 1 7 -1 8 0 12 2 9 4 8 0 2 5 9 12 0 5 12 5 6 1 4
-3.45539 4 -1 9 3 0 7 8 9 6 8 3 4 4 -2 1 8 1 9 2 3 6 1 6 1 4 6 9 8 5 5 1 1 6 2 0 2 0 6 9 4 7 0 6 0 0 3 15 -1 2 1 7 2 3 0 4 -1 4 2 -2 0 0 4 2 6 8 5 0 8 -1 9 6
-3.49100 6 2 5 -4 11 7 9 -1 5 5 -4 9 10 5 1 9 2 -3 10 -1 6 -5 14 -4 8 2 1 5 0 2 0 0 12 2 3 3 -1 3 1 -3 9 7 0 12 8 13 1 7 6 4 5 0 0 0 9 -6 3 5 7 6
-3.52101 6 4 4 4 6 13 4 10 4 -1 6 3 7 4 7 -2 3 12 5 5 1 9 8 3 7 4 -4 7 16 5 5 2 -5 8 2 9 1 -1 0 11 4 6 6 2 3 5 2 10 -1 3 4 8 3 2 1 6 4 7 5 9 3 5 5 8 4 9 0 3 2 7
-3.55612 7 4 7 12 10 4 16 5 5 0 7 -1 0 1 3 12 2 4 5 2 8 3 5 9 1 6 10 5 2 0 1 10 1 9 3 7 -2 5 3 0 2 8 12 5 12 5 11 7 3 1 5 0 6 4 3 3 1 8 9 4 6 0 8 7 4 5 14 6 1 5 0 9
-3.59223Ij0OnOpRnJ5j7MkOmMJqNpRjk%TlTKJLmLJ%MojL%pJmJ1m%jMmMJ%lk%LMljJkNrJ1lok%KOjo
-3.62734ANJjoJ%K%KJ2j7KkJ0pPj2PpJ5j2QqOmLljJTMkKkJnLkNkj%LlknMTkTjNLNplNkOj5PnPp%OjU
-3.66244CkLMnl%LlLTJqMLTmlOnMpJ6pmnQkJ0j6LNljL%lTNMlklMJmjMnK%KLpjOqJ2j0QjlkOQj6N%K
-3.69703Gj0RlRj2LN%LknLpJ5j1LpjPNlmlMJjLn%NpPmkKm%NMn%NjJnNoRrMlmOMpnPlJKMmlTNPnkPl
-3.73264Hn%LnM%oJPJpNjLqLKlNKjTmJTKLj2RjTJTm%kLTkjLlnRojKkOnJ0j2NnLj%OmNj0J5j5Q%kLo
-3.76723BMJN%ojNj0KJjMo%OpJ0n%lKTlK%QnkmMlMJpJ6j5J0j1NjMKoKqJ0lJTKpJ1j3J7j7MjkKjMOkn
-3.79979EOj1OjMmJOj0PjMmkK
$$ plain form
-3.59223 9 -1 5 0 6 -1 8 3 18 1 5 3 9 5 9 10 2 7 0 9 8 6 6 6 3 0 2 3 6 2 5 6 6 10 4 3 6 6 -1 0 -4 7 3 3 2 6 2 6 7 7 4 2 2 5 9 6 5 6 4 9 0 11 8 2 0 0 2 8 7 1
-3.62734 1 6 7 6 0 1 1 3 3 5 17 0 2 0 10 3 10 -2 5 -2 13 1 9 1 7 3 6 3 2 3 4 8 6 8 6 7 2 5 3 8 6 5 5 8 5 3 -2 2 6 4 2 1 6 9 14 7 4 9 7 13 -2 5 0 7 0 0 6 5 4 3
-3.66244 3 1 4 8 3 0 0 3 0 3 6 7 -1 3 6 9 5 2 8 3 7 0 16 9 5 0 8 6 16 0 3 8 5 4 7 7 4 1 6 10 7 5 2 6 7 3 2 6 1 3 3 5 8 1 0 6 -2 10 0 8 7 4 2 8 16 0 5 5 7
-3.69703 7 -3 6 3 12 0 3 8 8 11 9 4 7 0 15 4 7 0 -1 6 11 8 4 1 5 6 5 8 3 3 8 1 8 4 2 4 0 0 5 9 4 4 9 8 9 4 9 3 12 3 7 4 0 6 10 3 -2 5 2 3 5 9 5 2 -1 4 11 6 4 11 8
-3.73264 8 3 3 6 1 5 5 -1 0 7 8 1 6 5 8 0 3 5 2 7 9 8 7 3 4 5 7 10 -2 7 6 5 6 7 3 3 1 4 7 5 4 7 4 -1 8 2 1 3 1 7 2 12 0 5 0 3 2 2 8 4 9 -1 14 -1 7 7 5 8 2
-3.76723 2 6 7 12 12 6 5 10 0 2 3 2 6 0 0 6 -1 9 4 4 1 3 5 2 4 4 12 7 5 1 5 2 6 7 0 16 1 11 0 5 4 8 10 4 6 -2 8 5 6 7 9 2 13 0 17 0 4 3 1 3 2 6 12 10 5
-3.79979 5 11 0 6 5 9 5 6 12 2 9 8 12 8 6 8
-3.80742H    $$ checkpoint
##END=
