##TITLE= 3,6 Dihydro-3,5-dimethyl-4H-pyridazino[4,5-b]carbazol-4-one
##JCAMP-DX=   5.00   $$ Varian Associates, Inc., VNMR Software
$$ VNMR Version 5.1 Revision A, March 1, 1995
$$ Wed Jun  3 11:47:39 MET DST 1998
$$ svsj version 5.1, 97/1/14
##DATA TYPE=  NMR SPECTRUM
##DATA CLASS= XYDATA
##ORIGIN=     varian
##OWNER=      haider
##SPECTROMETER/DATA SYSTEM=   Varian UNITYplus-300
##.OBSERVE FREQUENCY= 299.9498529
##.OBSERVE NUCLEUS=   ^1H
##.SOLVENT REFERENCE= 2.490        $$ solvent=dmso
##.FIELD=             7.04         $$ Tesla
##.ACQUISITION TIME=  3.7376000    $$ seconds
##.AVERAGES=          32           $$ number of transients
##RESOLUTION=         0.153        $$ digital resolution in Hz
##.PHASE 0=           -38.5        $$ zero order phase correction (left edge)
##.PHASE 1=           0.011232     $$ first order phase correction, deg/Hz
##$REFERENCE_POINT=   929.936      $$ Referencing label
$$ Varian specific parameters
$$ --------------------------
##$acqstatus=    (0..1)  101 0
##$alfa=         19.9999923706     $$ usec
##$alock=        <n>
##$array=        <>
##$arraydim=     1
##$arrayelemts=  0
##$at=           3.7376
##$bs=           16
##$celem=        1
##$cp=           <y>
##$ct=           32
##$d1=           2                 $$ sec
##$d2=           0                 $$ sec
##$date=         <Oct 20 97>
##$dfrq=         299.9493529       $$ Hz
##$dm=           <nnn>
##$dmf=          200
##$dmm=          <c>
##$dn=           <H1>
##$dod=          0.00999999977648  $$ sec
##$dof=          0                 $$ Hz
##$dp=           <y>
##$dpwr=         30
##$exppath=      </export/home/varian/haider/vnmrsys/exp1/acqfil>
##$fb=           2800
##$file=         </export/home/varian/haider/jk5>
##$filter=       54.0999984741
##$fn1=          1024
##$gain=         48
##$homo=         <n>
##$hs=           <nn>
##$hst=          0.00800000037998  $$ sec
##$il=           <n>
##$in=           <n>
##$lb1=          0.318309992552
##$load=         <n>
##$loc=          0
##$math=         <f>
##$method=       <z1z2>
##$np=           37376
##$nt=           32
##$p1=           0                 $$ usec
##$pad=          0.5               $$ sec
##$parversion=   4.3
##$pmode=        <partial>
##$priority=     5
##$proc1=        <ft>
##$proc=         <ft>
##$pslabel=      <std1h>
##$pw90=         16.8              $$ usec
##$pw=           10                $$ usec
##$rfband=       <ch>
##$rof1=         10                $$ usec
##$rof2=         9.9999961853      $$ usec
##$seqfil=       <s2pul>
##$sfrq=         299.9498529
##$sn=           0
##$solvent=      <dmso>
##$ss=           0
##$sw=           5000
##$temp=         28
##$tin=          <n>
##$tn=           <H1>
##$tof=          500               $$ Hz
##$tpwr=         57
##$vtc=          25
##$vtwait=       300               $$ sec
##$wbs=          <>
##$werr=         <>
##$wexp=         <>
##$wnt=          <>
##$wshim=        <n>
##$wtfile1=      <>
##$wtfile=       <>
##$x1=           -103
##$x2y2=         327
##$x3=           123
##$xy=           335
##$xz2=          0
##$xz=           62
##$y1=           22
##$y3=           -133
##$yz2=          0
##$yz=           -40
##$z1=           -1904
##$z1c=          -81
##$z2=           -1250
##$z2c=          214
##$z2x2y2=       0
##$z2x3=         0
##$z2xy=         0
##$z2y3=         0
##$z3=           85
##$z3c=          0
##$z3x2y2=       0
##$z3x3=         0
##$z3x=          0
##$z3xy=         0
##$z3y3=         0
##$z3y=          0
##$z4=           -101
##$z4c=          0
##$z4x2y2=       0
##$z4x=          0
##$z4xy=         0
##$z4y=          0
##$z5=           0
##$z5x=          0
##$z5y=          0
##$z6=           0
##$z7=           0
##$z8=           0
##$zx2y2=        0
##$zx3=          0
##$zxy=          0
##$zy3=          0
##$rp=           17.7
##$lp=           -56.2
##$rfl=          1676.8
##$rfp=          746.9
##$axis=         <p>
##$sp=           -30.1
##$wp=           3779.3
##$cr=           1720.3
##$delta=        111.5
$$ End of Varian specific parameters
$$ ---------------------------------
$$ Y-values stored with standard (16-bit) integer precision
##DELTAX= -0.0005087113
##XUNITS=        PPM
##YUNITS=        ARBITRARY UNITS      $$ (mm on paper)
##XFACTOR= 1.0000000000
##YFACTOR=       0.003778582
##FIRSTX= 13.5686394668
##LASTX= -3.1003049043
##MAXY=          123.809017
##MINY=          -0.222936
##NPOINTS=       32768
##FIRSTY=        0.064236
##XYDATA=        (X++(Y..Y))
$$ [...]
13.03754B0j4K3j7Jj0K3k7L7k3lOqRJ2l6L7j5LNk1J2J3nmplQplK6l0K8j2k0J2JLJ5l4mL4k2RnLj
13.01414I%LRJk2PTmpJK5mj8RN%Rk7J1oRMnJoJ5l4J7MrK3j7mQn%RmOjj7JQK%rK5j6K3k4J6j9Kr
12.98667BL1j5kLoJ3k3J3j4kJ5jj3Rj3J4J0j2OoMlLk4K7pNj3J1kQTj5lJ6j5K7k0k1KK9j0orqL5
12.96327B8l0J7rPkNk%j7J8lJ4j9Olj0J0OnJ2l3K5j2NRJ0k7OnJ0NQj5Moj3J5mlK1j9jmJ3l1M9k9
12.93936AJ9j2L2l2lJJ7k2K3j0lJ8k9J4k1J7rK0j0Qj8J8Qj5j1K4j6jPj0J2j0J8l0K6j6J3j5J0j1
12.91902BJ5j0mK3oPk3J0Jj5J1pJ7k2K1JLj8K6j3j6NJOk4RpK6rjTJ0Lk6L8j9rJ6j5NKPrjj7J7MlT
12.89409HmjJ6j0Kmjpj4M6k3KQj4NJ0J2j6J%r%KJ7k1j0OJ7l1K2POj6NLOk2QPk2J1J0j2PLnJ3Ro
12.86916B1j9LJ7k5J5koJ5pRJqj%LlpJJ4prnJ5j5pNJ9oNj6K4j7jnJ7kpK0k6L0l6K2j3J8kj1k4J9T
$$ y = [20, 6, 29, 12, 13, 3, 26, -1, 36, 13, 10, 16, 8, 17, 29, -7, 30, 15, 18, 23, 2, 14, 27, 22, 18, 11, 8, 16, 9, 6, 32, 2, 30, 18, -2, 10, 11, 14, 29, -5, -9, 25, 3, 12, 7, 10, 9, 9, 12, 21, 22, 0, 7, 14, 10, 3, 4, 29, 25, 7, 16, 21, 21, 30, 3, 14, 8, 17, 21, 16, 17, 11, 26, -8, 9, 13, 4, 27, 10, 6, 14, 9, 9, 18, 14, 20, 19, 2, 3, 11, 13, 13, 4, 29, 13, 36, 12, 28, 9, 11, 2, 33, 18, 16, 19, 13, 26, 3, 16, 2, 0, 15, 14, 1, 10, -3, 11, 21, 9, 15, 9, 13, 10, 13, -11, 16, 9, 14, 1, 12, 10, 18, 26, 11, 8, 24, 9, 36, 16, -5, -3, 26, 16, 10, 1, -7, 28, -2, 15, 6, 13, 11, 16, 14, 14, -3, 15, 12, 26, 7, 13, 10, 0, 10, 16, 11, 23, -10, 15, 3, 8, 17, 27, 0, 6, 1, 11, 16, 24, 9, 13, 7, -6, 9, 5, 2, 23, 4, 3, -1, 12, -19, 30, 1, 20, 8, 40, 8, 5, 6, 23, 1, 24, 14, 11, 29, 0, 14, -7, 10, 1, 21, 11, 19, 1, 19, 27, 12, 1, 25, 9, 8, 15, 5, 17, 7, 25, -5, 21, 5, 18, 3, 13, 2, 17, 7, 3, 26, 20, 27, 4, 14, 15, 0, 11, 4, 21, -1, 20, 21, 24, 6, 32, 19, 3, 8, 9, 15, -9, 0, -7, 19, 10, 9, 8, 18, 21, -5, 33, 14, 5, 21, 6, 11, 13, 20, 11, 10, -7, 10, 14, 11, 8, 4, 3, 19, 9, 11, 7, 6, -1, -15, 31, 8, 10, 18, 4, 9, 19, 31, 15, 16, 16, 7, 7, 9, 26, 5, -5, 1, 18, -13, 9, 16, 22, 6, 11, 14, 20, -2, 6, 13, -9, 2, 12, 0, 7, 10, 5, 18, 27, 21, 2, 5, 22, -3, 12, 10, 4, 19, 12, 21, 22, 14, 13, 13, 16, 13, 6, 7, 21, 14, 5, 0, 15, 0, -7, -2, 17, 11, 16, 0, 24, 7, 6, 1, 18, 16, 9, 29, 3, 33, -3, 19, 6, 24, 22, 11, -13, 6, 25]
12.84423B5l3J9qQTj6OrK2j8%QmqJJ8rkqROnmj1K9k5K2j0J0Kl2K0nJ2kMj2J8kk0nJ2LJ0qpMjOk0
12.81880bK0j9J4J0j5PmqjLT%k0M9k8PlnjLlPj4NOMjlj8K6lJ1k2J7j9KJ1j5J2j0Pk3J5J7Mj7MP
12.79438A7j3KqK0qJ8j2Ol0J6j3J1J9k5J7Qj6nM%qJ4%kRk5K8j6K1k2J4j6J7j5J1Nj1LnLMoJ5j7
12.77200IJ1j8%J9Nj4j5K3k%k0K7lj8mTMlJ4KTk0J6oMj4J2LlKK7k4jJ%NoJ1j6nJ9kk6J4jJ3k3J6
12.74758A1KjLTlj1K6m4K3lJ4nLj3jJMRl0K2j5K1l2K1JmJ6l2K5j0qJJ1jO%l%k3K7j1%J2rKj2J3
12.72367FJ7lMk2J1jj0J2mLj0J1j7J2%J3j6J5k1KK0LqokJ0j3j5RJ1J0k8J3kJ3j2J4j8jL0k7J1j9
12.70180eJ8nMmK3k7PJ3j3qTJ4NnOPorMQ%j4Kj3K9j4KqMRrpJ7qQk5RPqK4pqj5J1j6J7rK2KqpJ6
12.67534B2l2J7jK5m1L5rTRj4Pj0RkLPrJ9rj1KJlJpJ7qKJLk8J1mK5j0J4k7J2rlNJKoJ8Tl5K3Ok0
$$ y = [25, -8, 11, 3, 11, 19, 3, 9, 0, 22, 4, 4, 12, 8, 0, 1, 19, 10, 8, 0, 9, 15, 10, 6, -5, 24, -1, 21, 11, 21, 23, -9, 11, 6, 18, 16, 20, 8, 26, 24, 4, -1, 11, 14, 24, 16, 9, 13, 12, 18, -2, 18, -1, 13, 23, 8, 15, 11, 3, 2, 5, 8, 8, -12, 37, 9, 16, 13, 8, 7, 10, 7, 14, 0, 5, 11, 15, 14, 11, -7, 19, 16, 27, 5, 22, 3, 5, 16, 1, 13, 3, 10, -13, 2, 19, 23, 6, 10, 17, 4, 6, -2, 18, 10, 28, 16, 22, -8, 8, -5, 6, 25, 0, 17, 25, 9, 4, 8, 8, 0, 14, 14, 12, 21, -4, 24, 8, 29, 7, 21, 5, 22, 7, 18, 23, 12, 15, 10, 13, 17, 11, 26, 9, 20, 2, 2, 21, 26, 12, -3, 20, 18, 18, -2, 25, 22, 4, 0, -4, 0, -3, 11, 13, 15, -5, 11, 5, 9, -5, 7, 10, 7, 9, 36, 12, 11, 12, 12, 17, 11, 22, 6, 1, 20, 18, -8, 6, 5, 18, -5, 11, 13, 12, 15, 18, 15, 4, 30, -14, 9, 6, 20, 15, 18, 5, 4, 5, 9, 18, -12, 10, -5, 16, -16, 5, 6, 2, 18, -14, 11, 1, -7, -6, 5, 4, 10, 10, 7, 7, -16, 11, 0, 0, 12, 3, 5, -7, 6, 23, 20, 24, 2, 13, 12, 2, 14, 10, 13, 3, 14, -3, 9, 9, 22, 6, 21, 0, 2, 22, 25, 17, 11, 9, 19, 6, -9, 0, 11, 21, -7, 6, 4, 17, 5, 19, 1, 0, 30, 3, 14, -5, 13, 8, 12, 8, 31, 4, 11, 24, 11, 3, -5, 9, 14, 9, 15, 22, 16, 7, 11, 19, 19, 5, 7, -6, 23, 9, 11, 3, 7, 16, 7, 0, 17, 9, 17, -8, 1, 8, 0, 24, 17, 9, -6, 5, -11, 6, -3, 19, 21, 13, 6, 22, -10, 7, 6, 31, -10, 25, 16, 7, 16, 2, 9, -1, 8, 6, 9, 16, 7, 26, 17, 6, 8, 9, 6, 7, 0, 17, 9, 11, 12, 15, -13, -2, -6, 19, 9, 23, -4, 8, -1, -4, 1, 2, 4, -2, 16, 34, -1, 22, 28, 8]
12.64991HJNj8J7pkPTj2Qj5L0k9%J4qoTJ0PLj8J2J0oKqKM%TpNJ8k2J7Rk4j3K2o%kmK7l7J6QK4l5
12.62447HomJ4nj1Qj1L1k2J2rM%l1L1J9j2J0k1mnJ9jJjj7J8pTRJ6l9K0NJPj5K1Jk2OJRj1lLJ5j4
12.60005A1qK2k0pJ3m%MQl3M6k5J2j0J3k0J2KpJ8k7J0j7J6J2kj5PoNpKPJRj2%J1Nk1K5k1j3J1j1
12.57716dK7l0L0l8M5qj0rRJj5J0QJk2ROPM%JojJ1k1Rj5L3l1J7oj3J0KpTJ4MRj0nlkNMnMmQpj1
12.55122bL1k0Jj6K6j9L0k4lNqQ%j6L5pj2mKjQoJ7l0J6pljK4rJj4N%rJ7NJ6k7J1j4K3l6K6mRk6
12.52731bJ8j9NjK9k1OoJ9ol3L5k1J5nj3J3MpJr%TJ0l0M6l4K1k2L1k0J8j7Ok8L4k4J2J0oMRk2N
12.50492EL2l5J8j2J5j6J6k8K2j3QrKj1PJ3kK4j9QqoKLQj3j0ONLj5%K8rqQj9J6j5jM%Nj0L8k3lr
12.48051BQjPj7K3l0K4j4K8k0qJ3j1PK3k5J1l5J5J1RrJj3KJ5j5jnJ0j1OJLOJ2k2%KJ4qJ9j3J6k7
$$ y = [8, 9, 14, -4, 13, 6, 4, 11, 18, 6, 14, -1, 29, 0, 0, 14, 6, 0, -6, 4, 11, 14, -4, 8, 18, 12, 14, 6, 8, 12, 12, 12, 5, 10, 28, 6, 23, 32, 8, -5, 17, 11, 11, 9, 5, 32, -5, 11, 19, 43, 8, 2, -2, 12, 7, -4, 4, -7, 24, 2, 14, 5, 9, 9, -22, 9, 28, 16, 26, 5, 1, -4, 15, 14, 15, 14, -3, 15, 8, 1, 10, 26, -13, 7, 12, 13, 20, 5, 26, 27, 5, 11, 12, 21, 10, 7, 10, 25, 11, 3, 25, 5, -2, 11, 7, 7, 11, 19, -14, 32, 7, 19, 9, 22, 2, 14, 16, 9, 27, 0, 10, -7, 9, 21, 19, 4, 11, 5, 10, 3, 5, 12, 13, 22, 10, 10, 21, 26, 5, 30, 9, -4, 7, -4, 23, -7, 23, -15, 30, 22, 12, 3, 12, 13, -2, 8, 16, 17, -5, 4, 10, 17, 21, 21, 22, 16, 15, 26, 5, 14, -1, 32, 1, 18, 12, -1, 9, 11, 4, -3, 11, 15, 24, 14, 9, 6, 4, 9, 13, 8, 12, 8, 16, 9, -2, 29, 9, 10, -6, 20, 1, 31, 7, 4, 9, 1, 9, 9, -7, 28, 21, 9, 5, 7, 6, 14, 8, 25, -5, 11, 4, 1, 0, 24, 15, 16, 2, 7, 7, -2, 15, 20, 36, 9, 20, 6, 29, -7, 19, 15, 24, -2, 16, -3, 2, 1, 30, 9, 15, 9, 28, 22, -11, 24, 3, 18, 13, 0, 13, 17, 10, 11, 2, 2, 2, 12, -18, 28, -6, 15, -7, 24, 4, 22, 5, 11, -17, 17, -7, 5, 15, 9, 13, 22, 0, 5, 37, 2, 20, 8, 23, 7, 23, -5, 17, 4, 12, 3, 5, -6, 1, 14, 12, 36, 17, 25, 17, 11, 13, 16, 24, 11, 1, 7, 12, 15, 0, 0, 28, 19, 11, 19, 0, 16, 1, 0, 4, 4, 9, -1, 37, 14, 11, 2, 10, 9, 16, -1, 22, -8, 16, 2, 30, 10, 2, 15, 4, 11, 34, 9, 20, -15, 0, 11, 20, 11, 12, -1, 1, 16, 1, 0, -5, 5, -6, 0, 1, 4, 10, 22, 0, 0, 2, 16, 8, 27, 14, 30, 3]
12.45761Cj4K2nNJ3mj4Nj1J6rNqJ6k5J2oJ8jMj7OQpTPJj5J6k3K2njJ8j8J0MJ3l3RLkj6pK0PLqj8
12.43269hJ1MpkJ6NoJk2J9pJ5j7QLqkJ8k9J7MLj1kQj2RqJ1Jj1Rj0NJ5j6J3j6NmJ6j8j0J5mJ7j2O
12.40827A2k0L1k4L9l8J9j8J0j3J6kOLj1Jj8NMJ5j2J1nj1oK2j3Oj6J4pJ2J1j5J4j4J0lpN%j0K4
12.38690B7l2J8r%K1k2J9j2MrJ8j1nJ3j9K3j0j4J1noRMKjJ%j6JLJ8l1J2nK1j0%LqkjPkK0j2KTj2
12.36248E%J6k0jQJ6k9OJ6j2Rmj9J4RPj3j0lJ8%NJ1k8J2qJ0j2JrNJ7j5J9j2j%OPk7J8j3K4oj2%J
12.33858FOoJ5j1oJ0Mj5mK0pj3J8j4QrK2l7K0nrK3LqlOpJ3l0K8Nj7Rj0LmkJ0j3oK1qj1NJ1j4Po
12.31416bJ8mJ2oj2Qj4pJ2J9qJk4K3oTK2j1Qk5J5j8K2nrK4j7rOJ4j2pJ0Kjj1J0Jj1J8j9kNnK6k2
12.29076CRk3K7j6J2j4QkmLkJ1rJ0j6jLJ4o%j2QOoRj0J2lKnPj1OqPqRrOQl2J8qLMLlkJ0PmJnJ1
$$ y = [3, -11, 11, 6, 11, 24, 20, 6, 11, 0, 16, 7, 12, 4, 20, -5, 7, 1, 19, 18, 22, 5, 11, 19, 12, 5, 12, 13, -2, 14, -9, 13, 8, 7, 25, 7, 17, 21, 34, 1, 10, 13, 11, -5, -12, 8, 15, 18, 10, -8, 3, 7, 0, -2, 14, 19, 13, 14, -8, 11, 4, 19, 2, 10, 13, 5, 3, 21, -8, 9, 13, 16, 5, 3, 11, -1, 8, 0, 11, 12, 1, 10, 0, 5, 20, 4, 17, 1, 6, 2, 18, 0, -10, 5, 1, 18, 6, 12, -8, 23, -1, 38, 0, 19, 1, 11, -2, 14, 12, 18, 21, 10, 11, -7, -2, 2, 17, 5, 16, 11, 0, -6, 16, 3, 9, -7, 7, 0, 12, 23, 8, 22, 8, 18, 15, 8, 13, 13, 3, 27, -5, 13, 4, 4, 25, 3, 22, 10, 14, 5, 23, 12, 7, 20, 1, 24, 14, 0, 11, 6, 0, 9, 13, 15, 14, 15, 15, -1, 0, 3, 21, -10, 2, -3, 18, 8, 8, 11, 3, 1, 0, 7, 5, 25, 13, 15, 17, 5, 5, 21, 1, 0, 8, 24, -5, 1, 17, 5, 14, 10, -9, 5, 14, 21, 8, -2, -5, 13, 13, 18, 29, 1, 13, 5, 15, 3, 4, -5, 0, 17, 2, 21, 9, 8, 8, 14, 21, -6, 12, -1, 23, 17, 5, 5, 6, 12, 6, 21, 10, 4, 14, 18, 3, -1, 19, 12, -1, 17, 3, 11, 2, 24, -13, 7, 2, -7, 16, 19, 11, 8, 14, 7, 20, -10, 18, 23, 6, 15, 5, 8, 4, 2, 12, -1, -7, 14, 6, -5, 0, 11, -3, 4, -2, 16, 12, 24, 18, 6, 14, 0, -7, 5, 24, 16, 17, -7, 16, 10, 4, 26, 15, 23, -2, 13, -5, 17, 12, 3, 27, 10, 1, 7, 21, 9, 2, 12, 14, 13, 2, 12, 13, 2, 20, 1, -1, 4, -1, 25, 3, 12, -11, 16, 0, 12, -2, 6, 4, 0, 3, 1, 12, 3, 13, -3, -4, -1, 13, 7, 7, -5, 3, 9, 3, 12, 2, 14, 11, 13, 8, 15, 4, 10, 2, 9, 1, 10, 1, 7, 15, -17, 1, -7, -4, 0, 3, 0, -2, 8, 15, 11, 12, 7, 18]
12.26329A8k2Q%J4j7J5j2LP%mJj0pJ9Qj8J1j0KTpK3k4MK2l6L2l0J0jPj1J5kj9J9%j7PJ4j7lK4j8
12.24039@%loJ8K6k9oj7J0PKpLPNj3J3kOk1J5nJ0j1mPj0L0k8J7j9K3j6pJ7kn%LJ0j6J5j2J5k6L1
12.21699B5j8J8k9OPQk2J3rLJ0mk1L4k4J8k3K1j1J2j6J4j5KrK1j0J9j3NJj4jK2k7J3Nj4oJ3Okq
12.19512@K1jk0KLkJnJ1j2oK5j8OJ2mj3QpoJ1%KJ5k4K1qk0K2j7K6k4J9k1NRk0K0rLloJ5%j2OmJ1
12.17070A2j4J1knj0J1oJ5jj9NJ2k5L6k3J3qJ5k1QJ4j9RoJ1nL%Tk0J9J8k1rJ6n%ljrJ8J0qk1K4
12.14781A9j4rJ0RoLk5K5J0k0J5j7OLk0K0j1J5l2K5j0PRlrJ2j6RLnJ0j0ROj5MRj1JqK1k6J1J6j7
12.12492ClRnj1MmK0q%Kk2K4JkqJ0j0qLJ3J8m6M0rMj5NOj6L7k1Kj3J4j4POUj9J2j1J4k1K1rj7q
12.10050a3K6kmQk2J3j5K0oPojk1K3oJ7pTj3J1MoJ7J4nj8j4K8j6j7NTJ5j7J2j1K7k8J0j1LnK3k
$$ y = [18, -4, 4, 4, 18, 1, 16, 4, 7, 14, 14, 10, 11, 1, -6, 13, 21, 3, 14, 4, 6, 8, 1, 24, 0, 4, 26, -10, 22, -8, 2, 1, 8, -3, 12, 10, -9, 10, 10, -7, 0, 14, -3, -6, 18, 0, 0, -3, -9, 9, 35, 6, 0, -17, -7, 0, 2, -5, -2, 5, 10, -3, 10, 8, 14, -7, 8, 3, 13, 2, -2, 5, -5, 25, -3, 14, -5, 18, 2, -5, 12, 10, 5, 5, 8, 18, 2, 17, 5, 20, -6, 25, 7, 25, -4, 2, 9, 17, -5, 8, -1, 2, 12, 8, -13, 21, -3, 15, -8, 13, 2, 14, -2, 12, -3, -1, -10, 11, 1, 20, 7, 12, 13, -1, -2, 20, -7, 6, 11, -3, -9, 4, 10, 8, 0, 21, 20, 0, 2, 5, 3, 4, -1, 10, -2, -8, 17, -1, 5, 17, 13, 0, 8, 1, -5, 6, 6, 8, 23, -1, 20, 12, -8, 14, -3, 23, -1, 18, -3, 2, 11, -9, 11, 2, 5, 2, -4, 11, 11, -1, 5, 1, 12, -2, 9, 7, 2, -8, 3, -3, 12, 11, -8, -3, 9, -16, 20, -3, 10, 2, 17, -4, 4, 18, -1, 8, 2, 13, 8, 11, 11, 11, -9, 10, 28, 7, -2, 14, 9, 9, 6, 5, -4, 14, 24, 16, -5, 19, 5, -4, 6, 15, 9, 12, -13, 12, 22, 2, 17, 0, 6, 9, -11, 9, -2, 13, -19, 6, -4, 3, 12, 9, 0, 12, -4, 5, 8, 3, 13, 3, 12, 18, 3, 7, 16, 5, 6, -2, 19, -7, 4, 20, 3, 0, 9, 4, -7, -3, -7, 13, 5, 5, 7, -15, 9, 10, 8, 0, 10, 0, -8, -5, 8, 26, -20, 20, 11, 15, 0, 5, 11, -5, 32, 11, 13, 0, 14, 0, 7, 13, 19, 25, 6, 18, 7, 21, 0, 21, 12, -5, -13, 13, 11, 7, 15, -7, 6, -9, 11, 5, 12, 6, 5, -16, 7, 1, 18, 11, 4, -9, 2, 6, 0, 17, 31, 26, 8, -6, 22, 6, -11, -6, -1, 14, -3, 9, -2, 25, -3, 7, -4, -1, -6, 17, 15]
12.07812A5j5PnMrlNTLPKj2nMkOLpK1k6NPRj3J4qj7QJ3j5Pj4J0k0J6J0J2k%k0NoJ1nRj4Rj9M0k6
12.05268DQRjk1L3m8J6KPlj2J4rJ7qPj8K3k8J5J0kj4pOK2p%knj0RQJj6j0J9Rj4mJ4j8J0nQnK4k3
12.02826EQj2NoRJ0ronKJ9kj2kqJ5Nnpm%Nj5J0J4Jj6J1%oJMlMj1QrLkLK1j7Lj4NK3j1NJnLmJj1j
12.00028AK4j6Nj8J5kLj9qK4Jlj4J2NpJ7kroJqJ4nkKJ6j7mJ3L%j7K3j7J7l2K1j8K0Qk5MRJ2nJ%k
11.97536A5j0L1l2nJ4Nj1jLPjQl3K8okj7K3j1j5J3j%K2k5MNUnopKK0j3k2J8nJ6j5%J9k3NnJ1Oj6
11.95094blK6mj4KJ3j7QqJ8nOj7J9j8MLm%J5Ok0J1k4J9J1k7J6j4RrJ6j6K2l4J8oJ4j0J1j0J1j4k
11.92855@%J0Mk4K7j4K3l4J0J1Lj0moJNj6K3j4NK0nl5K6LPrk5J6KOLpRnmLQj4QJ0j0%Onj4K2rj2
11.90363eJ2oJ9j0RmqmPJ4j5OjJ8j9J7rlNj9K1mj1J0kj1nK1k0qL4k0j4K6j2J1qlJ0%mNpnj5K5l
$$ y = [15, 0, 7, 2, 6, -3, -6, -1, 4, 7, 14, 16, 4, -1, 3, 1, 7, 10, 3, 24, -2, 3, 10, 19, 6, 20, 12, -5, 3, 16, 1, 8, -6, 4, -16, 0, 10, 22, 20, 20, 0, 5, -1, 10, 5, 14, 0, 9, -10, 30, 4, 12, 21, 20, -1, 32, -16, 0, 2, 9, 6, -6, 8, -1, 16, 8, 15, -3, 20, -8, 7, 17, 15, 1, -6, 0, 22, 15, 15, 13, 8, -2, 7, 15, 16, 0, -10, 9, 18, 4, 0, 14, -4, 6, 1, 9, 4, 28, 5, 13, 1, 6, 0, 9, 19, 10, 4, -1, 1, 20, 18, 6, 4, -4, 11, 16, 11, 4, 0, 0, 5, -10, 0, 14, 15, -1, 10, 10, 4, 5, 9, 6, 10, -1, 7, -2, 1, -1, 2, 23, 6, 9, -5, 0, 23, 12, 17, 18, 13, 16, 12, 13, 2, 1, 25, 9, 14, -4, 11, 9, 12, -7, -15, 9, 10, 7, -7, 5, 10, 3, 20, 18, 9, 3, 4, -4, 10, 5, 3, 5, 21, 4, 0, 13, 16, 16, -1, 22, 5, 22, -10, 11, -7, 13, 21, -4, 0, 9, 21, 16, 17, 17, 15, 5, 36, 4, -1, 13, 18, 7, 6, 9, 16, 15, 23, -10, 18, 12, 10, -7, 16, 5, -10, 3, 2, 2, 24, -1, 3, 8, 13, 18, 13, 7, 0, 2, 22, 9, -13, 5, 0, 16, 1, 1, 20, -3, 2, -3, 8, 14, -2, -5, 21, 17, 3, 5, 18, 1, 9, 1, 19, 14, 20, 3, 22, 4, 8, 11, 7, 7, 22, 28, 8, 19, -5, 14, 25, -2, 14, 0, 9, 0, 16, 0, 22, -12, 6, 0, 14, 4, 15, 5, 16, 2, 0, 0, 10, 14, -10, 17, 3, 26, -8, 2, 13, 16, 6, 2, -4, -3, 2, -14, 9, -5, 0, 20, 15, -20, 6, 9, 16, 7, -18, -2, 0, 6, 9, 2, 11, 6, 2, 5, 13, -1, 7, 17, 7, 7, 13, 8, -6, 16, 7, -5, 7, 1, 20, 10, 19, 15, 7, 3, 10, 24, 9, 15, 14, 32, 13, 30, 21, 18, 23, 4, 25, 21, 10, 20, 18, 7, 2, 23, 3, -5, 29, 9, -5, 21, 9, 20, 12, 9, 19, 19, 15, 20, 13, 8, -7, 18, 15]
11.87972A5j5J4nkOmrJ2Pj3KlJ9lk3LK0qPk5J5pK5k0nmJ7NlqKJ7k2J8k4K4k0OPmj4J6lkK8l5K1
11.85581B5k6L1rk2J8rPj8J2J9j3J8j7Kj3J7oTkJOoPqNlJ0Ljp%oJ0Oj0Tj1J5J2LKj8K7k4K4k7J3
11.83190B1OqJ1qk2K3nQj6J6j2QJ2pj2J2jj1JTRkj2J5OTl0R%Rj1J3jJ2j8%RrJJ0j1J2k1J0TnmOJ
11.80697C1J2qLJ6l6ROj1K4lQqnj7K3k9K4KJ8l1K5j8J2k2K6Jkj3J4J%Rl1J1J4oPlpj5J5qJK6opN
11.78306E7%MJrJ1RLJ0k4J9j4J5lmK2k7J9rJ3K0j3RPnmJ6Jj5L4Jk2MK9j7L0j3J4jJ5Ok1J4J3QJ9
11.76017B22jJ6K6KJ2J8J2J9LK1RK2J7L5K9JJ7N0K2L2QO0J5L5M3N5L3N9N2O5P1O4R3M8J03Q6J27
11.74135A601Q4J31J10J26J20J02J24R5J28P5M4M1L9j3ll4q0o5p6r8j14j13j09j11j12j20j21r5
11.72710A556r1r7j07p4o5q2n3o5m2q1k0n2m2l0k9l3m4l1m5J5l7k6l0Rk4ql9pj6j1lj8j9KOk1k2
$$ y = [15, 0, 14, 9, 7, 13, 9, 0, 12, 19, 6, 8, 5, 24, 21, -2, 1, 21, 13, 20, -5, 10, 3, 28, 8, 3, -1, 16, 21, 18, 10, 12, 29, 7, 25, 1, 25, 5, 11, 18, 14, 0, 16, 13, 11, 39, 4, 25, -1, 30, 21, -1, 17, 8, 15, -3, 9, 28, 15, 33, 16, 18, 5, 22, 16, 10, 8, 9, 15, 9, 16, 8, 13, 10, 20, 23, 22, 15, 15, 9, 19, 25, 15, 5, -6, 9, 21, 24, 26, 8, 35, 11, 35, 8, 21, 27, 19, 30, 22, 0, 23, 18, 26, 10, 26, 14, 22, 34, 27, 15, 27, 26, 15, 16, 17, 26, 24, 12, 27, 33, 39, 9, 18, 18, 27, 16, 29, 28, 40, 22, 22, 31, 22, 23, 33, 22, 34, 13, 23, 33, 28, 24, 30, 31, 43, 35, 38, 54, 18, 27, 33, 22, 46, 43, 51, 43, 38, 21, 44, 15, 39, 41, 59, 28, 53, 35, 47, 25, 51, 52, 50, 37, 51, 52, 52, 61, 30, 41, 55, 49, 56, 53, 46, 31, 46, 38, 39, 65, 59, 52, 57, 57, 61, 62, 53, 64, 73, 76, 86, 62, 81, 67, 82, 79, 75, 97, 70, 89, 80, 93, 113, 100, 109, 116, 111, 107, 123, 124, 109, 143, 144, 122, 126, 155, 138, 168, 155, 169, 168, 183, 189, 168, 182, 195, 203, 222, 221, 237, 263, 265, 277, 295, 307, 326, 329, 350, 359, 381, 398, 433, 462, 463, 480, 530, 552, 584, 592, 652, 667, 702, 745, 800, 833, 892, 944, 1009, 1080, 1144, 1237, 1285, 1388, 1474, 1601, 1685, 1816, 1926, 2052, 2172, 2274, 2398, 2493, 2621, 2696, 2740, 2781, 2820, 2807, 2804, 2770, 2690, 2625, 2549, 2451, 2337, 2224, 2115, 2004, 1892, 1772, 1651, 1556, 1465, 1368, 1261, 1187, 1122, 1040, 987, 922, 880, 799, 779, 727, 685, 655, 626, 593, 549, 518, 473, 488, 451, 425, 395, 404, 380, 372, 333, 326, 310, 299, 296, 278, 259, 261, 267, 246, 224]
11.70828B24kLk0qoJ1rKk0QKk4J8j5Tj2J1j5oOpJ8k8J1j3Jjnjlj2K1j8Oj8J5Nj5JPpPj2J%JpNj7
11.68336F8MJ0qNPpPNl0J1mj3J6j0lPMk3K7oLJ0j8kJ2k1J3J2k0J5j0J0j9KJ0j6j4J6j1QJ7k8J3
11.66148D9k1J9j1mKJ5lj8J9j4mqL1k5K3jqK3k0k2J1J6j5jRk1OqM0k5jlpMNK5l4kJ7lj4K5k2j1
11.63910A3K2RLj5J2l5K3qRnNmj5J2MLnmnMOknJ3Mj9J1jl0L2j1pJ3Rmj3Qrj6K9l3K2pL1j7j6jP
11.61468A7L0k8NroJ6J4j0qQj2J4k4K5j4%J0rJ0rj0K1KJ4l7M3m0RrNmlTOTNk4J9mKj5K3JoQkrMm
11.58975A8oMJqpJ8j1KJ4Qmj6J0j1Rj0J0lLQJ1k9jJ0nMnJ8k7J0%j1KlJ1J2lj1rJ4J0j8J6lmTLJl
11.56483A5pJ8jj6J4j3K5l5J2poJ6Pojk0K2qjMQk1L4l2L3k7Mj3K4j9LRJ0j7oJ2JOrmJ1qJ8k7K2
11.54193B4k2J2Okk6L2j4J7lpkJRkj2J0jKl1L4k4K0j1kqJ7Qj4kTJ8pj3NqPpJ8k1L0j4pj6K5Mjj0
$$ y = [224, 222, 225, 205, 197, 191, 202, 193, 195, 175, 183, 185, 161, 179, 164, 149, 137, 148, 133, 127, 133, 126, 144, 116, 127, 114, 115, 114, 109, 108, 105, 93, 114, 96, 102, 84, 99, 104, 89, 90, 97, 90, 97, 85, 86, 86, 87, 80, 85, 68, 72, 82, 74, 79, 86, 79, 86, 91, 61, 72, 68, 55, 71, 61, 58, 65, 69, 46, 73, 67, 70, 80, 62, 60, 72, 51, 64, 76, 56, 71, 61, 71, 52, 54, 64, 48, 34, 50, 39, 47, 64, 36, 49, 28, 47, 36, 32, 34, 49, 46, 28, 47, 33, 29, 21, 52, 27, 50, 49, 41, 64, 44, 22, 33, 49, 34, 33, 42, 21, 27, 19, 59, 34, 33, 30, 23, 27, 32, 57, 23, 21, 38, 35, 21, 46, 24, 13, 35, 44, 47, 32, 44, 9, 32, 24, 33, 28, 33, 29, 14, 26, 30, 33, 28, 24, 19, 23, 29, 27, 22, 35, 39, 20, 31, 30, 0, 32, 21, 14, 27, 36, 32, 19, 27, 18, 2, 31, -2, 20, 13, 44, 27, 11, 10, 17, 47, 19, 24, 15, 9, 25, 39, 29, 21, 29, 17, 31, 7, 32, 18, 18, 28, 19, 29, 20, 10, 31, 33, 47, 10, 53, 13, 22, 13, 18, 14, 11, 8, 14, 20, 25, 1, 20, 16, 18, 3, 26, 27, 21, 29, 27, 18, 22, 18, 12, 16, 17, 9, 2, 20, 9, 11, 25, 33, 29, 13, 23, 12, 21, 11, 21, 18, 21, 29, 40, 11, 10, 20, 15, 19, 14, 32, 5, 15, 15, 4, 6, 3, 14, 26, 23, 12, 3, 17, 27, 9, 25, 22, 18, 14, 17, 18, 15, 8, 26, 25, 9, 23, 10, 35, 0, 12, 5, -1, 15, 22, 16, 15, -5, 17, 9, 8, 12, 20, -1, 33, 1, 34, 7, 11, -2, 22, 3, 6, 15, 25, 8, 2, 14, 15, 21, 12, 8, 19, 11, 29, 2, 24, 2, 14, 20, 18, -8, 24, 10, 27, 24, 17, 15, 16, 25, 23, 11, 21, 20, 22, -9, 25, 1, 21, 10, 8, 0, 17, 25, 11, 9, 7, 25, 18, 5, 10, 2, 9, 2, 20, -1, 29, 15, 8, -8, 17, 21, 20, 10]
11.51802A0Mj8LlJ5kK7j9rNoPj0PLj2K9k1n%J5J0j4%j2J4j3Ojj6PLKJ1nTlKTJ7j7qOPjTJRj0J7
11.49259B8l6K0qK5qrQk0J8j7K4l1QORKTnqlkJ6lkrNrLkJ4Kk1jKQJ5k4QRrmK6k2J6j9J5p%l1L2N
11.46664A6k0J2qJlL8l7P%Kj3J9oK2k6kRj3J4oLoJ4k5K6j1J1j8J5j5J5nMJ1jj8j4L4j6qPpJ4j8
11.44426bJ1kJJ6j5J0pJ0j4K3j4Jnj8QJ4j7J5k6K5j4J2k2J1K0rNk5QoJ9jomTOmJ7k3K0k9L5j1p
11.42188BJ2rj2K7moqjJ6j4ljPJ2rnOlj1J0j8J9j8K8j0J2Jk0K5k0J3l1K1mknTJ4lK1j7oJ0j6K6
11.39899B1j9J4kLrjLKk0J1pJ2j2L%J9j0k1J7nL3k2jk3K9pq%Qnpj7J7K9k5klPJ6j8j0K5kmJ1mn
11.37508A1j1K0j6mpK7qj1J7mj0K1mk1QpjO%Nj3Oj2K5k6K2jnkLj4PqPp%J6K2j8j3qJ2pJ3j0LJJ1
11.35066A5j6NMrKJkpJ0qJ1j3J7Qj6Mmjl%Qk0M4j8nj1Rnj3LK1j0J2j3K5rJk6K2j3J4rOk9K5jqRl
$$ y = [10, 14, -4, -1, -4, 11, 9, 36, 17, 8, 13, 7, 14, 4, 11, 14, 2, 31, 10, 5, 5, 20, 30, 16, 16, 4, 18, 5, 11, 10, -6, 1, 4, 6, 17, 12, 7, 4, 6, 8, 25, 8, 0, 6, 13, 12, 11, 12, 21, 11, 28, -8, 12, 4, 29, 21, 12, 20, 0, 18, 1, 25, -6, 2, 8, 17, 19, 21, 16, 8, 5, 3, 19, 16, 14, 5, 10, 1, 4, 2, 16, 18, -3, -4, -2, 6, 21, -3, 5, 14, 5, 1, 27, 5, 21, 2, 17, 10, 10, -21, 11, 16, -4, 8, 0, 1, -2, 36, -1, 6, 6, 8, -5, 14, 8, 30, 4, 2, 11, -2, 12, 6, 9, 3, 17, -8, 18, 7, 18, 0, 15, 0, 15, 10, 14, 25, 24, 6, -8, 26, 10, 2, 9, 2, 16, -2, 9, 7, 8, 24, 9, 19, 12, 22, 8, 31, 17, 18, 13, -5, 3, 17, 0, 15, -11, 14, 0, 12, -10, 1, 21, 12, 17, -8, 0, -6, 13, 12, 6, 2, -2, 4, 0, 17, -6, 14, -15, 20, 9, 2, 14, 5, -7, 20, 16, 10, 2, 1, 17, 3, 0, -1, 6, 18, 9, 4, 10, 7, -4, 6, -12, 7, -11, 17, 7, 19, 20, 0, 25, 5, 18, -13, 8, 4, 2, -3, -8, 6, 3, 24, 7, 1, 11, -5, 21, 2, 16, 14, 17, 8, 7, 10, 12, -8, 3, -4, 8, -4, -1, -1, 18, 8, -13, 4, -1, 32, 10, 9, -14, 15, 8, 0, 0, 8, 3, -4, -21, -4, 25, 0, -2, -5, 2, 18, 0, -10, 15, 13, 9, 20, 16, 11, 0, 20, 4, 0, -7, 20, 12, 1, 18, 14, 4, 25, 21, 0, 8, 1, 0, 6, 6, 11, -2, 4, -8, 17, -9, 13, 12, 7, 5, 8, -6, 1, -7, 0, -7, -7, 9, 31, 13, 0, -8, 4, -3, 10, 0, 3, 4, 15, -1, 4, 8, -1, 1, 2, 0, -7, 3, -5, 6, -7, 10, 18, 2, 6, 2, 1, -2, -2, 6, -14, 30, 12, 7, -4, 5, 0, -13, -10, 11, 1, 13, 0, 25, 16, 17, -9, 13, 0, 14, 5, 11, -18, 7, 6, -2, 7, 4]
11.32573DJ7k1J1rJ9j6L1n3K8kK6l4qMJ8J6l3J8j6Qnj1J3J9j5Lpk0K8j2J3k2QJ0nKkJ3k8J6j8M
11.30437hJ4KrJ1oRj1JOj1lK2k0J4KqJ2Jj6K2l3PmK2qJnTJTJ1mMj5J0j2J2OPkk0J0Pk2KJ6j2j1
11.27995a2K3JrPOk0MJ0J9k9J6j2Nljlj5L5j8KqJQk1K2j3K3k6K0k7K8j5J2JlqPlkOQoTmQk4L5l1
11.25553a2J1nJ9%mklNnOJ0k9J9j3PTmrKqK5j3jT%TmNlL7m1J3j1%j1K1Njmj3OJ1kj2J1Nrj0jK0o
11.22958HOj3NLpKJ0j4PpKjJrK1k3K5j0J5k8K1olmK9k9MnmMLKk0J1OJ1Pj6%jJ0jj0NTj2Qj5j1K0
11.20415BoJ7pLj1Mj9K6MqMJoj0J1QjJ2k5nJ1J4k5N%PJ1j7jQj1Mj3L5l1NJLJmLJ0njNj1JKmJ9l6
11.17820b0K2Nj1OJ0j2Mlk1L1Kj7%QpJ0Q%TnRk2J4j9J7kk2K1qQj4MOj0J9%JTMk2N%mKK5j8kj0J7
11.15328A0lpK2l4nK9NrOMj8oJ2pRrJ1j0KlQrkTK7j8J2qk4L2prnKNqJ5j3%J9Jk5L2k1NOl6L3rMl
$$ y = [4, 21, 0, 11, 2, 21, 5, 36, -17, 11, 9, 35, 1, -7, -3, 15, 31, -2, 16, 0, 8, 3, -8, 5, 24, 9, 12, 5, -15, 13, 1, 14, -8, 0, 10, 5, 7, 5, 18, -10, 6, -12, -8, 6, 8, -1, 10, 4, 13, 2, 3, 9, -2, -5, 17, -3, 11, 13, 5, 17, 18, 2, 24, -9, -2, -6, 16, 8, 9, 4, -1, 0, 1, 12, 8, 12, -3, 7, -5, 7, 13, 20, 18, -2, 8, 15, -7, -5, 11, -1, -12, 11, 12, 3, 10, 16, -4, 0, 10, 29, 0, 16, 4, 9, 6, 5, 2, -13, 22, 4, 6, -2, -1, 7, -14, 8, -5, 18, -8, 12, -15, 13, -2, 10, 11, 8, 0, 7, 4, 2, 8, 16, 10, 4, 0, 8, -16, 19, -12, -1, -6, 13, 13, 9, 7, 4, 9, 4, 10, 20, -9, 10, -3, 4, 11, 7, -2, 0, -8, 17, 4, 3, 2, 2, 2, -2, 3, 0, 37, -4, 9, -2, -2, -13, 8, 13, 12, 8, -5, 1, 12, 10, -2, 9, 14, 5, -5, -6, 14, 8, 14, 1, 6, 9, 2, 4, 14, 0, 7, 0, 2, 1, 2, -7, 14, -9, 16, 6, 21, -7, 14, 8, 5, 1, 30, 1, 5, 0, -4, 0, 3, 5, -15, -4, 2, 13, 20, 4, 4, 3, 13, 12, 2, 7, 12, 0, 8, -7, -18, 2, -4, 13, 6, 9, -2, 2, -17, 9, 13, 5, 9, 10, 4, -6, 5, 13, 12, 24, -1, -6, 5, 19, -6, -1, -1, 6, 17, 0, -1, 7, -4, 0, -13, 22, -9, -4, -3, 0, 1, -3, 0, 10, 5, 4, 9, -2, -1, 1, -3, 16, -20, 2, 7, -4, 2, 12, 0, 4, 1, -20, 11, 13, -4, -4, 4, -3, 7, 15, 15, 15, 10, 19, -3, 11, -8, 9, 7, -15, 6, -2, 6, -8, -4, 2, -8, 11, 11, 12, 13, 17, -5, 0, 0, -4, -2, 23, 5, 3, -7, 10, 7, 0, 22, -12, -17, 12, 17, 8, 14, 18, 0, -6, 6, -1, 8, -1, 10, 0, 2, -1, 7, -2, -4, -6, 21, 3, 15, 7, -17, 15, 8, -1, -6, -4, 1, -7, 8, -5, -5, 14, 15, -10, 22, 1, 6, 12, -24, 9, 0, 4, 1]
11.12733AJ2j5LqOLpJ2pkjj5K3j2K8k5ljPlJ5j8J4Kj0J0NrLj8J7Jj4J1NjrMRMRl6K7j8J6j3pNj3
11.10241a3JK3rNqJ6k5RKJ3lj3PoPkpj1RJ5nQk2K4l0J9ProJj%QJ2k8L3j5Qj1NKj5J1mNj4Nj3J7l
11.07697ak2J4TnQJ1k6K4j9OkJ9j8%j5MJ5nj9J3KJ3oKk1K8k3J3joLOm3N2j1J7j2lJlpJMj2J1rK
11.05306fJ9j8PTpJ4k1nQJ1j3%MK0j8j1RPk2MO%Qj3MJ6l0K5jrJ7oTPl2M6k1oJ1k1K0Ll0K3l%mLk
11.02814fjNJ4Jj9rM3l5ROnj0K1j8LJ0j5NJJ6j3J9j6Lj8J3qj%OLKmj3RkQRj7K2j2kmpoKJ5QrqN%
11.00168@Ll1J6QOqMQj6L2l6J4J6j6J3j0jRqOjj1J4qOjj8K3j2Mj2J7j4K0m1K8j4J1Kj2PRTlolj1
10.97777hKMJ0k1J7j7J1%J9j8mK5j3qJ4j8J5Jj6J6j6ROKj3J4k5NJ7lqRk4QK2k0OPj3kJ6k5J5oT
10.95488a4J0LjrL0j1qlKO%JMLk1RJ9k0Oj8J6Pl2K1kJ0qTOpK7k6J2oJ2j3J7j6L0k9MLk5M5m1K0p
$$ y = [1, 13, -2, 1, -7, -1, 2, -5, 7, 0, -2, -3, -18, 5, -7, 21, -4, -7, -8, -1, -4, 11, -7, 7, 9, -1, 9, 14, 5, 8, -10, 7, 8, -6, 5, 10, 9, 0, 4, 13, 17, 26, -10, 17, -1, 15, 2, -5, 0, -13, -12, 11, 2, 7, -1, 15, -10, -1, 1, 14, 11, -2, 5, -1, 6, 4, -3, -14, -5, 10, 5, 13, -9, 15, -15, 4, 11, 2, -4, -3, -4, -4, 4, 16, -12, 21, 6, 14, 3, 8, 10, -5, 6, 2, 7, -7, -2, -15, 2, -1, -23, -9, 5, 0, 8, 19, -7, 17, -2, 4, 2, 21, 3, 3, -12, -8, 7, 2, -17, -4, -2, 11, 5, 7, -14, 14, -9, 4, 3, -3, 0, 6, -37, 15, 4, 21, 9, 6, 7, 4, -3, -2, 2, -10, 1, -8, -6, 13, -5, 2, 9, 2, 16, -5, -10, -2, 9, -4, -4, 0, 20, 2, -9, 0, 7, -15, -11, -5, -5, 3, -10, -6, 10, -20, 5, 4, -5, 12, 6, 0, 7, -25, 21, 0, -6, 5, -16, 4, 7, -23, 0, -3, -3, -7, -4, -6, -7, -2, 12, 13, -6, -15, 28, -7, 2, 8, 3, -7, 14, -4, -1, 9, -6, -1, 0, 16, 3, 22, 6, 9, -9, 4, -4, -5, -5, 1, 4, 6, 2, -11, -2, -4, 4, 13, -4, 18, 6, 4, 0, -7, -13, -11, 4, 12, 3, -5, 0, 0, 3, -28, -12, -4, 2, -6, -2, 6, -10, 22, -14, 0, 16, 0, 13, 3, 2, 11, 3, 9, 8, -3, 11, 3, 9, 8, -10, 13, 1, 5, -7, 10, -4, 16, -25, 3, -11, 0, 2, -10, -3, 6, 15, 12, 6, 3, -8, -6, -2, 8, -13, 4, -13, -2, -2, 17, -1, -5, 20, 7, -1, 13, -5, 10, 11, -5, 11, -5, 4, 10, 12, -1, 13, -12, -7, 10, 7, -1, 8, -16, -8, 14, -6, 0, 7, -6, -8, 8, -17, -2, -8, -14, -4, -1, -2, -11, 19, 8, 0, -3, -1, 5, 5, 6, 10, 13, -8, 1, 20, 0, 6, -12, 4, 11, -21, 0, -2, 8, 0, -8, -2, -9, 18, -8, 4, -2, 10, -3, 14, -2, 28, -1, 3, 6, -19, 26, -15, 5, -2]
10.93097bj1KJ4nlOJ1rlOqJ2k0J9k0lK1joj4K7qLpOoJ0rj0LOMn%TlMkJ0k0LJ0OrlK0j2Kj0K5m2
10.90503b1K7lrMKJ0kmokJ9j3qK5rj4J5Nqj1JnQnJ2qlK1k5J5Nj1J0j1J1j4Nj1J9j4ONLj9K5%k3O
10.88061@Pj0J7j2kj1NJ1LqMK%j0%KOj2RMmoNmRMrOj5L2l3J9NrJ0k2K0qj5J0M%Lj1MJNrMLJ5j5p
10.85365cMqJRnQk7K7j8RoK9l5K5j0qQmQoRpkKjK6j8pkm%mPKJk1K8k1L1k5L6qjk8K2j5j0NOTj3P
10.82719aJ5j2kJ2rpQo%Jj2K4k5jK6j3PoJ7k7K0k0QLKJTPj7rJ0j1J9k%TK4m0L5j4TJ2Mj5K3k0KQ
10.80278F%oTJ1ojj3K1k1K8k7J5mJ5pj1qQNLoJ1j1J2j2j1J5PokNj4J0kJ3j6pJ4j2OQKrj4L9l0J5
10.77887Gj4J8%pjNmT%Tjj3%K1ojokOMjmoK3j5oPTj3QPnpRqTJ1mOoOJ4j1j4OToKOnj5mjNOlK3qj
10.74885CJ9k1J0k0J1Pjj2Mj4J1J0j6J1lpK0k8L6k0%lJ2j3NKpNq%j6K2KjMqRmjnQj0PNqJ4j4LJ0
$$ y = [-2, -13, -11, 3, -2, -5, 1, 12, 3, 0, 6, -2, 10, -10, 9, -11, -14, 7, 6, 0, -14, 13, 5, 8, 1, 7, 1, 11, 2, -8, -5, 1, 5, 0, 0, 0, -3, 1, -1, 9, -11, -8, 2, 8, -1, -4, 16, 4, 6, -4, 21, -21, 6, 3, -6, -2, 0, 10, 8, 4, -2, -4, 15, 2, -6, 19, 10, -4, 11, 16, 8, -3, -2, -7, 1, -4, 8, 0, -3, 18, -7, 8, 13, 2, 12, 1, 12, -2, 3, -8, 11, -3, 3, 8, 11, -8, 17, 17, -6, 0, 7, -3, 14, 2, 0, -11, -6, 5, 8, 0, 4, 6, 6, -4, -4, -2, 4, -8, 1, 5, 1, -5, 0, -4, 5, 9, 0, 6, -9, 23, -10, 9, 14, 5, 15, -7, 13, 5, -10, 0, 4, 4, 7, -4, 0, 1, 6, -3, 1, 4, 19, 4, -3, 1, -7, -6, 3, -2, 6, -21, 6, -12, -3, -9, 20, -15, 10, 0, -8, 0, -4, 4, -2, 7, 0, -2, 0, -1, 25, 7, 0, -2, -6, -6, -10, -3, -1, 0, -21, 7, -14, 17, -8, 28, 20, 19, -9, 13, -2, -12, -7, -1, 5, -8, -1, 14, 2, 0, 12, 3, -4, 4, -2, -2, -1, -13, 11, -14, -15, 11, -2, 5, -1, 16, -11, 9, -11, -3, 0, 2, 3, 4, 11, -6, -15, -5, -16, 3, 1, 1, 1, 25, -15, 20, 6, -8, 4, 8, -7, 16, -4, -2, 6, 6, 0, -6, 5, -1, -2, -15, 6, -15, 13, -14, 1, -3, 12, 5, -6, -14, -6, -1, 2, -4, 7, -4, 8, -4, -15, 0, 7, 1, -1, 4, -10, 0, -2, 11, -5, -12, 2, -10, -4, 4, 6, -3, -17, 22, -8, 7, -7, 11, 11, 4, 3, 8, 4, 0, 0, 0, -1, -14, -14, 7, 1, 0, -6, -8, -2, 2, 1, -3, -9, 14, -1, -7, 0, 7, -6, 2, 9, 4, -3, 6, -2, -10, 1, -3, 3, -3, 3, 17, 6, -8, -2, 4, -2, 0, 6, 1, -14, -18, -19, -14, -8, -11, 12, 4, 3, 22, 1, 11, -9, 2, 9, 8, -4, 0, -14, -3, 7, -9, 2, -1, -8, 12, -16, 20, 0, 0, -3, 9, -4, 1, 3, -4, 1, -7, -7, -23, -1, 1, 0, 4, -4, 5, 1, 0, -5, 3, -7, 0, 5, -3, 11, -3, 0, 10]
10.72393A0k5J1Tj9K0J7j4k4J3oJ1Pj2j3M3l9MLKj0K2pmj1J8JTj9JLmR%TMpKqP%J1loJPj4K5k0
10.69951aJ4j7kLTJ0k0J4pKJ0l3K4%kOj5LJ6lj3j2J4jK6j6%kTJ2j6NKjmMkRLk2RKpJ1j0QlpJ5n
10.67407Bj7K5rJ1j4J2k4K8j7oJ0J4j8PMj8MJ3j1qJ3lJ4JKj6J1Ll2L2j9J2jj8%J9k2L2j9RnPl2
10.65220b4K1J8qk2J8j6J0KlqJ3l%KOj0J3rJ3mMj9J5j3K4k5mNJ6l4M9l5KjK4k7J3j6K4j4nJ4okn
10.62931gJ1Lj6K0kmnL%j9J3PnKj7oRTJ4j4kKNj8QTpMJJ2Kk6J1mK2Lk6R%jk0K1k0K2PJ7m7K1Km
10.60387bj3J0J7k7J5j6J4nPj5J7J%jTLqpMK2k0J4oPopmTJ5%j1MjMNk7J9rPJ2Kl6L3j6J7%Mj3j5
10.57894a7K6qnOLKpqRj2pJ8J3nTLJ1j6nJ3j6J1j4J0Nj3MPKpJ9k2MrJ4ok9L3mj0K4l0J9%K3m0J5
10.55503aLRokrJ5j7J3Mk3K6k3J1j7J7%kPoLj1J4j5K5k2J8j3J7l2K3nNk5L3j9QlJ0j0Qj6QlRk0
$$ y = [10, -15, -4, 7, -12, 8, 25, 11, -13, 0, -6, 5, 12, 0, -13, 30, -9, -5, -2, 0, -10, 12, 5, 1, -10, 8, 9, 10, -9, -8, -5, -9, 0, 0, 0, 4, -3, -1, -9, -2, -2, 9, 6, 0, 1, 8, -6, 19, -1, 13, -4, -6, -3, 0, 10, -10, 4, -3, -1, 9, -24, 0, 0, -2, 4, -11, -8, 8, 5, -8, -20, -6, -7, 19, 3, 3, 1, -1, 11, -5, 0, 2, 1, -3, 1, -1, 8, 11, -11, -2, 0, -7, 4, -6, 2, -1, -8, 7, 2, -15, 10, 1, 12, -2, 10, -14, 14, -3, -9, 1, 15, -3, 4, 8, -10, -6, 7, -4, -12, 1, -2, 12, 13, 15, -1, 10, 13, -19, 13, -6, 6, 5, -13, -13, 6, -16, 16, -3, 6, 1, 8, -24, -3, 15, 7, -15, 3, -13, -3, -1, -4, -12, 1, -2, -2, 0, 6, -4, 9, 0, 13, 9, 13, -6, 9, -4, 20, -5, -9, -4, 12, -22, 27, -8, -6, -7, 17, -10, 3, -13, 11, -3, -8, 6, 0, -2, -7, 4, 7, -9, 11, 9, 5, 0, 3, 3, -16, -3, 4, -1, 1, -16, -22, -13, -4, 10, -4, -6, -4, 1, -17, -9, -1, -8, -4, -3, 9, 11, -15, -4, -8, 14, 17, -9, 0, 0, -1, -21, 0, -20, 2, 9, 26, -21, 0, 2, -2, -15, -5, 12, -15, 0, -16, -2, -7, 0, -15, 2, 3, 3, 2, 1, 4, -4, -11, -7, 15, -5, 9, 3, 10, 4, -3, -7, -11, 4, 4, -7, -3, -4, 0, 5, -22, -3, -12, -5, 7, 9, -27, 6, -10, 7, 7, 11, -2, -17, 9, 1, -4, 2, 5, 7, 0, -8, 1, -11, -18, 0, 13, 8, 3, 6, 17, 1, -4, 9, -7, 4, -10, 0, 5, -8, -4, 3, 5, -2, 17, -5, -1, -10, 4, -2, -31, 2, -2, -12, 12, -18, 1, 1, 24, -16, -1, 2, 11, 5, 3, -6, 9, -8, 5, 9, -14, 12, -11, 0, -17, 0, 0, -2, 5, -1, 2, -9, 5, -10, 15, -7, 11, -2, 15, -17, 6, 1, 6, -19, 14, -5, 3, 0, 10, 0, 8, -8, 0, -3, 6, -14]
10.53214a4J1K%Pk0J4j2KJ5j1J4j2J7k0J6j7J5qmLj0J8KQk3kNqL4j2Qlj5%lJ4l1QJ2j3K0j9J5rK
10.50925dQj4J6k2J1NOTlJj2nToJ0K1j8j0K0j2J5Pok1J2oJ8k9J8nK1j4nmRNqMmk3RL1j0j8J4jkm
10.48483dK4j8j0kJ4mkj5MKMJ8k2KjK3j6lOj8Oj0K2rJ3J8j7qlOj4J0J8oNk0J5nJ8j5rJ4Oj1j3l
10.46143a0J9Kj6NqJ4j9J9Rk9K6j2lrmK5j0JOjTj8K7j7QJ3k2Nj4J1j0K8k0K0j4J1oj6K4qKqKmR
10.43854Gj7J4mLlqlRnK3qj5J0l%mKk7M6l9J8kjJ8k7J6mQj2MLJ2k5K8Kk1KNj4J7j3K4l3J8okRrM
10.41361cLj4J9k9J6j2J5NTmNj6O%nklPnJ0Mj0lL4k8J9rj2KJ8j6mQj7K3p%KMj5OJ3k0JMJ4j2QnR
10.38818IqLj7J0J3j7OoJ8k3K6j7kRQpkj7J0NrJ4j3J5k3J1Nj3K0j9Pj7J6Mj1QMpRKqLJ8rLj9RjO
10.36325FlTOnMlj1J0j2J6Lj4RLOk1moL3k1roM4m3L7j5Lj5J2j1J0pJ1Opj4J4lLQj4J9k1K2Ok6kM
$$ y = [-14, -3, -1, -1, 6, -14, 0, -12, -10, 5, -6, 8, -4, 13, -7, 9, -8, 7, -1, -5, -2, -12, 6, 8, 16, -7, -9, -4, -12, 22, 10, 18, 15, 0, 0, -3, 11, -20, -12, 0, -13, 7, -12, 3, -6, -4, 4, -10, 6, -16, -5, 0, 6, 12, 9, 10, -2, -7, -12, -18, -8, 13, -5, -15, 5, -7, 8, 15, 9, -12, 0, -6, 12, -17, 1, -4, 17, 3, -2, -6, 3, 8, 0, 4, 0, -23, -14, 17, 7, -11, 3, 2, 0, -4, 20, 2, -8, -10, 4, 0, -2, -17, -13, -11, -7, 11, -11, -9, -10, 13, -3, -6, 0, -18, -12, -22, 0, -9, 4, 22, 5, -3, -6, 0, -14, -4, 14, 8, 13, -7, 8, 3, 21, 6, -3, 11, 17, 6, -7, -10, 9, 11, -5, 0, -8, 6, -13, 6, 15, -14, 12, 0, -3, -12, -16, 9, -1, 0, 6, 5, 4, -14, 13, -4, 4, 17, -5, 0, -14, -3, -13, 15, -5, 15, 1, 12, 6, -10, 14, 6, 8, 0, 2, -2, 7, -10, 4, 0, 3, 0, -8, -11, -2, -7, 16, 8, -7, 3, 0, 0, -4, -2, -29, 17, -22, -4, -6, -7, 11, -16, 0, -4, 4, -8, -4, -1, 11, -14, 14, 16, -5, -3, 2, -12, 5, -8, 16, -17, 1, -5, -7, 2, -7, -3, 0, -14, 5, -24, -8, -20, -5, 0, 5, 1, 6, -10, -4, -4, -9, -11, -14, -7, -12, -2, 2, -8, -11, 23, -5, 14, 5, -7, -5, 13, -3, -7, 1, -16, 7, 0, 0, 2, 6, -9, -3, 10, -10, -9, -5, 9, -3, 5, 0, 9, 1, 4, -13, -3, 10, -7, -1, -7, 11, -12, 14, -3, -5, 4, 12, 5, 3, -14, -4, 1, -8, 6, -7, 8, -15, -4, 1, -12, 8, -11, -4, -21, -5, -1, -12, -4, 0, -7, 2, 4, -4, -1, 17, 8, 11, -8, 1, 0, 6, 3, 0, 6, 1, 5, 2, -9, 1, -11, 5, 8, -6, 3, 6, 12, -9, -13, -19, 14, -7, -16, -22, 22, -21, 16, 1, 4, -11, 1, -10, 0, -7, 4, 10, 3, -11, 3, 0, 3, 11, -3, 16, -5, 17, 23, -3, -5, -1]
10.33883aJ%Jj3J0KOj0J3j0LJ2j4Nkj5K3l1K6j6J6j8RnQplJ2kJ1j1lQj0j4NJ1joJK7l7L5j8J4j6
10.31543dQj2mK3j2J0k0NJ1mJpM%pnKJ6j0jPJj1K3j0%j1jNOQk4J3j3L3m2K4oKJ4k0QnNKLj1QJKN
10.28949A0j4J1pj1K4j2J1l0QjJ0PqJ0rJMOj8J3nNj7K9k7J2qJ4l0RPk0J8LJLqR%j4J4Moj7K0j1
10.26609a0J4j3J1k0J8j5K1rLjTkMQqJLJ1k1nPMrK0j5J1j8K7k2%OJ1j5J5j5qJ3lk0K2j2J5j4J5n
10.24319aKqLJ1rTJ5qJ0l3K6pJmKK4j7Rj5J3j8J1MnJ5j6J8j9MkL2k5j3K0j6JjJ4knKlPj6J6j2K
10.21928bJ8ok0KJ4j1kKJlJ4j5Qj3MRj2JJ8lULnNlQjj4K9j7j5K1j5J5qjj0NK2k0MKlj0j2L5j0K
10.19436Ej8K0j4K1l8K7Qj1j2RJ0lJ4k5J1j1QJ4j6lmJ3nJ3j2jRrlOoj5JK5k4%J8jQj0J%jJ0j1Jl
10.17045dJ1j7J7j3PlJ4k6J2KpJO%j9J4%NjmjK2k3Kj2K0Oj5JJ3k1J0j3L2l3J9j0QoJ4j2J9j0TN%
$$ y = [-1, 0, 0, 1, -12, -2, 0, 6, -4, 9, -1, 2, 14, 0, 5, 3, -12, 11, -20, 6, -10, 6, -12, -3, -8, 0, -7, -10, 2, 0, 11, 0, -3, 5, -5, -19, -14, -3, -4, -10, -9, 18, -19, 16, -2, 12, -4, 4, -8, -12, 11, -1, 9, -11, -6, 5, 1, 2, -5, -1, -1, -8, -13, -11, 5, -5, -6, 1, 2, -9, 14, 4, 4, -7, -8, -3, 3, 11, -13, 0, -13, 20, -22, 2, -4, -2, 12, -8, 0, -5, 0, 2, 5, -6, 2, 3, 5, 10, -4, 7, 0, -11, 13, 1, 12, -18, -10, -11, -1, 6, -2, 8, -1, 0, 4, 10, -8, 5, 0, 5, -12, 17, -10, 2, -6, 8, -22, -13, -6, -26, -8, -5, -4, -1, -9, 0, 0, -14, 0, 4, -2, -19, 1, -10, 4, -9, 2, -18, 0, -15, 6, -3, 0, -1, -2, -4, 0, 8, 0, 1, 4, 15, -6, -11, -4, 0, -9, 11, -4, 7, -11, 16, -6, -6, 0, 11, -4, 11, -4, -12, 1, -2, -22, 0, -12, 3, -11, 4, -1, 1, -7, -4, 7, -2, -11, 4, -4, 6, -27, -1, -8, -7, -11, -9, 15, -2, 7, -8, 5, -13, -2, 2, -3, 12, -4, 14, -5, -1, -3, 29, 4, -9, 11, -5, -4, -5, 9, 7, 2, 4, 1, 8, -8, 8, -4, -2, 16, 10, -10, -8, 6, -5, -7, -5, -4, -7, 7, -8, 0, -13, -9, 0, -12, -11, 7, 4, 1, -2, 1, -4, 1, -2, 6, 5, -9, 20, 3, -12, 9, -6, 9, 1, 0, -10, -5, 17, -3, 1, 3, 0, -10, -22, 13, 3, 5, -13, 7, -7, 14, -24, 3, 11, 0, -12, -3, 7, 4, 18, -7, 4, -7, 1, 15, -1, -4, -8, 5, 0, 13, 1, 0, 9, 0, -3, 3, -3, -18, -17, 8, -16, -16, 2, 1, 9, -1, 0, 0, -1, 9, -2, -1, -4, 7, -10, 7, -6, 1, -2, 12, -14, -2, 0, -7, -6, 0, 0, -19, -5, -5, 0, -1, -5, -6, 16, -7, -5, -17, 3, 9, -6, -5, 8, -13, -3, -16, 16, -17, 2, -8, 0, -6, 8, -4, 15, 5, -5, 0, 0]
10.14705@j2%oJ4Nj%nPk2K3j9J9j4K2l3K7lpQlOj2JMkj5J0jRmj3J4J3j0j3jK3j8K0k7K5j4NOLk2
10.12314a3kJ1J0j1mK8m8K6%qkopK9Jk3J8Omj7nM1k5Nj0J0j0J5l1L4j0J2j7Ppj5J9nJ3Kl%MTj5
10.10025cJ3j8OlUJ0mKTpKlJ2lNoqRPk1JJ3j0lLMN%Olj4Rr%J6j3KJ5j1JoPp%nK0k3RLQj5Qj1J7q
10.07176ejRlJ%loQkJ2l0J7j6RTj1kK2kPk0KQj3Jj8L2j2K2j8pKPk9M3l2K7k2J8j7MPNj1%M%pPjP
10.04581Bkm%j5J5Mk0K6j8K3%j3mJ3j9J5Nk3J2k2L3k0J3rJ3nmjk2L1P%k7QLN%j0Rk4K5lOmJ1k2
10.02241a2J1Tl1K7j1J0j1%J0j2J2j4RNJj4kMLmRrJ9j9J2j0oONjlMj2J2Jj0J2mkOJj0nK5lpj3L0
9.99799B0j3Rl0MPj1L7j4j7j5L8j0lkj7LRmJ2lK%pJ1mj7J5Mpj3J9ql%QmkJ3J5l0PJkJoPJokQOJ
9.97154Hqj0%K3ponJLOn%rkJ6NnmJ2lj5Jkj%MjoTJ1j3J3mj1L0k3J7j0Jk1K7mTlMj0J4j8J1jmK0
$$ y = [0, -12, -12, -18, -4, 1, 0, 0, -5, 2, -20, 3, -16, 3, -11, 11, -22, 5, 2, -5, 3, 0, 6, -6, -5, -1, -3, -18, -8, -9, 0, -4, -17, -3, 10, 0, -13, -14, 9, -9, 11, -16, 9, -5, 0, 6, 9, -13, -15, -4, 6, -5, -9, 19, -29, -3, -3, -11, -13, -19, -26, 3, 4, -19, -1, 5, 1, -16, -21, 20, -5, 0, -10, 0, -10, 5, -26, 8, -2, 10, -7, 0, -7, -22, -3, -8, 5, 7, 4, 4, 8, 12, -3, 10, -8, -2, -5, -8, -11, -1, -5, -3, -1, -8, -6, -9, 3, 0, 5, -1, -9, 0, 7, -14, -13, 0, -10, -13, -10, -6, -1, -1, 5, 2, -12, -3, -12, -12, 4, -9, -7, 8, -3, -2, -8, -1, -8, -8, -13, 7, -16, -7, -4, 4, -11, -3, -14, 3, -5, -6, 3, 0, 1, 1, -2, -8, 0, -2, 10, -20, -3, -19, -10, -1, -12, -14, 8, 6, 13, -7, -5, 3, -10, -9, -27, 5, -7, 15, -3, -10, -8, -1, -30, 13, -19, 8, -14, 4, -13, -9, -2, 3, -8, -8, -4, -4, -11, -4, -5, 2, 0, -4, -4, -19, -4, 0, -20, 6, -12, 11, 11, -2, -6, 7, -12, 3, 8, -15, -3, -25, 8, -12, 1, -8, 5, 0, -4, -5, -27, 4, 11, 11, -16, -8, -5, 0, 0, -10, -1, -25, 0, -3, 3, -1, 10, -12, -1, 10, -21, 6, -5, 5, -6, -6, 4, -8, 4, -10, -1, 4, 5, -9, -11, -7, -4, -8, 1, -8, 11, -8, 4, -6, -12, -6, -1, -2, -5, -1, -13, -1, 0, -10, 2, -2, -4, 2, 3, -7, -12, 13, 10, 3, -10, 20, 7, 16, -14, -10, -3, -14, 23, 9, -8, -23, 15, 5, 2, 0, -17, -14, -5, -9, 3, 0, 2, 2, -5, 6, 2, -15, 0, 4, -3, -16, 3, -5, -8, -8, 0, -4, -6, 7, 22, -8, -1, 0, -2, -1, -7, 0, 1, -5, -7, 1, 7, 8, 0, -10, -10, 13, 6, 0, -5, -4, -1, 5, 0, 0, -9, -11, 5, 10, 5, 1, 13, 10, -5, -4, -6, -7, -7, -3, -4, -10, -16, -5, -18, -5, -9, -20, 10, -13, 4, -6, -5, -26, 1, -3, -7, -10, -6, -16, -2, -20, -9, -10, -14, 6]
9.94509Fk7K8j0J3kj6j0K7k7K8j0TNOLJ0j0j4MPj0%PJ6l6K4J7ok6K5qQj6NqRj4J3JlnJ4j7J7k6
9.92220a8K4plnKJj1L1j3omkJ1KmrK3k8K5k1J2noJ1%Kj0kQ%mqPmJ6k3J2J0k4J0j3L0j9K4rpNK
9.89778Cj8Pj0PkJ6rJ0rNlLjLk2K3j1JOkMK%Nj8K0Jj1Llj2J6k0J3Pj6JjKjnJJ5j6K8l7K7Ok0J2
9.87234@%oJ0J4j7nlJJ1k3K4j4jj6M1k3jNqQrkJ0KkK0pj0JmrJ6j8jRKL%J7j6%jJ0k2J1nOj3K3
9.84742Hk3K4k0K2k0jJJ5k3J7K2k6QTk3J1rNRnJNrMn%J0Lrj7J0PNrOk0ORnPj7J4JJ7j5j6mK2N
9.82249Fj4loJ8j4J4j2NLTJoJ3k0NJ4k4K8k5J3NnJ%Lj7J4j0JJ4nKMj5k%J9qj6J0OrJkQqL1l1M
9.79756fj4K0pPLj5J3k3J6KOTmk0K4oUj8K0J5k6K1j6J8j0RLpjKj8J8Lj4Ql0L9j0J4Kj2JNrj2K8
9.77365A3k5QoJ4j4RJ0j4PqM%TOjNj9K1j8rJ9j4JnJ6k1K3klJj2K1lj3J0rmNKk3J8LPj2J3nRPl
$$ y = [6, -21, 7, -3, 10, 8, -8, -18, 9, -18, 10, 0, -10, -5, 1, 4, 14, 4, -10, -6, 1, -9, -9, -2, 14, -22, 2, 19, 13, -13, 12, 4, 12, -4, 1, -7, 2, -12, 1, 2, -1, -6, 8, -9, 8, -18, 6, -1, -4, -9, -7, -6, -17, 14, 1, -5, -9, -11, 0, 2, -2, -11, 12, -16, 9, -12, 0, -5, -11, 0, 0, 2, -8, -10, -2, -2, -6, -14, -7, -11, 5, -18, -6, 4, -20, -10, -23, 7, -12, 12, 3, -4, 1, 3, -15, -8, -18, -11, -13, 3, -6, 4, -5, 0, -3, 0, -1, 2, -20, 3, -8, -7, -1, -3, 1, 3, 3, 8, -10, 10, 11, 0, 3, 0, -12, 4, -16, -3, 4, -12, -11, -12, -10, -11, -16, -15, 0, -16, 12, -25, 2, 8, -12, 0, 0, -6, 4, 18, 1, -4, -7, -6, 5, -18, 6, -8, -9, -25, 16, -7, -8, -3, -11, -3, -12, -14, -4, -2, -4, 16, 9, -1, 0, -4, -13, 3, -15, -16, -7, -5, -2, -2, 15, -1, -1, -2, 8, -14, -3, -8, -2, -15, 8, -15, 9, -11, 11, -9, -10, -9, 6, -17, 0, 22, -4, 4, 12, -11, 0, -9, -4, 5, 0, 1, 6, -3, 1, -4, -4, 6, 9, 0, -17, -7, 0, 5, -4, 2, -18, -12, -3, -8, -1, -18, -4, -3, 14, -1, -17, -21, 1, 6, -8, -11, -17, 1, -13, 1, -11, -6, -3, 0, 1, -5, 8, -12, -7, 7, -17, 11, -14, -1, 4, -1, 0, 0, 3, -14, 0, -10, -9, 5, 0, 2, 6, -9, -11, -11, 8, 0, -16, -6, 0, -9, -8, -10, -2, -10, 21, -10, -6, -20, 0, -7, 0, 3, -12, 1, -22, -6, -4, 2, 8, 4, -16, 8, 2, -4, -10, -28, -8, 7, -19, 2, -14, 4, -6, 3, 6, -1, -2, 0, -18, 0, 3, -11, -3, -33, 6, -4, 10, 12, 0, 1, 6, -3, -15, 13, -12, -4, -10, 4, -10, -1, 9, -5, 2, -6, -2, -2, -2, 4, 3, 8, -11, 10, -8, -17, 2, -12, -11, -16, 0, -21, 2, 0, -3, -2, -14, 7, 4, -9, 1, -8, -12, -7, -5, -28, -10, -7, 0, -12, 1, -4, 5, 12, 9]
9.74873Ik3nL2k0K3j0nj7RoNMj9J0K3l0K0Qqj2KJ0K0l0%JJ1npj5K4j5J2OoJ3j0Nj5J1MjLk1K5
9.72583A0j1Pk1J0nPKTK0l3J7k1QNj9L7k9PJJ9nmj0J0qMj1J1mJ8rJnjMkL%k0L4j2pTJ3j2pQJ3
9.70142Hj6QMl2J1J4knJ5nMlj6J5Jlj2J6j3OPoj0J4pJKPmJj5J6J0k1OTnqJ7j7J0JJ4j4%NlLpj3
9.67598a5L0j5Lj6J0j1PJqJ9j1Mj5L7l8J0%J0j0j2OK1Mj7J0j0JLQ%j2PMlrnJ5j6PMKrjRlQmlmK
9.65054eMoTNTpLPlkLpJ8j2qLJ3k8K3%nJ1LqorROjPj6%J2j2lkJ5j5J2jqoJ6j4J0qMNRj4OoK7k6
9.62307hK0l1Pj4K6j5LlK3j1OlTkoj1K7%lnjLoQLlj0Qk1QJ3%oRkO%j2j1J7j5ROqK1Lj7Pk2MTo
9.59662a4j1K6kOk5L6j6Qj3nP%Lj8RJ8Lk1J4k5K0qQj2PkKJ0k8%L1j4kpJ5j4KJ1nNrQoJ0k0J8j3
9.57271a3J4k5K6Mnoj5K7j9J5k0J0QjkTJ0j4OJkpkJ8j4J6pj0J0j5kJ8j5J9k0%K4rpmNOJ1k4J1r
$$ y = [9, -14, -19, 13, -7, 16, 6, 1, -16, -7, -13, -8, -4, -23, -13, 10, -20, 0, 8, 0, -12, -10, 0, 20, -10, -10, -9, 2, -3, -10, -25, -1, -16, -4, 2, -4, 9, -1, 4, -11, 0, 4, 3, 6, -15, 10, -1, 6, -15, -5, -10, -3, -1, 1, 21, -12, 5, -16, -8, -3, -22, 15, -14, -7, -6, 13, 8, 4, -6, 4, -4, 0, -11, 0, -4, 14, 5, 6, 1, 0, 4, 2, 5, 5, -15, 19, 7, 0, -7, 6, -6, -13, -5, 8, -8, 0, 4, -28, -17, -3, -5, -10, 5, 0, 4, 1, -15, 0, 1, -2, -14, 2, -11, -5, 2, -4, -14, 0, -7, -6, -4, 3, -1, 0, -15, 1, 11, -10, -4, 2, -3, -11, 6, -11, -1, 0, 14, 0, 0, 5, 2, 5, -2, -15, 15, 0, 3, -13, -3, -14, -7, -6, -14, 5, -6, -2, -17, 20, -18, -8, -8, 2, -8, -20, -14, 7, 11, -6, 4, -6, -5, -2, 6, 6, -6, 1, 5, 2, -7, -12, 3, -13, -6, -2, 0, -9, -10, -1, -4, 4, 0, -3, -7, -5, -1, -7, -13, -8, -3, -10, -7, 0, -3, -5, -2, -9, 9, -3, -11, -8, 5, -23, 0, 0, -5, 6, 9, 1, -5, -14, -5, 1, 0, 7, -9, -9, 3, -9, -12, -14, 1, -14, -2, -3, -11, -17, -1, -15, -5, -13, -9, -4, 5, -9, -3, -9, 18, -8, 12, -19, -12, -26, 0, -15, -12, -15, 8, -3, 3, 0, -3, -5, -11, -22, 5, 5, 2, -3, -4, -1, -7, 1, 4, 1, -9, -1, -22, -14, -1, -1, -7, 2, 0, 6, 6, -6, -17, 0, -15, -6, 0, -8, 13, 16, -1, 6, -16, -12, -8, -14, -25, 1, -1, 5, -20, 16, 0, 8, -5, -10, -3, -3, 0, -18, -9, 9, 12, -9, 5, -20, 0, -8, 0, -12, -5, -7, -5, 5, -23, -23, 8, -6, -8, -15, 0, -14, -12, -1, -6, -1, -10, -2, -8, 2, -18, 0, -13, 1, -24, 2, 6, 1, -5, -20, 7, -12, 3, -17, -7, 1, 0, -2, -4, 6, -8, -2, -1, -3, -10, -12, 6, -8, 8, 1, -9, 1, -14, -16, 2, -13, 6, -14, -14, 10, 1, -6, -10, -5, 1, 12, -12, -1, -10]
9.54931a0J5j0J5j5Nj1J3j6K6pnj2J9j8J3%roJ5J1l1K4k4J3OJ0k4J1JoPkKjj6LlJ4Lj8J3j8K3p
9.52693gklJ%lK2j2MLj0K0j8Rj4OJ0k0J5j1QqrJ6pTJ0Pj2K9k1mJ0j7Pp%QKpQMj7J7j1jOkJ0KQ
9.50149A2j5J4qj4MLkrJ2oJ0j6OjOMNlJj9J2j6M%K0jj6J8j0J6j1oJ2m0L0%NpKTjpJ0jj1jj1J8q
9.47657a4LJ2J1k7J4k4J9oRolnJ0%J2Rj9J2k2K2j4nQLmj2lJ2PNmol%QpOkQj1j0RKJ4j6J0%rMn
9.45113hj6K4pLqJ3j5JNKj6K4pJ8j2nMLnorj6M0l3L1j2lPLqQTj2rQJnkJ0J2j6QMrnLMk1J6qJ6
9.42519Cj3J0jmTJ3j6jQkPJL%j6%PQj3nLJ0kJmK0j1j4PKLTljj3K9k9J0MlUNKLjPj8Rj7J9rJjRq
9.39670hJ9l3N3m2K0l0K7j3Onk2M7m0J5pJ2NnToJ9k2K1j7J4Tk8J1pj1Nj1J5%kMJ6k3PJ1j5LljO
9.37381fQj2j0LJ1nJ6j6kJJ5JmPk3K5l0K1j1J7k3J1j9J3Rkj2J7k9K2J6j8J4j2oJ4j3J4lJ3k0P
$$ y = [-10, 5, -5, 10, -5, 0, -11, 2, -14, 12, 5, 0, -12, 7, -11, 2, 2, -7, -13, 2, 13, -18, 6, -18, -5, 1, 11, -13, -2, -1, -7, 0, -2, 0, -1, -17, -14, -17, -3, 0, -18, -5, -23, 0, -7, -9, -12, -11, -11, -14, 8, -4, 0, 3, -7, 13, -5, 4, -10, -4, 6, -14, 1, -10, -2, -10, -19, -3, -10, -17, -7, 0, -12, 17, -4, -8, 2, -15, -8, -15, -15, -7, -5, -12, -4, 0, -17, 0, -11, -12, -6, -8, 2, 4, 12, -3, 11, 3, -11, -7, -4, -6, -15, -3, -9, 1, -15, -9, -10, -4, 0, 5, 2, 3, -16, -4, -20, -16, -16, 4, 3, -13, 5, -5, 11, 0, -6, 6, -34, -4, -4, 1, -6, -4, -2, -3, -10, 0, -1, -12, -13, -24, -6, -14, -11, 1, 12, -15, -1, -25, -6, -12, -3, -9, -12, -17, -7, -7, 5, 14, -5, 7, -15, 7, -7, -12, -4, -1, -5, -17, -20, -8, -1, 4, 0, -6, -9, -9, -1, -8, -2, -4, 4, -7, -17, -8, -6, 8, -8, 2, 2, -7, -3, -8, -24, 0, -7, -4, -12, 1, -14, -13, -8, -6, -22, 2, -5, 13, 1, -4, 0, 3, -2, -8, -17, -33, 7, -26, 5, -7, -10, -3, 0, -8, 0, 8, -4, -13, -5, -4, -9, -11, -1, 11, -5, 3, 7, -2, -7, -4, 0, -21, -5, -13, 3, -10, 0, -1, -5, -9, 4, -12, -13, -5, -7, 0, 1, 4, 4, -12, -12, -5, 3, -10, -15, -12, -2, -4, -3, -7, 13, 2, -12, -5, -3, 0, 3, 0, -1, -14, 15, -14, -4, 0, -3, -6, -9, -4, -2, 1, 0, 7, -11, -2, -19, 0, -9, -8, -9, 0, -8, 11, -22, 31, -11, 9, -21, 6, -7, -1, -6, -28, 19, -21, -6, -13, -1, 4, -1, -6, -12, 7, -15, 6, -11, 3, 17, -11, 0, -7, -18, -13, -24, -9, -9, -11, -7, 9, -14, -7, 4, -11, -8, -11, -12, -6, 2, -10, -20, -17, -6, -11, 5, -11, -13, -12, 3, 4, 0, 7, -16, 9, -21, 0, -11, 6, -17, -6, -25, -12, -3, -5, -17, 0, -29, -7, 9, -9, 5, -7, -13, 1, -12, 2, -1, 12, -8, -1]
9.35244aj0K1l9M7j6kj3%nRMLTqJ2J0j5%Mjk0K6j8MQJ5k8J1j9J2J0nQj9%kJ4Pj6oJ4j3ORqJj0
9.32853a6J1jT%PrJ5j6QkJ0j2J5k3jJ5j4%JMPoJ1oJ2k7J5Qj6OrJ1MpQk1QlLJ2j0Rj1nOJ4qJ%Rn
9.30259Aojk1K3j5OJ0K%lUJ3j0mLJMN%j0oJPJ7j3PpTPMk0J5Llj4J0qJ0KLk8J5J4j1J1j4J1j2Mm
9.27664a4QRj7%J1j5J1J5j2TlJ1rJ2nK4k4J0k0JL7k9J4k2L0ok3NK1k2J3Mmj4J3j0LTjoK0j4%Kj
9.25375fLj8L3l5J2JJ0j5LkNLNJ2j5MqJ8l7L9k4OJ0rj6K6j9J3j4Qj2J0KMj9K8qTLjk0J2J0MolT
9.22984a4OMJlJ7j3k1K9j0j%qJ2j5J4k7K1QljOKj1K1j7J2j8J6k1LKkRqJ3rmkRj2J3qj4J2kjJ1
9.20593dj7J2NKoQmJ0j4l%Oj0PKlnJ1kJqOTkj4L0k4J0mNj4Oj3K0rqLRoKj0PJ1Mj8LpJ8j1J6pLo
9.17897fj7K4j1K3k9J6j7RNOj1J4k8J6qRj1nJ9rKqJ6j0NRjj5J3j0qMJ9j4OMrj4J0j5K3rJ4j3Ml
$$ y = [-1, -11, 10, -29, 18, 2, 0, -13, -13, -18, -9, -5, -2, 1, -7, 5, 15, 0, 0, 4, 3, -17, 9, -9, -5, 3, 18, -10, 1, -18, -6, 4, -1, 7, -12, -12, -14, 0, 7, -9, -15, -1, -14, -8, 1, -7, -6, -16, -5, -6, -7, -7, 0, -9, 6, -10, -2, -4, 6, -6, 9, -14, -15, 0, -14, -14, -13, -9, -2, -8, 3, -3, 9, -18, -3, 5, -11, -5, -14, -3, 1, -6, 2, -19, -11, -14, -11, 1, -9, 0, -11, -16, -10, 4, -4, -3, -3, 6, 1, -5, -6, -27, -4, -19, -13, -3, -1, -1, -4, -7, -10, 3, -7, -11, -8, -7, -3, 2, 2, -8, -14, -13, -6, 11, -2, 5, -2, -9, -2, 2, -18, -3, 0, -3, -17, -7, -15, -5, -3, 0, -28, -13, 1, -10, 1, -13, -2, -14, -10, -14, -6, 3, -14, -14, -3, -18, -7, 8, -4, -16, -19, -8, -17, -5, -10, 14, -10, 0, -20, -19, 18, -11, 3, -19, 11, 5, -18, -13, 8, -14, -1, 3, -1, -15, -2, -12, -9, -6, -7, -13, 7, -7, -7, -5, -6, -3, -21, 12, -23, -11, -10, 0, -15, -12, -14, -9, -6, -1, 11, -4, 0, -8, 10, -27, 12, -12, -6, 4, -5, -21, 5, -14, -1, -15, -7, -19, -9, -7, -3, -22, 6, -2, -10, -7, -8, -28, -16, -6, -2, -8, -11, -14, -8, -4, -3, -6, 11, -2, -23, 6, -4, -5, -5, -13, -1, -16, -2, -29, -8, 0, -3, -4, 2, 4, -7, 14, -3, 9, -9, 7, -14, -11, -9, -11, -2, -10, 3, -6, -10, -12, -3, -15, -2, -10, -24, -12, -14, -15, -4, -21, -9, -4, -2, -8, 0, -4, 6, -8, -11, -11, -5, -15, -8, -6, -9, -14, -3, -5, -4, -12, -6, 0, -2, -16, 14, -10, 0, -4, 1, -13, -7, -20, 0, -9, -17, -14, -5, -11, -9, -19, -12, -1, 3, -15, -12, -19, -1, -12, 4, -3, 0, -6, -23, 1, -10, 13, -16, 0, -17, -8, -3, 3, -8, 6, -22, -6, -14, -5, -16, -21, -2, -11, -9, -17, -1, -11, -6, 3, 2, -13, 0, -10, -18, -14, 5, -9, -3, 1, -8, -22, -12, -27, -4, -13, 1, -12, -8, -11]
9.15557a1NojLlKj0LKQj8%J5ROk1LJ2poJTJ2j4PJ0k3qL7j8J2rJ4Kl2J6Lj1J2k1L0j2%jONrJ3k1
9.13064a3J3rpJ8jqj1K3j5Nj3K0j6J3Pmj5%J6j9jRnJ1j6JJ0j7K2Lj0NLj1JO%kj1mQJ4Pj5J6l2
9.10724b4J9j5K3k5K5nj2J4k0L3l2J9klmTNRomMLKj3J1j0J5k5J1LJ5k2J3j1LRrk8M4m0K6Pn%N
9.08435aj2J1j0J2mQopj0LRJKoj3K6jk0K0kTlNlNj8K4j8K3j9NKj5KK1m4L3Rj5JK4qk8ORlJ1poK
9.05891glRKj1J5k1J5j7K6j4j3J7proK4oNkp%J0ok0kNJ3MjoJ1KklTJnJ4kLl%oj2J3j4J8Jj1LKN
9.03246aKTj6J1J%knJLlKmOj5J3k4J0Oj6J9LrLJ6k8PK4lj1kJ2k4L1k1J9k1K0pj6J4%j8J2LrlJ4
9.00804doNLKj5j3PK0j9RK3k7J2j0mJ1J6k8J3Nk7NPJ0mJ1j2Qj7J6j6J9%j3K7k3j1JK0pj8J5O%
8.98566cj8J8j1K2m3L2kMj3%JOrpNJ2LTj1J8j7J7j6nj5K2PrmLlj5L5k5J4jMmpKJ2j7L0l0NkTJ2
$$ y = [-11, -6, -12, -13, -10, -13, -11, -21, -18, -16, -8, -26, -26, -11, -2, 4, -17, -14, -2, -9, -15, -14, -13, -1, -15, -8, 2, -21, -29, 8, -10, 2, -7, 7, 9, -23, -7, -4, -15, -3, -24, 6, -6, -6, -7, -1, 4, -5, 8, -13, 0, -9, -16, 2, 1, -7, -18, 5, -10, -5, -18, 2, -14, -1, 6, 2, -13, -13, 3, -16, -17, -8, -13, -2, -18, -17, -7, -24, -2, 1, -9, -4, -1, -12, -11, -5, -5, -7, -18, -22, -14, 0, 7, -8, 8, -24, -5, -20, 3, -22, 3, -2, -14, 0, -20, 13, -19, 0, -2, -5, -9, -13, -8, 1, -5, -9, -5, -2, 0, -13, -2, -12, 3, -22, -11, -8, 7, -15, -2, -13, -10, -1, -10, -38, 6, -34, -8, -1, -6, -6, -1, -13, -2, -12, 0, -4, 4, -2, -9, -19, -16, -7, -6, -4, -10, -23, 3, 2, -18, 2, 0, -2, -5, 0, -3, 2, -16, 8, -10, 13, -6, -1, 1, -14, -12, 9, -35, -2, 7, -8, -7, 17, 9, -19, -13, -4, -7, 4, -3, -9, -7, -10, -1, 1, -10, 5, -16, -1, -18, 8, -6, -19, -2, -9, -18, -24, 0, -6, -1, -3, -10, -10, 0, -6, -26, -28, -23, -10, -6, -7, -13, -2, 0, -2, -5, -8, -7, -12, 2, 0, 3, 0, 0, -6, -18, -5, -19, -1, 0, -11, -8, -6, -1, 1, 3, -13, -2, -1, -1, -3, -8, -7, -4, -7, -5, -9, -3, -18, -5, -29, -19, -13, -29, -10, -7, -16, -13, 3, -25, -18, 6, 3, -8, -10, 2, -22, 9, -12, 7, -14, 6, -1, -17, -3, -3, -21, -9, -6, -15, -18, -4, -10, -5, -2, 0, -15, -28, -21, -1, -20, -11, 12, -15, -3, -13, -17, -6, 10, -18, -5, 0, -27, -22, -15, -5, -9, 2, -10, -2, -19, -3, -19, 0, 0, -13, 14, -9, -20, -19, 1, -6, -24, -9, -3, -3, -21, -3, -14, 8, -35, -3, -5, -1, -14, -14, -13, -7, -16, -23, -18, -6, -3, 0, -11, 7, -10, 7, -9, -14, -29, -7, 0, -9, -13, -10, -13, -28, 7, -18, -4, -5, -1, -5, -12, -10, 2, -15, 15, -15, -10, -12, -14, -2]
8.96124boKMjpTMK8k5K2j7oj1J0PTj5lKK2oKj8J4%j9NmoK4j2MknJ5pmJ3j3J2rMrJjOJ3k1NkOrR
8.93428fLjnPk4K6j8PJNmJ5j7NJpJ0j0JPJ%J5k1pOoJ9j5LlNj2K2rRj2RqJjmlK1j5pJ7j2KJ1rpr
8.90732b3J5kJ5rj1j0MJ5oPMnjrJ5lj5J9j2nOQrjTMJOj7J0J9k4OoJ8j8%J4J3k4NjnJ5nJj%j2J1
8.88188dj6J3pj6PL4k0J0k0PlnMKJ3r%J0lKk8K0pJ9j6mQj2K5j9J2j7POjQKj7J7j1RqMj2QToTk
8.85696a4J8rlMj0J2jk3J6J2j5J2k0J2%PKmOj2J2k0J1%JK1k3NqnPj0J7rJ7k6J2oJ2Pj0qQj0MJLT
8.83254dk6J6lJ0mj3J2NJ0k2J4rJ8Lj6j3J9Lk9J1J8k2K2j7PpOJ1lj6%rK8pqNjJ4Tl3QToj4Pm%
8.80863a7J1koJ4mJj2J0nJ0j8LJ5j2JKNLj5LkOqJ1KlrK1k3J5j3J6j0KnLpJ4rL4k8pNTpLj3K9k4
8.78370a5mK1J1k2J8k5L1orL6JnkJ7j9J1l3J7Lrnj7pTL0j8MnJ6j2Rk3kK1j6J5j8J5j2J6pjTJR
$$ y = [-2, -8, -6, -2, -3, -10, -17, -13, 15, -10, 12, -5, -11, -22, -12, -5, 2, -13, -16, -14, 8, 2, 4, -14, 0, 0, -19, -14, -18, -24, 0, -12, -8, -10, -15, 0, -7, -11, 2, -11, 1, -8, -4, -13, -12, -13, -7, 6, -15, -10, -12, -6, -15, -6, -3, -4, -9, -2, -26, 0, -18, -11, -10, -5, -9, 6, -11, -6, -5, -12, -2, -12, -11, -4, -3, -3, 12, -9, -16, -10, -16, 3, -12, -9, -12, -7, -19, 3, -6, 3, -9, 0, -8, -7, -8, -12, -15, 6, -9, -16, 1, -11, -9, 2, -7, -14, -23, -8, -10, 5, -4, -15, -25, -21, -6, -12, -5, -1, -6, -7, -16, -1, -4, -19, 0, -12, -17, -11, -3, -12, -13, -14, -10, -9, -3, -20, -10, 9, -15, -9, -15, 3, -15, -15, -1, 12, -12, -7, -8, -13, 2, -3, -2, -3, -3, -15, -4, -20, -7, -14, -30, -23, 11, -9, 1, -19, -12, -15, -20, -16, -14, -1, -10, -10, 0, -3, -1, -29, -9, -16, 3, -13, -17, -9, -21, 4, -15, -3, -20, -13, -7, -8, 0, 2, -15, 2, -9, 0, -8, -4, -16, -8, 0, -6, -12, -14, 4, -5, -8, -4, -14, -2, -3, -26, -10, 2, -13, -1, -21, -9, -9, -2, 0, -4, 2, -10, 2, -18, -7, -7, -6, 15, -8, -3, -11, -16, -9, -19, -2, -11, 6, -20, -8, -14, -2, 5, -5, -13, -5, -15, -11, -10, -7, -4, -30, -14, -17, -7, -11, -24, -12, -7, 3, -19, -5, -14, 4, 7, -9, -22, -3, 0, -29, -18, 0, -22, 0, -17, -10, -17, -11, 0, -3, -19, -19, -28, 0, -7, -15, -10, -11, 3, 17, -16, -8, 0, -6, -20, -13, -17, -17, -6, -8, -14, 0, -4, -3, -15, -5, -10, 0, -18, -15, 0, -12, -11, -9, -4, -1, -16, -13, -15, -9, -17, -6, -4, -7, -16, 5, -18, -3, -16, 0, -10, -8, -13, -10, -17, -3, -12, 22, -6, -13, -8, -3, -10, -7, -20, 9, -15, -19, 2, 13, -9, 9, -16, 15, 9, 0, 36, 37, 32, 30, 47, 28, 39, 6, 23, 26, 17, 12, -5, -12, -19, 11, -7, -3, -8, 8, -4, 5, -18, -20, 1, -15, 0, -18, -3, -15, 1, -6, -7, -8, -7, 2]
8.76081Bk1JK1j6J3%ok2PJ5Pj3TJ7j0PKJj2K7k5RK%Opj2K1j4pOJ5j7LQTqj2rJ8KOTj4%j7K5j4K
8.73588a2MqM%TpRm%J3j8J6plTmJ3J6k1j2kLK1k1K8j8J6k2K4j7lJ4JKrLj3QJ0j0lj1K3j0j1JQO
8.71146foJ2j3LJMj6J9j2KTj9K9j9J8nj8PkoNQkQpQokJ3n%oj1J1MJ3j2j0%J1oj3K7j8rJ7mqK5
8.68654Fk2J1jMj0oJK1l3PJ5nkqQjMlrK8j6j7knJ7%LPr%NJ2j9J9lRj5QnJ3j7jlJJ7oMTnj7oK1
8.66008aj4%nJ7j2J1j3J6ko%lj1K3Lj9K2Nj5nlJ0j4J4j0J8j7J3j4JJ6j5LpK1j7QlMJRMOTJ5J1l
8.63617D8%j0Kj9K2j0k0Jj1J4k2J2j7K7l3K0j4J7l0K3nJ2j6J3nj4J3mpljnMQJ5k0LJ2lpj4L7l5
8.61430b2K1oLj2kJ8k1K5k5J8j4NjkPmJ2k7J8KJ6Jk3KkJ4J8rJTj2KkKj1P%Kl0L1k7J0PNRj1jj1
8.58988a8LTmRoj2J5PQk5K6J0JmnJ3k1Mk1MJ8j5JJ0k5K3k0J6KlJNkoQk3J5ORpNrQoNrqLnJMln
$$ y = [2, -19, -18, 3, -13, 0, 0, -6, -28, -21, -6, 1, -12, -25, -8, -18, -11, -9, -8, -20, 7, -18, -9, -7, -7, -1, -8, -20, 1, -13, -20, -14, 1, -16, -13, -5, 3, -5, -17, -26, -8, -6, 0, 6, -8, -8, -25, 0, -14, -12, -8, -16, -12, -12, -12, -19, -10, -14, -14, -1, -19, -3, -10, -13, -16, -20, -7, 9, -12, -24, -26, -23, -2, -23, 5, -13, 3, -19, 5, -12, -15, -1, 0, 2, -7, -4, -17, -9, 1, -9, -12, -23, 0, -10, -21, -20, -12, -6, -12, 0, -13, -10, -9, -5, -21, -2, -14, -12, -10, -29, 0, -19, -1, -6, -24, -17, -19, -25, -20, -12, -14, -6, -13, -5, -11, -13, 0, -5, -5, -11, -22, -11, -7, 6, -6, -16, -16, -5, -11, -24, 3, -15, -24, -7, -11, -19, 6, -16, -5, -6, -2, -12, -18, -17, 4, -29, -22, -7, -12, -14, -22, -14, -15, -11, -14, -23, 5, -11, -28, -30, -35, -18, -18, -15, -8, -17, -17, -12, 0, -19, 0, -3, 6, -9, -1, -6, 7, -10, -11, -14, -13, 4, -2, 2, 6, 1, -16, -22, -1, -15, -15, -20, -3, -15, -4, -17, -1, -3, -9, -9, -12, -23, 0, 3, -16, 6, 11, -4, -9, -12, -2, -16, -2, -12, 6, -11, 2, -12, -11, 5, -10, -7, -14, 7, -10, -2, -5, -1, 0, 9, 13, 19, 25, 40, 51, 48, 48, 38, 40, 21, 43, 33, 13, 14, 3, 17, -5, 7, -10, 17, -16, 4, -10, 7, -23, 0, -5, 7, -9, 4, -1, -15, -2, -6, -13, -16, -17, -22, -18, -10, 5, -15, -12, 0, -3, -10, -24, 13, -22, -1, -7, -4, -16, -18, 0, -21, 4, -21, -3, -17, -12, -13, -15, -8, -12, 0, -27, -9, -7, 9, 10, -13, -11, -13, 1, 19, 10, 11, 12, 0, 2, 0, 2, -9, -2, -2, 0, -30, 1, -26, -16, -9, -4, 5, -6, -7, -18, -15, -12, -16, -7, -13, -25, -10, -3, 5, -20, 6, 16, 17, 13, 8, 21, 0, 4, -17, -13, 5, -10, -9, 1, -24, -1, -21, -5, -3, -6, -5, 0, -2, -8, 0, -23, -8, -2, 7, 0, 5, -4, 4, -2, 3, -6, -14, -11, -16, -15, -11, -14, -19]
8.56292a9J5roKRp%j3J9jj8K1Knj8K2oj0lJ9mpK1j2j9J9j9PLMqK1j3J5%j1oJ1lLJMKNp%J5pj2j
8.53748dPJ3k2QLTqlJ3j1JPTkk0J5kK2kQLJ4LNJ1jL0nL6k2M8j3L2JL2J6J4K9j1O1k7M5PL2LM3
8.51408D19L4M2O6P4J26J67K73L47N11O82Q80J084J158Q87P29P04M23K35Qk70p68p99p90p73
8.50187E449p76p28p35o36n46m51l22k39j97j29j10o0o4m7k9l8l1k9k6J6o1ql6Jl3lTj4k5Koj6
8.48560G0J5j4qk1J4qPj8J8k4J5Noj5J5J8j5j2j1J4Pj8J9k3J6j5K0nqJ1k4Oj6J5pK1Krj5J5j1T
8.46423IOjj1OpJ9Mj1JJ5jl1L2m3L4k1K0onjqQlRj3L%Mk3K3J1k8Pj4K6k3J3PLk0L2oJ9pKTJ5K
8.43981D9J1j6J9l7J2lTKj0J1j8J0j6QkMj0jTkj3J5Qk4PJ2LnMj8LN%k0K8j5J1qJ3rPj5NKj0Jn
8.41590a1J6n%OQk0K7l1J2QPOj1J0Qj6KnoJ2j0J5k1pJ7qrMJ6j3oOlKJ5j3mlJJ0mMj4J5MmoTRj1
$$ y = [-19, -4, -13, -19, -17, -8, -15, -15, -28, -9, -10, -28, -7, -5, -10, -28, -6, -12, -22, -25, -6, -10, -17, 4, -8, -27, -8, -27, -20, -17, -13, -21, 0, -13, 2, 2, -9, -15, -4, -7, -4, -3, 1, 3, 8, 1, 1, 16, 9, -3, -4, 3, 16, -6, 2, 5, 8, 0, -3, 10, -1, 0, 7, 14, 12, -8, 7, 5, 27, 25, 33, 36, 50, 53, 58, 69, 68, 98, 93, 129, 107, 155, 142, 174, 175, 207, 223, 237, 266, 255, 316, 289, 334, 341, 373, 376, 419, 453, 495, 561, 635, 761, 928, 1201, 1548, 2059, 2741, 3621, 4705, 5863, 6750, 7479, 8183, 8606, 8841, 8849, 8579, 7811, 7012, 6222, 5449, 4673, 3945, 3210, 2574, 2028, 1577, 1255, 1016, 819, 690, 580, 520, 456, 409, 380, 342, 311, 282, 256, 272, 211, 203, 167, 168, 135, 132, 129, 115, 90, 92, 86, 70, 85, 71, 63, 42, 56, 48, 55, 37, 55, 31, 46, 51, 45, 30, 45, 63, 48, 36, 25, 39, 46, 28, 47, 24, 40, 25, 45, 40, 32, 43, 19, 25, 9, 24, 17, 38, 40, 31, 16, 31, 20, 9, 15, 14, 3, 9, 2, 21, 25, 14, 15, 30, 29, -2, 30, -13, 21, 0, 20, 14, 9, 8, 0, 8, 5, 14, 1, 4, 4, 8, -15, 8, 19, -9, -2, -16, 10, -13, 0, 7, 10, -10, 22, 16, 35, 28, 30, 32, 47, 49, 60, 44, 63, 26, 38, 35, 32, 34, 24, 35, 17, 27, 11, 19, 17, 21, 11, 10, 9, 7, -6, 9, 17, -7, 0, 12, 15, 10, 14, -4, -1, 4, 4, -16, 12, -3, 8, 0, 13, 4, 11, -4, 1, 3, -7, -6, -11, 5, 0, 0, 6, 14, -6, 21, -10, 2, 10, 17, 23, 12, 22, 30, 14, 16, 11, 5, 17, 7, 22, 1, -6, 11, 3, -6, -2, 14, 1, -5, 1, -2, 0, 15, 2, -2, -5, -4, 6, 2, 6, -8, 7, 11, 7, 1, -5, 4, -7]
8.39047gJoK0j0j2J4rOkrJ3jlk8K8PqQj1PnJ3oj7kJ4NJ0j1lkpJ9oj2K2k3LqL0k2K1k0J2j1RMT%
8.36554Iq%MrnK2j4J0j1Oj0Rj6J3J1j9OK0K1JJ0j2K4j6K8j0MlK8k4K9%K5J1J6L2QK4J4Rrkj1K1
8.34316B36K5M7nMK2J2PL7P6K3Q1P5J15J48L14N88J215K444L419L427L93N2k057k237p01Kn21
8.32942G241p71j201j578j201p93m95l18j50j18p0l0n4o4p2l9m7Qm0RnRj4jm8nrnKj7Pl9Pj7J
8.31213H3j3Oj8jJ3OTnjk4J8Tk2j4kPOpLknOj2TK0nk3L9l6K3j3m%qLL2j1K4k0J0oQjK2J7qK3j7
8.28771A03%QL8jj3J5J3NLK1oL3J2K2L1M9J04R4K01L26M31L61J44lJ60M39N53M91J40ml21k98m
8.27092C147K01J27j64n78n31m08j90j60j40k44k32j68j16p6o9m5k6k9%j8Kjj3j2J5qK2pjROK1
8.25464C14L9L4O3Q5J44K91M38M97K95l3N5L81N92O09J72l5j63l51j12J30J43n0m68n85m77l05
$$ y = [-7, -6, -12, 8, -2, -14, 0, -9, -3, -5, -14, -1, -2, -5, -33, -5, 2, -6, 2, -9, -2, -7, 6, 0, -17, -19, -5, 0, 10, -1, -4, -6, -13, 6, 0, -12, 10, -13, -10, -18, 12, -10, 11, -9, 3, -8, 1, 5, 9, 9, 1, 1, 5, -4, -9, 13, -1, 9, -2, 4, -6, 3, -13, 0, 11, -8, -2, 18, 39, 40, 50, 38, 62, 46, 74, 64, 68, 65, 93, 69, 98, 98, 123, 134, 150, 182, 190, 214, 228, 237, 228, 226, 215, 236, 261, 308, 303, 307, 329, 341, 348, 385, 461, 484, 565, 640, 755, 903, 1217, 1805, 3020, 5464, 8883, 12310, 12703, 12755, 10698, 8461, 7760, 7762, 7241, 6470, 5269, 3691, 2490, 1697, 1202, 884, 734, 616, 546, 516, 462, 398, 326, 287, 240, 248, 208, 217, 212, 221, 207, 206, 158, 153, 144, 139, 141, 124, 131, 92, 99, 82, 83, 70, 76, 58, 57, 70, 76, 82, 77, 76, 52, 70, 88, 66, 52, 50, 57, 63, 56, 59, 57, 52, 58, 46, 34, 54, 49, 26, 65, 29, 52, 39, 35, 35, 27, 30, 62, 51, 75, 55, 65, 59, 67, 66, 88, 105, 97, 120, 103, 103, 111, 149, 148, 135, 150, 163, 168, 171, 192, 186, 219, 231, 253, 284, 333, 437, 531, 732, 1058, 1489, 1850, 1994, 1991, 2151, 2590, 3143, 3634, 3774, 3770, 3449, 3151, 3147, 3348, 3475, 3311, 2733, 2202, 1794, 1604, 1444, 1304, 1060, 828, 660, 544, 468, 399, 354, 328, 299, 299, 281, 283, 282, 269, 257, 272, 264, 286, 279, 278, 287, 293, 314, 353, 387, 450, 535, 679, 970, 1408, 1905, 2200, 2167, 2222, 2603, 3195, 3804, 3976, 3941, 3778, 3427, 3315, 3445, 3588, 3538, 3070, 2485, 2008, 1703]
8.24141A703j95j55j89k53k09j62j14p8m1m9k2lj3j7j6j8j4LMj6kj1lj8J1k4Ql1L1l7Nj8K1j5
8.22412F3j1KJj1kpJ7qJ4j8oK2j9J0Oj8j2L5j4kj0OqJ1J9l9PoK9ojKMmlj0Nj3J9oJ3l5PK1j3O
8.20072C7k9J4j3K5j1J0j4LMnNk1RJ4pKj2QKpnK1qTj2LOMJ2J1j4MrlPKRnmKj0KJ4j2J5j0mPj4J
8.17528A6Qj0J3j2RoNj0Pj3J3rRqplKjOjKJ1Qj7PkPj3J8nQk0MPj4rLK0j1J1lj5J1mQlLnK1npk4
8.14883@PNmJ6k7J4Jj2%J8KmKmj1nK5Ml2J0J7qj2RMo%MojJ4j8LJJ0k0K2j0nQljRQkj5Q%oTNJ0n
8.12187A3lmkj1K5lk2K1nJ0Jj2J1j1loJKJ2j1J9orjJ0j0J3l2K6j1J4rJLKj2JJ1qMrnPNnK8k3np
8.09694eK0qK1l7L4k8J5nplJ9Lj6J0j2J1%qKorK2Lk1LOTNj2Nj6J9q%klpJ4PqMNKj8NJOj3j0J2K
8.07100@J4qJ3j6Mj1j0L8m1K9k2K1j0LPJPj6MLoOlplJ6j3J4j2MLpLj0Qlj8J6MRqkj0K0j4LOTno
$$ y = [1703, 1508, 1353, 1164, 911, 702, 540, 426, 348, 307, 258, 236, 233, 220, 203, 187, 169, 155, 158, 162, 146, 144, 133, 130, 112, 123, 99, 107, 76, 107, 70, 75, 57, 78, 63, 52, 54, 55, 44, 42, 35, 52, 44, 58, 40, 34, 56, 37, 47, 53, 35, 23, 58, 44, 42, 32, 38, 30, 41, 60, 21, 28, 22, 51, 45, 44, 46, 50, 46, 43, 33, 38, 25, 44, 38, 51, 16, 23, 44, 31, 37, 8, 22, 9, 34, 23, 33, 19, 22, 26, 21, 26, 5, 14, 28, 21, 23, 11, 19, 21, 14, 9, 30, 22, 14, 2, 5, 11, 15, 27, 38, 24, 28, 19, 16, 23, 25, 34, 29, 25, 27, 17, 19, 33, 21, 36, 26, 22, 29, 15, 16, 24, 14, 27, 15, 24, 18, 23, 13, 20, 7, 20, 11, 20, 12, 5, 2, 4, 3, 9, 8, 10, 21, 29, 12, 19, 17, 24, 11, 29, 24, 32, 12, 16, 23, 9, 0, 3, 23, 12, 23, 20, 5, 16, 12, 20, 17, 20, 15, 36, 31, 24, 0, 7, 12, 8, 24, -3, 11, 12, 0, 0, 18, 20, 16, 18, 14, 3, -2, 23, 27, -5, 5, 22, 14, 2, 11, 15, 9, 9, 13, 7, 6, 20, 2, 5, 6, 16, -4, 18, 8, 3, 11, 8, 7, 16, 24, 22, 7, 15, 15, 9, 3, 8, 18, 13, 10, 6, 4, -7, 18, 15, -7, 14, 9, 19, 20, 8, 19, 8, 5, -1, 0, 2, 14, 3, 22, 16, 7, 6, 16, 6, 19, -13, 13, 2, 16, 7, 8, 11, 13, 1, 2, 13, 5, 9, 0, -5, 2, 7, 2, 30, 7, 2, -5, 15, 7, 28, -9, 25, -3, 12, 7, 0, -3, 16, 19, 3, 13, 1, 12, 12, 4, 6, 0, -9, 13, 16, -5, -2, 4, 10, 15, 3, 8, -8, 11, 3, 3, 1, -2, -9, 5, 12, 4, 8, 13, 15, -3, 2, 3, 9, -4, -14, -2, 0, 14, 6, 19, 3, 7, -4, -14, 24, -17, 12, -10, 11, 1, 4, 11, 12, 19, 3, 7, 10, 4, 10, 7, 0, -3, 13, 0, 14, 2, 6, 9, 2, 5, -5, 3, 0, -18, -2, 2, 11, 3, 1, -9, 11, -3, 0, 6, 12, 7, 1]
8.04556AkTJ5jk3RjJ1o%Pj3K3j5RnK4k6qOJ8m3K6NLlnNqkJ3j2L1k1KnJ1TKK7j1NMlrJnj0J%kk2
8.01911GMJ1j4%Oj4J1mjLolKJJ0j1j0K3pOj1ljLJ3Jq%oMJ2JJ1l1MK5j1J0l4%RLpKJ6mkmJnJ1j6
7.99265cJ6j9J7k1J2PKj3J1j4kMK%LkrOJ3j0J1j5J5qJ7rQmLOmQj0J4j5J0pj6J4j0J3k3J5j6J5m
7.96925HomQk3LJ0qNPJMj0JKPj8J7mj6J1j0PnLjJ0lmLnTK0j1LmNj8K0%PmOjj4J7j3%Nk2J1J9j8
7.94280gJ0k6J7K2j4jqJ4j9J1j2J6LqJMQj8pK7j0moj0K1l1M2nMpq%Rk5NJ2nJ8j8MnNkOj4LKJ1
7.91838Ej5nK0oNTKj2nkRopPJj0OQPj0jJQk5L3j0Nj2rJ4Kmj2L9l8K6k0L1qPj0JTLnNj9kJQlj4
7.89193a0J0J1qJ3j3lTjK5l9J4kj0K1j6KJ9rMj6K0k3jkJ5LnLKkKnkOPjkJ7k1J3J1j7MJ0Qj4j8
7.86802cJ7J1k5RjrJlJ0Tk4K0mj1rnJJ5k3K4%Pj2J1k6K0j9L0k0pJ5qnLQNJJ0j7KnOJ3pNj4lLJ9
$$ y = [1, -1, -3, 12, 11, -12, -3, -4, 7, 1, 1, 8, -5, 18, 3, 12, 7, 31, 5, -3, 3, 21, -22, 4, 9, 12, 9, 4, 9, 1, -1, 12, 0, 31, 10, 12, 7, 18, 29, 31, 58, 47, 52, 56, 53, 44, 45, 40, 30, 31, 31, 29, 7, 11, 22, 8, 8, 14, 0, 11, 7, 6, 9, 3, 0, 2, 3, 13, 2, -8, 15, 8, 14, 3, 0, -1, 2, 15, 16, 8, 8, 2, 6, 18, 19, 30, -1, 3, 28, 17, 27, -7, -7, 2, 5, -2, 0, 16, 12, 10, 6, 7, 2, 13, -3, 13, -6, 11, -10, 2, 9, 11, -2, 9, -5, -7, -3, -1, -1, 2, 0, -9, -3, 10, 0, 11, -4, 11, 3, 20, 11, 19, 15, 18, 24, 20, 28, 18, 32, 17, 27, 20, 4, 18, 8, 21, -2, 13, -3, 12, 8, 2, -2, 6, -17, -14, -4, -12, -7, 0, 1, 5, -5, -4, -2, 5, -13, 4, 0, -16, -5, -15, -8, -13, -10, -11, -1, -4, -8, -5, -10, -15, 5, -6, -3, -7, -2, -20, 0, 0, 7, 3, 9, 8, -6, 11, -2, -2, 3, -19, -8, 11, -7, 3, -23, -6, 16, 2, 1, -7, 7, -12, -1, -13, 3, 6, -2, -1, 3, 11, -7, -14, 13, 3, -1, -7, -17, 4, -27, 15, 10, 14, 7, -1, -1, 8, -17, -12, 0, -5, 13, -5, -1, -6, -1, -3, 3, -11, -8, -6, 5, -10, -15, 5, -1, 4, 9, 11, -1, -6, -8, 1, -5, -12, -5, -4, -14, -8, 0, 7, -3, -4, -3, 5, -20, 13, 3, 8, -4, -13, 1, 3, -1, -13, 26, -12, 14, -6, 25, 17, 24, 14, 15, 16, 19, 14, 19, 0, -2, -1, 7, 4, -10, 0, 11, 3, 16, 3, 0, -3, -4, 21, -18, -4, -6, -16, 5, -11, -9, 10, 1, 5, -11, 9, -14, -15, -17, -2, 1, -4, -1, 1, -1, 1, -4, -6, 0, 7, 6, 4, 21, 0, 13, 24, 7, 11, 21, 29, 15, -3, 14, 25, 0, 9, 8, -1, 0, -3, 7, 17, -7, 13, 9, -2, -11, -16, -15, 0, -23, 1, 1, 8, -4, 7, -19, 1, -18, 12, -8, -15, 0, -8, -13, -10, -2, 3, 4, 14, -3, -1, -6, 0, 13, 6, 11, -3, -6, -3, 16]
7.84309A6k4qQRnJKrJ5mPKk8LONkNjLlOqOKrJ1Oj4PLl4K8J3pj9J2jlJ5j5RJ1Mj0qJ9j3rTJ9p%
7.81613CJ0rJq%TOmlKj5NMTk%j0K0qMpJJ0Rj3j0RQj4RpJKTkmJ9j2K7m8K2M%TJ6l1P%K4k1pPlKL
7.78815Copj1K1%j5J0pJ2k2J9j2J3j7K1k7RJ9rjmrJ2J1j5kj2MJ1Qj2Rj9K3j3L2j7%k3J1MJ5mJ2
7.76577A5j5Pk1J5JMopoK6k4K0oj7MJ8Rk3J3knro%J5j9RlnJ3Rj7LNmnJ9j9Rj4LQpJ1lLOoQMj1r
7.73932a2RJOroK4k8ON%lJ8jnJ0l4J0K3j2pj2QJ2k0JoNj0J3qJ5k0J6Lj5J7jJMpNo%J7l%k1PTkK
7.71337cj2K7j6k2LL0k7K7k8K5j5RnQj0J1j1JLkPpJNJj9jJ1jKj4J2oKOoQRlj0oJ6mMk2K9j6J6
7.68895Gj9J6k8K4Jj4%K5k3J0Lj3%J1jMj0oK1j5Pj3J8k3J7j8nJ3kJ3nLlkj4ONPoLkJ3qQnKj0Kj
7.66403gJ3j7J9k0J6J2mT%nLJ7k9J4j6kMTLMj5K1OlKQj0J5p%kQJ4lkQKPqK5j8MJ7j6RK1KPJ0J1
$$ y = [16, -8, -16, -8, 1, -4, -3, -1, -10, 5, 1, 8, 10, -18, -15, -9, -4, -6, -1, -2, 1, -2, 4, -4, 2, 4, -5, 6, 12, -2, 5, 8, -26, 2, 15, 8, -11, 1, 0, -3, 12, -3, 6, 17, 21, 11, 3, 22, 9, 0, -9, 10, 3, 3, 13, 4, 5, -3, -3, -3, 3, -1, -4, -2, -17, -12, -8, -4, -6, -6, -16, 4, -4, 0, -7, -6, 4, 13, 0, -10, -1, 7, -7, 2, -5, -4, -2, 0, -2, -6, 13, 1, 28, -20, 2, 6, 6, 6, 22, -9, -2, -2, 22, 1, -6, 1, -2, 0, 3, -3, -10, -21, 0, 0, -15, -5, -12, 0, -22, -3, -15, -2, -19, 2, -25, -16, 3, -6, -7, -11, -20, -8, 3, -12, -14, -26, -22, -11, -3, -15, -6, -25, -2, -15, 17, 0, 0, -23, -12, -8, 7, 3, 15, 0, 7, -14, 1, 2, 6, 0, -7, -13, 13, -11, 9, 3, -14, -10, 8, 17, -6, 7, 5, 0, -9, -15, -15, 0, -19, -10, -13, -18, -5, 4, -13, -10, -5, -9, -14, 5, -14, -5, -19, -16, -8, -15, -4, -7, -4, 2, -4, 4, 8, -3, -12, -3, -2, 4, -5, -11, 13, -15, -9, -4, -4, -7, 11, 10, 5, 15, -19, -9, 14, 2, -5, -17, -9, 3, -17, -16, -22, -17, -27, -14, -22, -7, -27, -11, -8, -23, -6, -7, -6, -2, -9, -4, -10, -10, 7, 4, 4, -17, -10, -3, -5, -3, -15, 12, -4, -26, -23, 7, -20, 7, -21, 4, -11, -2, -7, 1, -9, 2, -9, -8, -5, -7, 0, -7, -6, -1, 0, -19, -20, -9, -10, -8, -22, -10, -16, -14, -8, -14, -6, 3, 0, -10, -16, 0, -4, 0, -22, 7, -9, 7, -12, 4, -24, 0, 1, -13, -13, 12, -11, -1, 2, -11, -11, 0, -1, 3, -7, -13, 8, -7, 0, -13, 5, -18, -1, -19, -24, -11, -13, 0, -5, -2, -5, -7, -21, -15, -10, -3, -9, -6, -8, 5, -3, 5, 0, 2, -8, -6, -7, 6, -11, 8, -12, 4, 16, 12, 8, 8, 3, 6, 23, -6, 8, -8, -10, -6, -2, 1, 5, -10, 11, 17, 14, 16, 24, 14, 29, 22, 22, 20, 28, 42, 39, 37, 45, 47, 54, 46, 71, 53, 57, 74, 58, 67, 88, 90, 97, 107, 118]
7.63859A18L5J2N1J13J31K64K50J20m7M1J98L18L15J69J05M5k29j59P1J73O3j50m23l32k13j31
7.62536I08n2j03j34j40j23l9m6l6%k7JkpTJ3lQKQJJ0oK7K6J6L0K0M3TJ21J58L27N52P40O56R2
7.60705C077j34K18P30R60O50o2l3k35n03j35J85J77j25o67q42o48m02k43j67k72l28k85j88
7.59535G28j57q7p3m4l1jl1k5j2ql5K6k8Nn%nOkJ6J8L3O5Q1J25K60M42O17N85J36l61k66l1K01
7.57805B142M93O03L45l30p50n14k76p6k4j17k81k95k24j52r2p6m0pl6%j3Lj7K5j1qJ8mj0L6K5
7.56228C37KN2L1Q5J21K79M64P03P08J99m28l19k2K40N42P26M88j04o91o53l81j37O8Q1j8k52
7.54906B121m27m19k72j44o3k6r7j25j09q0o8j1l1kql4J9k1KRj3Nkj8kJ2j0K3MK7J7J1P1J59
7.53176D98K71L56L54p2k81j36J6J38K86L10J04k63l97k23j25m7%o9j65j26j32o5o4%l5k6J3m0
$$ y = [118, 153, 165, 216, 329, 460, 724, 974, 1094, 1047, 1088, 1286, 1604, 1919, 2088, 2193, 2238, 2009, 1850, 1921, 2094, 2157, 2007, 1584, 1252, 1039, 908, 856, 753, 619, 479, 356, 317, 271, 235, 235, 208, 209, 207, 200, 193, 206, 203, 211, 213, 221, 222, 232, 226, 253, 279, 295, 325, 345, 388, 431, 552, 710, 1037, 1589, 2329, 2985, 3077, 2943, 3161, 3891, 4851, 5501, 5439, 5406, 5171, 4668, 4533, 4718, 4895, 4770, 4103, 3261, 2613, 2211, 1968, 1801, 1529, 1201, 916, 728, 571, 484, 411, 367, 336, 335, 304, 279, 267, 259, 224, 250, 222, 227, 222, 222, 217, 223, 221, 237, 255, 288, 353, 434, 559, 819, 1261, 1878, 2463, 2599, 2238, 1972, 1941, 2142, 2635, 3238, 3583, 3253, 2503, 1989, 1713, 1637, 1613, 1496, 1215, 920, 696, 544, 452, 376, 336, 329, 293, 293, 280, 283, 266, 291, 280, 272, 290, 286, 276, 312, 337, 339, 391, 422, 507, 628, 907, 1371, 2074, 2782, 2981, 2553, 2234, 2212, 2452, 2994, 3720, 4208, 4104, 3413, 2760, 2379, 2242, 2310, 2391, 2373, 2121, 1694, 1275, 1003, 859, 796, 770, 673, 548, 439, 359, 291, 280, 249, 247, 239, 205, 224, 203, 205, 214, 201, 206, 204, 186, 184, 196, 186, 209, 213, 240, 257, 268, 339, 498, 769, 1125, 1479, 1407, 1126, 990, 1006, 1144, 1430, 1740, 1844, 1581, 1184, 961, 836, 789, 789, 720, 555, 429, 297, 232, 168, 168, 133, 107, 120, 80]
7.51752H0J6j4J7j6Plmj2rjK2k1J9j7j3J4j3oJ6Lj6TK2Ql8J8k0J0J5oloplPJ8j9Nj9J2Qj7M%pR
7.49412B4kJ1MNk1K5j3j7J3J7oJ2j7%KorL0j9j6J5qRj2jJ4j1%Qlj8RpJ4qJ4qToR%pmRj0NlOj4
7.46919AK9oj1OJ4lj4J1j5NRJ0j7KjnJ9oJ0j0lJ1j0pK0k2J0j3J6omQqmoj0L0k1Mj2J0j%qK0k5
7.44579cJ6lm%J8kj3JOj0K1k2OmJ0j4J5lrMmMNRMk5K6j6jlOJ3j9J7qJLpk0L2k3K1j1Kj2Rk5K6
7.42137A4j3J7j3J2mkK5l3Lk%rK5j8rRK3j6MpRj4J5rK0njj0J6k1J0J2k2KLOj2LnJ8qOj0Mj0J3pU
7.39644ePNJOj5J5k5K8j8K4j6J1jTonJ0JqJ5k4mK6k1K6rnJ1rk0J7jOj4K7j4kj6QlKNJ3j5Oj0J4
7.37254A7%j3nJ8pj0JpRJ2kj0jJ9j8NJ8kk4KOMJ5k3J0lJ6oMOoJ7MmkK0l6J3j0J0jnk2J1%rJ9k0
7.34812A0Pk7J4MqQpNJKqJ9rJ1qoPlMk5RJ0j3J1J4l4K3PMj1j4L1j4KJK6j6lK6oj4J6lj6j2J8Nk
$$ y = [80, 96, 82, 99, 83, 90, 87, 83, 71, 62, 61, 83, 62, 81, 64, 51, 65, 52, 46, 62, 65, 49, 33, 55, 63, 25, 43, 23, 33, 48, 42, 39, 33, 26, 23, 30, 48, 29, 34, 15, 27, 35, 18, 22, 22, 15, 24, 22, 33, 37, 42, 21, 46, 33, 16, 29, 46, 40, 52, 35, 35, 37, 31, 22, 52, 33, 17, 32, 24, 33, 21, 20, 34, 23, 23, 31, 28, 10, 19, 12, 26, 18, 32, 24, 16, 10, 19, 19, 12, 8, 17, 7, 12, 9, 15, 1, 30, 24, 13, 19, 33, 30, 16, 27, 12, 17, 26, 36, 19, 21, 20, 15, 34, 28, 38, 28, 25, 36, 26, 19, 39, 17, 27, 14, 30, 24, 20, 28, 20, 16, 10, 0, 30, 9, 13, 1, 11, 10, 10, 2, 22, -3, 13, 10, 6, 6, 24, 22, 9, 10, 16, 6, 27, 5, 11, 7, 17, 3, 18, 15, 6, 10, 6, 10, 15, 24, 28, 3, 29, 13, 12, 9, 15, 28, 9, 26, 18, 19, 22, 15, -5, 27, 4, 25, 14, 16, 4, 13, -12, 14, 1, 18, 5, 17, 13, 11, 36, 3, 6, 4, 4, -5, 20, 2, -7, 2, 25, 9, 13, 6, 15, 1, 16, 7, 27, 22, 21, 11, 27, 6, 16, 28, 6, 8, 11, 17, 5, 8, 3, 21, 13, 19, 9, 13, 3, 16, 9, 2, -5, 2, 7, 8, 14, -1, 14, -11, 17, -1, 23, 7, 18, 17, 16, 10, 5, 15, 16, 8, 23, -1, -5, 21, 0, 26, 17, 12, 23, 14, -6, 11, 10, 16, 2, 29, 15, 13, -3, 5, 2, 4, 9, 22, 7, 13, 3, 17, 17, 4, -1, 17, 10, 0, 1, -6, 3, 15, 13, 3, 2, 21, 3, 8, 26, 24, 0, 2, 8, 12, 27, 4, 14, 11, 27, 21, 25, 31, 25, 42, 46, 42, 40, 60, 24, 37, 27, 37, 36, 31, 9, 20, 20, 11, 30, 10, 17, -10, 4, 8, 0, 8, 1, 6, 7, 9, 1, 20, 11, 22, 14, 8, 15, 12, 16, -9, 0, 10, -3, 8, 22, -12, 11, 18, 22, 11, -3, 28, 14, 16, 17, 43, 27, 24, 50, 44, 30, 46, 43, 27, 15, 33, 38, 36]
7.32370C6Jk0J5J7Mj0nJ6mpPK0KqJ2K3k4K2j2JLlKJ1ROK0NK9J0M6N0J23J64L39N00N31J69k92
7.30386A808k63q7Q0K86M48L94J18m79n78k86j46k5Pj53k54j87j75r3p2l4k2l1Lljj7K3l8K6k5
7.28860B24K3k6L0JJ9M6L4L1J02J37L11M24N02K73j67j33J49M55O85P02J61k18m77m24q8K41
7.27537C017L80K89l48q27n52l31j58m1j24k67k43j99j16q1n8m4pk0Jj4k3J2k5roJk1K2NrJ6K3
7.25909B43J9M8J05J77L31M55M11m4l18j77k5J59L01L45K20j29n07l60j88o1qn5j73k01j52j23
7.24587B93o2m5m0Mk9j1j0NJ8l2Nj7oOQl5K8j9KrKJ8ok8PLpm%nPJ1k4PnJK0j6j9K4j0PoPk3K7
7.22247D2k8J5KMK%pj0OMKk3K9j2J1k2K1J1jk3J1okJ9k2J3J2k0J0j0j5J7j5J1Kj8nJ1kLJKJ4Mo
7.19957C2j2MoJ5j6J9l4K6j5J0j7K1j1Jj1J1jKnJ9k6K4j2jOJ1j1PmRj6jJTlPmOqKj3J5Oj8j0K4
$$ y = [36, 37, 17, 32, 49, 53, 43, 38, 54, 50, 43, 50, 70, 72, 64, 76, 99, 75, 97, 85, 86, 89, 86, 88, 99, 108, 114, 134, 139, 168, 178, 224, 274, 397, 561, 900, 1400, 1931, 2100, 1808, 1545, 1458, 1538, 1824, 2272, 2666, 2784, 2305, 1727, 1441, 1295, 1270, 1277, 1124, 870, 683, 508, 415, 343, 309, 287, 256, 259, 256, 255, 238, 261, 223, 249, 224, 247, 221, 251, 252, 271, 317, 351, 382, 484, 621, 932, 1356, 1858, 2131, 1964, 1831, 1980, 2435, 3120, 3822, 3983, 3765, 3288, 2864, 2776, 3017, 3397, 3686, 3338, 2511, 1959, 1628, 1470, 1429, 1305, 1038, 795, 596, 480, 399, 341, 297, 290, 270, 271, 257, 234, 246, 221, 212, 206, 207, 186, 208, 213, 204, 220, 243, 262, 310, 415, 592, 923, 1378, 1789, 1745, 1427, 1250, 1225, 1384, 1685, 2030, 2250, 2121, 1614, 1254, 1066, 1005, 997, 942, 769, 568, 416, 293, 231, 186, 146, 150, 121, 110, 100, 105, 123, 91, 96, 79, 73, 79, 87, 52, 80, 61, 63, 54, 56, 74, 68, 40, 47, 50, 43, 39, 39, 34, 41, 52, 28, 35, 30, 31, 51, 35, 16, 40, 30, 37, 31, 38, 15, 42, 14, 29, 31, 35, 37, 37, 30, 20, 26, 30, 32, 9, 38, 26, 37, 15, 36, 47, 46, 23, 34, 28, 26, 45, 23, 36, 48, 28, 38, 28, 13, 30, 15, 26, 28, 10, 5, 16, 14, 17, 18, 20, 34, 38, 32, 20, 24, 18, 33, 17, 36, 2, 28, 13, 23, 6, 27, 16, 17, 6, 17, 16, 18, 13, 32, 6, 30, 18, 17, 23, 34, 23, 30, 26, 35, 19, 18, 19, 20, 17, 24, 20, 26, 18, 20, 7, 22, 28, 10, 0, 24]
7.17617B4j1KJ1j2oqOJ4or%qK7k2RJkj1J7Jj7NJ0j4J6j0J0rJ1jk0J2MmRj6K3l0L1k9J0TMoKk0
7.15277bK5j4KkpK0j1J4pQj9pMLpQRj9LJ7j4J6j4J9pk4ONTj6MK7j1j4nJ3KK4k7NroK1pTkJ5nJ
7.12785A3K2k5kJ0j1j5L1j3mPj0J8k6J1j1L4oj3j1K2jj7KoJ3J2roLTj4QmJ3oLj5J7loOJ0j2rJ6
7.10495A9j1j%TRj7lJ5j2KJJ8j0J2qTnJ5mNnmJ3j4JoNoK0rRl3K0jj2K1j3K0k0MoK2j9LOQk0J5
7.08054A6j2Mj3K9j3KlK3m1K2lqJ6j1lQJ5l0KJ2rPj0K5k3J9j0jJ3j0kMj0QqQKj5N%lJ6pj6K0j2
7.05713CJ2k4K3j4QKj8K1Qj1J1k6POkPj0pJ1mNnmkJ9rpJ7j1pmOnR%lJ4j7ON%j1K9k8pJ1Rj1J1%
7.03170A3nRoKj1PpLj5J7Oj3nLJ6j4POnqMTRj6oNOJ0njoJ3j5J0j4J0%J%J3Ql2K0jkJ0%Pj9Ok8
7.00575iL6k2J5n%j0%J7k7J7j4J2mrqJ1K7k2Mk2K8k2K1k0kK0j5pQLTmJ3j3J6Pj8Qj4JJ0qoK1rR
$$ y = [24, 13, 15, 26, 14, 8, 0, 6, 20, 14, 5, 5, -3, 24, 2, 11, 12, 10, -1, 16, 17, 0, 5, 15, 1, 17, 7, 17, 8, 19, 18, -2, 10, 14, 10, 19, 3, 26, -4, 27, -2, 8, 18, 22, 16, 18, -2, 23, 9, 11, 9, 2, 22, 11, 25, 18, 26, 7, 0, 4, 7, 0, 8, 17, -2, 1, 18, 4, 20, 6, 25, 18, -6, 0, 5, 10, -6, -2, 25, 14, 0, -5, 8, 10, 34, 7, 12, 3, -3, 18, 11, 4, 2, 17, 12, 13, 35, 10, 8, 18, 7, -8, 23, 10, 6, 13, 3, 21, -5, 6, -5, 29, 23, 10, -1, 21, 20, 3, 5, -1, 12, 24, 15, 9, 12, 15, 1, 9, 5, 18, 12, 15, 0, 17, 14, 8, 14, 24, 12, 3, 19, 8, 7, 7, 7, 16, -1, -4, 11, -1, 1, 2, 20, 10, 22, 14, 6, 1, 16, 12, 17, 12, 8, 21, 7, 8, 2, 7, 1, 21, 12, 21, -12, 8, 7, -5, 16, 3, 23, 3, 7, 1, 23, 4, 7, 13, 21, 1, 16, 4, 8, -5, 24, 11, 13, 10, 33, -8, 14, 11, 3, 19, 8, 5, 13, 28, -2, 0, 12, 3, 10, 0, 25, 2, 21, 11, 10, 23, 13, 11, 15, 5, 13, 5, 13, 15, 0, 5, 5, 2, 18, 11, -5, 15, 3, 15, -9, 14, 0, 8, 10, -8, 13, 21, 10, 21, -5, 2, 8, 6, 13, 3, -4, 7, 3, 8, 3, -1, -3, 16, 7, 0, 17, 6, -1, -5, 1, -4, 5, 5, 2, 16, -1, 5, 10, 10, -1, 28, 0, -7, 4, 13, 2, 13, 13, 8, 17, 11, 13, 2, 9, 2, 5, -10, 7, 13, 0, -5, -2, 14, 0, 7, 13, 8, 0, 4, 8, 17, 1, -5, 0, 6, 16, 11, 10, 4, 17, 2, 12, -2, 8, 8, 9, 9, 22, 30, -2, 18, 17, 15, 25, 25, 32, 13, 19, -9, 27, 5, 20, 15, 15, 5, 5, 22, -5, 12, -2, 10, 6, -3, -11, 0, 27, 5, 9, -13, 15, -7, 14, -6, -8, 12, -3, -10, -2, 1, 4, 0, 13, 0, 16, 23, 5, 13, -1, 0, 10, 2, -4, 17, 8, 17]
6.98235A7j2KnROrqJ5Nj7J1Jk1J2plJ3Nj0Jlj4K6j8J0pJ0jqJ0k0J5mj6J0JKMrJ5j8J2M%nKj2K1
6.95794A2k1J5mJ1pk2L0j9K4j9lnJ0j9J8nJ0j5K0JpKTrJoJ3jj5J7qOqJ4loNnKpkJ8mKr%Lj0NJ5
6.93250A7j0kmj4K1j5K7j0j3LlJ9j5J4k8K7k7J2PKqj1J1RqQpPTk5Qk0L4qKrQrJ9j2kj1RrJ2J4
6.90910A7l3J3Lp%J1j4J5l1M3j6J2k0PNj5J9lj1MlJ3JpmJ9l3L0pnqJ0mMoTlMTJ3j6L%RJ7k5mo
6.88468a1K2kj2j8K8qjQKj9J5Mj1Noj1J4j5J6J4k8J1K1j5rJ2nLrJ2j8J5mnNJ2k6J9Ok4J8rJ6j7
6.86230eJ0J1lj2j0J4PqKnj0LlLROoMj0KJpJ8k2J3k5J4KJ0kk2J7RLrj3J8%jk1K3lPk3Nj3K2Pjo
6.83686@j7J8lLJTj8K6j8Pj5J1jJ0%rRj%nQmnKJ0kj8K1j5KO%j1Rj5lJ6RmNk1kJ1K3j4j1JK0k1M
6.81143@kjTPlKqOoTJ9j4Rj7L3k2J0j7K4j9LJRLpjJ2j0TJ4j8JkJ2%JmjLmJ9j5nJ3j3OpmnJ5Tk1
$$ y = [17, 5, 7, 2, 11, 17, 8, 0, 15, 20, 3, 14, 15, -6, 6, -1, -4, 9, 14, 4, 5, 2, -12, 14, -4, 6, -1, 9, 8, 0, 10, -10, 5, 1, -15, -5, -4, -2, 2, -7, 8, -10, 2, 6, 6, 1, 3, -9, 12, -9, 6, 2, 13, 6, -16, 14, -5, 19, 0, -3, -8, 2, -17, 1, -4, 6, -9, 11, 12, 5, 7, 9, 0, 1, -5, 8, 7, -8, 9, 1, 7, -1, 13, 10, 4, 9, 4, 6, -1, -3, 15, 11, 13, 4, 4, 7, -3, 2, 17, 7, 5, 1, -13, 8, -7, 20, 10, -3, 0, -3, 16, 1, 15, -13, 14, -13, -1, 6, 8, 0, -11, 0, 9, 1, 9, 2, 9, 16, -9, -1, -21, 13, 5, 7, -2, 6, -3, 16, 4, 2, -9, 0, -9, 3, 17, -16, -3, 0, -7, -7, 4, -10, 5, -26, 17, 1, 13, -7, 0, 5, -10, 9, 6, -5, -1, -4, 9, 10, 3, -1, 18, -15, 15, 8, 3, -5, 5, 1, 5, -1, -7, -10, -6, -2, 11, -5, -2, -2, 7, 24, -1, -5, -11, 11, 9, -3, -21, 7, -1, -2, 6, 8, -11, 4, 8, -3, 2, -4, -15, -1, -16, 0, 14, -14, -3, 18, 3, -6, 6, 1, 4, -5, 7, -11, 4, 0, -5, 0, 12, -14, 5, 11, -13, 5, -4, 12, -5, 5, 16, 13, 1, -9, 5, 12, 4, 6, 1, -9, -6, -9, -6, 3, 9, 3, 7, -3, -1, 0, -7, 11, -11, 2, -23, -9, -7, 3, 1, -21, -4, 5, 8, -1, -14, 4, 4, 3, -18, 5, 2, 9, -14, -9, -22, 0, 7, 6, 0, -17, 1, -2, 1, 2, 3, -15, 11, -7, 0, -15, -4, -5, 5, 5, -4, 5, 4, 4, -1, 7, 3, -2, 0, 10, 8, -10, 11, -4, -2, 4, 4, -7, 2, -13, -16, 0, 9, 5, 10, -11, -13, -2, 21, 7, -4, -3, 17, -4, 0, -2, -3, -4, 3, 0, 2, -6, 0, -6, -12, 7, -7, 2, -15, 18, -4, 6, -11, 13, -6, -3, -2, 7, 10, 3, 2, 14, 4, -6, 8, -10, -9, -11, 1, 1, 2, -2, -3, 0, -4, 15, 0, -5, 8, -5, 1, -6, -10, -15, 0, 15, -6]
6.78497fJ2j2K5l5K6k2Pj0J5kqK1j8J2Lj1MkJlmnJ1J4j6J2j1nJ5nPj1J1k5J7k3M0l1J3rJ8j2O
6.76310Dj3%OlJ0k8K1PpJ5k5K6rKmPnkMj0J9k7K2k0J0pRnRpK2j5LkOj1k0PJ6rlLoJ1m%J2k9J9J
6.73766@j6j2K4Rj2J0k0L3roj2J0mKMrJ3OrqNToJ2j0J1oLnlqNMj2L2j9mkM%Pj4jJ6%nLqQj5J9
6.71172A0j2MkToMlJjJ6rj7L8mj8j3MJ1j5K2k4J5qRk%oTJ3mqNJ1mJpJ9oj8J7j1TJ7jmLJKj5K6o
6.68578Fpkj4RK0l6K5j2OLjPj%lj2ORkJ1k0MmK5m4K2j3J6%Pn%J3plTJ9k1KLJNpJ7l2KUJ1j1J2
6.65983Ej1%K4j4rNj6K6j3J2rk1J2LQj2L4k6qJ7l1lK6pJ0Qk1J4OPl3J8qKkrK5lTkj1k1L4rJ4k9
6.63643b1K4j2K9l4J9j0pkJ6qLJ0Kk3J6NkqlOMOk8K2mkPk%J0j1nq%RKTmMLj8J1Kl%Kjk5L2j3ML
6.60998aoLTpJ2jj2K3m0L6k2OmMOj2J5Klj1J4Nj7%J5lj9J8mj7J0kmK2l5L3j0pK1k2K7m6M8k1jK
$$ y = [-6, 6, -6, 19, -16, 10, -12, -5, -15, 0, -2, -10, 11, -7, 5, 8, -3, 1, -1, 0, -3, -7, -12, -1, 13, -3, 9, -2, -7, 8, 3, 10, -1, 10, -15, 2, -21, 19, -12, 1, -8, 10, -2, 4, -9, -9, -3, -6, 4, -24, -3, 4, -3, 12, -13, 13, 4, 6, 2, 9, 4, 2, 6, -4, 15, -12, 10, -10, 0, -7, 2, -3, 6, -1, 21, 6, 9, 7, 13, 2, -18, -11, 5, -4, -7, -4, -10, 1, -3, -3, 9, -20, -1, 0, -16, -28, -4, 5, -7, 3, -17, 16, 7, 1, -11, -1, -5, -3, 1, -8, 5, 11, 2, -6, -1, 4, -2, 10, 0, 11, 5, 8, 3, 0, -8, -3, 1, -11, 21, 2, -2, -4, 0, 0, 7, -7, -8, 8, 8, 3, 6, -2, 6, -9, 10, -2, 2, 0, -2, -8, -4, -7, -6, -7, 9, 0, -17, 21, 17, -1, -14, -10, 1, -14, 8, -16, -1, -9, 0, -2, -2, -8, -14, -1, -5, -13, -8, 3, -1, 0, -7, 12, 6, -12, 5, -6, -17, 0, -1, -5, -2, -1, 1, -14, 12, 6, -1, -3, -17, -8, 12, -24, 1, -11, -5, -2, -3, 4, 3, 3, 0, -12, -6, 3, 1, 12, -8, -4, -8, 17, -27, -5, -18, -2, -2, 5, 0, 0, 13, 6, 3, 0, 19, -2, 0, 3, 4, 9, 2, 19, -13, -11, -9, -7, 4, -7, 5, -6, -6, 18, 4, -5, 0, -16, 10, -3, 9, 0, -21, -9, -6, 2, -10, 24, -2, -10, 7, -24, -27, -1, -8, 2, 10, -11, 3, 9, 16, -17, 1, -7, -5, -7, -16, 9, 6, 3, 1, -10, -31, 3, -6, 8, -21, 3, -9, 20, -14, 5, -5, -12, -14, 2, -6, -3, 7, 9, -14, 2, 7, 5, -3, -6, 0, 4, 10, -18, 4, 0, -2, 5, 3, 3, 13, 2, -3, -11, -11, -2, 0, 2, -2, 2, 5, -13, -2, 0, -3, -3, -1, -2, -27, 5, -8, -4, -1, -7, -4, -1, -8, 4, 3, -9, 14, -26, 10, -12, -6, -10, -6, 0, -12, 3, 5, 2, -9, 5, 10, -7, -7, 8, 5, -14, 4, 0, -17, -7, -9, -13, 9, -26, 7, -3, -10, 11, -11, 16, -30, 18, -3, -4, -2]
6.58658bL%qP%kRk2K1rOk9K8j6J9k7K3j5K4j7kqJ9qJ9j2Qj1J4pk3J0RNj3mPqK0j1OlokLqJ5Ok1
6.56165a3KTRj0J5j8J0oJ0Jj5LMJ3ojj4J6%qTJ4j7J3J2rRklpJ8k1P%pJ2njQJ1k7OkJJ3j7%MqLM
6.53571eJoJ2j7RjPj%j3NJ8k0K8m2M0j5qJJ5J0l9K5rMKj1lJJ2nkTMLjJ8k1%RNj4kPJ1jk6K0j0J
6.51027fOjTj0K1qoJ4l2K2j0QJ0k9PoK8rJ6j4lJ6j6Pj8J5rJ4JoJ0j0mJ7k0j0KRpRKqJ4j7J4%P
6.48636Ij6loK1j1oJ2pJ2k4K4pTNLj4K4oj2k%PJlpJ8oJ5nkj2J6l4J9PNj0lOqj1J0MoRj3MJ3mT
6.46092eJ5qkj4K7j2oj0J2jkRpjJ4rKj2J0ljKJ8l0%J8rj3RLjJ6k6J1NQj4QJ8l3RMKPKk3Q%TK1
6.43549A6k3PKTj8J6j4%OjLUjj8J7rQrRj0J5mPk0RMpnQJ6j0oqJ9qQj4KMjOj9MJ0mjlPj2kMJ3O
6.40802Gk0K2j8K1j0Lj0oMQOk7K3j1MJ8k2J6l4L6k7P%K3qj8pJ0J7j9J2LNqpjKNj9K2KTpjmJ9j0
$$ y = [-2, 1, 1, -7, 0, 0, -2, 7, -15, 6, -3, 3, -26, 2, -14, 5, -22, 1, -14, 10, -7, -9, -17, 2, -6, 13, 1, 9, -2, 12, 5, -18, -8, 1, 6, -7, -11, -4, -12, 8, -3, 3, 0, -6, -8, -5, -13, 2, 8, -13, -11, -9, 0, -10, 5, -13, -3, -9, 1, 2, -13, -10, -6, 7, 1, 0, -14, 2, 2, -6, -14, 0, -17, -4, 8, -1, 8, 6, 3, -4, 14, -7, 0, 0, -7, 5, 0, -1, 7, 18, -9, -3, -5, -4, 9, -8, -8, -4, -12, -9, -5, -4, -10, 2, -15, -6, -7, 0, -1, -1, -14, -9, 9, -11, 17, -25, 15, 0, -8, -7, 8, 18, -21, 4, -5, -1, 1, -10, -13, -12, 0, -5, -7, -9, -5, -2, -3, 15, -6, -6, 3, 8, -6, -8, -1, 10, 9, -17, 3, -7, -6, 0, -1, -2, -12, 9, 1, -5, 9, -23, -1, -11, -3, 7, -22, -15, -21, 7, -2, 14, 0, -3, 13, -3, 4, -14, 1, -8, 6, 7, 1, 11, 1, -3, 14, -6, -16, -14, -5, -12, -3, -1, -9, 5, -12, 2, 2, 9, -7, -10, -16, 5, -6, -12, 0, -7, 5, -19, 5, -2, -9, -4, -1, -15, 9, 3, -9, -11, -11, -4, -3, -6, -13, 5, -1, 14, 9, 7, -5, 11, -23, -4, 3, 8, -2, -5, 1, -7, -18, -8, -4, -10, -1, -14, -10, 3, -1, -5, 10, 2, 0, -14, 13, 1, -5, -15, -3, -4, -6, 3, -4, -5, 9, 0, 2, -10, 0, -3, -4, -2, 16, -14, -14, 4, -5, -18, -9, -6, -7, 9, -17, -6, -1, 7, -7, 1, 19, -14, -5, -1, 1, 8, 10, -13, -5, -5, -5, 16, -7, 0, 2, 4, -14, 2, -12, -12, -6, -7, -4, -1, 2, 1, -17, 0, -9, -1, -10, -1, -11, 4, 0, 7, -13, -4, 0, -7, -12, -4, 12, 2, -4, -12, 7, -1, 7, -7, -5, -1, -2, 4, -15, -11, -1, -5, -6, -9, -2, -14, -16, -12, 1, 7, -13, 9, -9, 12, 2, 5, -5, -11, -7, 1, 7, -20, 3, -8, -4, 14, -8, 8, -26, 10, -17, -10, -10, 13, 5, -13, -20, -10, 7, -12, 0, 3, 8, 0, -7, -8, -6, -1, -20, 2, 4, 6, -1, -2, -6, 13, 3]
6.38411Ck4K4MTk7RkMJ0k2K9k8M6n2K6j0PJj9J7j8L2m1M3j7Rj2J0qnJR%qlJ2nl%j0RKpj6K8%m
6.36020bK2k1Qj2RnLJ2j6L%loQoJMk7K6%J4k7RjJ1k7J9j5K2j0LOlrJ0nJ1rLJj8ROj7RJ4Kk6K3
6.33527Cj3J5j8KJ3ojK1k6J4j9J5J7l2NTJ2k0J5j7K7nrmj1J3OJ0k5J4rK0r%noPJ%jlpQJ2j7Oq%
6.31085a0QLj2J6j5J2j6K1oknpJ9lTj3RKoMNqjNJj0OLQnMk1J2Nj0j1J4Mj5K3k7K6j2K6k3NKkOl
6.28542Cj1jJPTj9%J7Mj0kQj0oK3l1K3J4k3lQnJ3j9J7j6j3K6j8K0j9L0j3pJ8j5ojMOJ0j1NqTJ3
6.26202Bj4J0Knl%J9pj3J5ojoQj1NQj6K0Knl%kQonMJj3J0j5K2j5RJ8j8jkTpPj1J1%kLj0kJ1KLJ
6.23506@lqJ4j4J4j7Rj1j3L0pjMTlj4Qj0J7pRoMnJ8k3J8l2K8mlNpqRnQk5K4oK6l2J7k1K0rJ8j4
6.21064dPj2J5jj5J5l7J3K5j0J2Kj1pknOPKj1Pjj2J7qRKlMPj1k2L1k0J1rmQrQnKj4J6J7k2%j0
$$ y = [3, -21, 3, 7, 11, -16, -7, -9, -5, 5, -17, 12, -16, 30, -22, 4, -6, 1, 2, -17, 0, -18, 14, -27, 16, -1, 8, -4, 6, -2, -7, -6, 3, 3, -5, -8, 4, -1, -4, -4, -14, -5, -3, -10, -26, 2, 2, -2, 20, -1, 7, -5, 4, -1, 2, 14, -2, 1, 1, -2, -8, 0, -6, -5, -1, -28, -2, -2, 12, -15, -6, -7, 4, -23, -4, -19, 3, -7, -4, 2, -1, -10, 0, -5, 6, -3, 0, 1, -17, -8, -2, -19, -10, 4, 6, -20, 3, -10, 5, -13, -11, 2, -4, -5, 16, -10, 4, -15, 0, 17, -15, -10, -5, 7, -13, 2, -15, 12, 7, -2, -6, -17, -4, 2, 12, -13, 1, -8, 12, 3, 3, -2, -8, -1, 0, 0, -1, -4, -11, -3, 9, -8, -2, -10, -10, -2, 1, -11, 5, -10, 2, -14, 7, 1, -1, -6, -13, 6, 3, 0, -13, -4, -2, -8, -4, 1, -7, -8, -3, -2, -12, -6, -3, 5, 0, 4, -17, -5, 0, -10, -21, -7, -3, -18, 5, -22, 4, -8, 18, -5, 0, 2, 0, 6, 3, -8, -9, -8, -1, 6, -13, -13, 4, 8, -2, -4, 4, -6, -12, 11, -20, 3, 17, -6, -9, -1, -6, 7, -12, 5, -11, -24, 2, -16, 4, -15, 15, 2, -5, 13, -2, -8, -9, -5, 1, 11, 0, 5, -3, -11, 2, -12, -2, 0, -5, -8, -8, 11, 4, -9, 6, 0, -1, -7, 1, -10, -5, 3, -13, 7, 9, 4, 1, 1, -1, 7, 1, -4, 0, 1, -12, -2, -17, 5, -10, -1, 17, -1, -2, -4, -6, -13, -6, -17, -6, -6, -8, -5, -15, -17, -6, -4, -1, 0, -3, -11, 3, -11, 3, -14, -5, -16, -29, 1, -6, -7, -3, 1, -2, -16, -8, -18, -1, -8, 1, -5, -1, -6, 12, -11, 7, -25, 3, -1, -4, 1, -6, -14, -5, -10, -2, -27, -3, -9, 17, -15, 2, -19, 1, -8, 10, -4, 3, -9, 6, 5, -10, 5, -32, -19, 6, -4, 8, 10, -1, -8, -10, -15, -9, -2, 0, -11, -4, -5, -17, 0, -8, 1, 3, 0, 4, 11, 0, -22, 9, -11, 0, -9, -13, -5, -14, -6, -11, -9, -23, -7, 10, -12, -12, -22]
6.18622b2J1j0J2JoLJ1j1MjoK9j6mJ5j3JljJ6j0%TOoLj9J7pPj6ROqkJ0kKkQoVJ3mkJJ1jkj2OP
6.15875aJ0qj0%Rkk7J9J0Jk8K9nj2OJ1j5K0l3J9j7RTj4JK6%qJj6J8j1J7jmpj4QOjRkLl5L5qk5O
6.13433b2J0NMJ3k3NQLK%j4RlnpJ3j3J5j7J9j5K0pmMLj1rKK4j3jpJ8j2J2k4J1mj3J9j6K1k2J6P
6.11093AOoj1J7k5J4lokJ9j0qJ8j6QmQonJ2j2kJ9Nk3kJ4j8K8rJj7J4n%j5J3jRj6K0k1J7%j0J5
6.08753Ej0JJ8pj6OrJ8k4K6jj8J0lPj4RPj9J8j8NkMjRqpK1j0JpNj5PLJ6k3lJ4j%kOjL%Kk3J6j
6.06159fK3j5J0k2J3qKlNrQkqQJOj4RKrPRqKmjJLnj1K6k8K3k6K1rnMROj9mjK3j1JQj5J1kJ3k0
6.03513a1J4lJ0j7qJ7%j8J1Pj8J8k7K4j1J6mTRmOj6NqK6j9LkmT%J7nT%OTj4lqK8jrj0nK5k3J0j
6.01021dOpoNk2K0qJ1j0K3j4LTj3K0onmQjoPj1J3oTMO%kjKqlmK9j7Kj4J0j3J9j1K2k3MTkQj0j1
$$ y = [-22, -11, -21, -9, -8, -14, -11, 0, -11, -7, -8, -14, 15, -1, -5, 10, -3, -2, -5, -6, 10, 0, 0, 0, 6, 0, 3, -16, 1, -6, 1, -15, -6, 0, -8, -10, 0, -2, 0, -2, 6, 0, -6, -12, -18, -5, -9, -11, -10, 1, 0, -2, -14, -8, -1, 9, 1, -9, -9, 0, -2, -29, -10, 0, 1, -27, 2, -3, -15, -9, 2, -13, 7, -26, -7, -24, -15, -6, -20, -19, 7, 7, -1, 0, -16, 2, -9, 8, 7, 3, -4, -18, -10, -4, -5, 4, 2, 5, -30, 5, -3, -28, -22, -12, -7, -3, 10, -13, -8, 0, 3, 5, 5, -9, 0, -3, -8, -15, -2, -15, 0, -17, 2, -13, 7, 0, -4, 0, 3, -8, -17, -15, 9, -4, -5, -12, 6, -6, 6, -18, -7, -11, -24, -5, -21, 0, -22, -6, 1, 7, 1, -10, 7, -18, -4, -7, -13, -15, 4, -6, -14, 4, -12, -4, -8, 0, -6, -11, 1, -11, -13, 6, 11, -12, -14, 0, -18, 10, 1, 2, -15, -1, -6, -6, -21, -8, -9, 0, -16, 4, -17, 0, 0, -10, 5, -5, -4, 14, 7, -9, -3, -12, 6, -18, 8, 7, -11, -1, -4, 3, -11, -2, 5, -14, 4, -14, -9, -11, -7, -8, 1, -7, -14, 7, -3, -2, -9, -4, -19, -12, -9, 7, -16, -19, -5, -6, -6, -8, -2, -3, 0, 0, 2, -21, -5, -6, 17, 2, 12, -10, 3, -5, -3, -6, -1, -10, -2, -4, -12, -4, -3, 3, -11, -2, 0, -9, -2, 7, -1, 1, -3, -4, -3, 0, -5, -16, 10, -18, 5, -21, 0, -9, -14, -10, -1, 5, -14, -18, -19, 4, -7, -6, 2, -13, -2, -4, 9, -11, 3, 0, 10, -7, -15, 2, 2, -16, -5, 2, -16, 2, -25, -1, -12, 4, 0, -4, 5, 1, 7, -9, -4, -12, 14, -5, -2, -4, -8, -12, -12, 5, 0, -5, -5, 1, 7, -7, -10, -18, 10, 9, 0, -10, -15, 10, -13, -3, -4, 2, -5, -11, -6, -28, -8, -16, -5, -15, 8, -6, -3, 0, -13, 7, 1, -4, -8, 0, -1, -7, 0, -11, 2, -4, -10, -6, 0, 0, -2, -3, -1, -9, -12, -16, 13, -4, -2, -16, -6, -19, 0, -11, 11, -12, -8, -4, -6, 2, -8, -19]
5.98426a9KTQJ4j0LnK0k6J4oQk2J7j5J1Lj2QJ0Mj8L7n0K3k2L3j1kj9L0j2jj5J8Lj3pK1k0K6k8
5.96290a8L9k8J5k9K%J9j1nRKJj6J0oJ4oJJ4j0pJ3Lk0KQj0QmMOjoqRJj3J6nrj1K2j4K2kjoPk2
5.93797b1J1MO%lJ3j1j0O%j1Pj1K0j2j0J8nJ1jpJjTj2K0j%j7J2NjkJj2qK7l0L2l4J9KJ3j2J4k0
5.91457a1jQJ2j8oLK8j7Rk8J8k2K1pJ3j5J2k0J4k0J7%NoJ0J%j0RPj7K8l5J8j1%Rj0J9j7J7k4K0
5.89269Cnj0oJ6Oj0J8jj8%Pj4OnNQj7J6Lqlj7K3lJ2qopJ5%JKOmjj3jJ1nj6RoK8k9K5k0J8j4kJ7
5.86726F%j4KJ1k5K1j7RkjQpJLk0K5j2PKrLPj4J2qJ1%Kk4RlJ1k2L1j8J9j0QmJNpj0J5oJkLNj1Q
5.84131@j7K0qMTj4OUlnrQj4J5oPmNj0OLjk3K2Kkj4J1Ljj6OQ%M%k4J5mRQTj3Noj3J2kj4K2rJ2
5.81435Ej6RoJ0%MrOTj9J6l1K7jj6J7j4JPlJkmJ1oJ3J5k3j5J3J2j1lMj0Q%N%jkMj3KkTJ0Lk0K2
$$ y = [-19, -17, -15, -7, 7, -3, 0, -5, 15, -11, 3, -3, 5, -17, 0, -15, -4, -1, -13, -5, 5, 9, -9, 28, -22, 1, -21, 12, 1, -1, -20, 10, -2, -3, -18, 0, 3, -10, -17, 4, -16, 10, -18, 21, -7, 8, -21, -19, -19, 0, -11, -16, -7, -5, -4, -20, -10, -16, -2, -8, -7, 7, -3, -10, 3, 6, -14, -12, -4, -14, -6, -10, -6, 0, -1, -7, -15, -6, -5, -18, -2, -7, -16, -27, -5, -19, 3, 1, 0, -6, 1, -21, -10, -6, 0, 0, -3, 10, -1, -11, -5, -5, -16, -9, -20, 0, -12, -22, -4, -9, 2, 1, -6, -5, -6, -7, -19, 1, 0, 0, -17, -5, 0, -1, -3, -2, -14, -22, 5, -25, 7, -27, -8, -6, 7, -5, 9, -11, -12, -4, 8, -10, -16, -13, 15, -2, 7, -21, -3, -25, -4, -11, 2, -13, -1, -21, -7, -27, -10, -10, -5, -11, -1, 0, 0, -10, -1, 6, -11, 17, -18, 0, -11, -11, -2, -12, 7, -10, 7, -17, 3, -2, -12, -18, -2, 4, -6, 12, 11, -7, -7, 0, -14, -8, -13, -8, 0, -17, -1, 2, -6, -9, -26, -3, -6, 6, -2, -8, -15, 0, 0, 1, 3, 9, 5, 4, -9, -10, 1, -4, -20, -11, -17, 11, -18, 7, -13, 5, -9, -11, 6, 6, -8, -6, 5, -20, 1, -16, -7, -9, -10, -2, -9, -8, -5, -25, 0, -12, -5, -3, -12, -9, -2, -16, -4, -12, -1, -1, 1, -23, -14, -17, -6, -28, 3, -15, 4, -6, 2, -2, -1, 4, -3, -13, 2, -4, -3, -5, -2, 3, -8, 0, -17, 3, -5, -1, 3, -11, -5, 1, 7, 4, -1, -10, -2, -16, -1, -7, 0, -4, 1, -9, -3, 0, -1, -24, -2, 0, -2, -16, -5, -2, -3, -19, -13, -5, -5, -1, -1, -25, -10, -14, -5, 3, 11, -2, 3, -3, -16, -4, -6, -20, 2, -7, 5, -11, -2, -8, 2, 2, 6, -3, 3, 9, -10, 6, -25, 2, 1, -15, 2, -12, -11, -4, -7, -6, -8, -12, -1, -7, 6, 21, -2, -17, -4, 8, -3, -6, -2, -12, -4, -4, 1, 1, 0, -2, 2, -11, -9, -11, -13, -3, 0, -20, 2]
5.78892BkKj1Nj0J4%j0jPMonK3l5J9J2k3nJ4j3J9nlKJ0Kj8R%J0k3JO%jRmjJnLJJ3j1J4k7QqJ2k
5.76297gNk7J1K6j9NlK4k1RrMj5OMrLNTMj2K6j6j7L2oj7LJ4j2JkJ7j7NoJ2K7j4M2ml0k0ROJ2M
5.73906C8j6k0j5J1qjK1k6L6j9kj4PmJ3Pj6J1j4J0j7J8j4J0jPqNlj0QOj2N%TKj1J4knJ4j1MJ0P
5.71566A5k4NjPqQkj7J0lMJ1oqTJ5j3Nj2L1k7K7k7J8j0NmNoPmJ5j7Qkj0J0oJ4pJTj6J6qLj3J0Q
5.69074@j5MrQROKj2J3lT%MJ0j3j2J4j3j%J8j8NOpPJ4j3j8J5onK3j0j7J5J0m0L0j0pJ1Oj4J4M
5.66733Bj6LjmK7j8PjJ3mj6Nk6J9qK1k3L6m2K4KJ0j0MoMqmMlJ0m%kKoJ1j6QpJ3kKmoj2K2q%K4
5.64190A6j3pj1J3qmJNoK0j6oKJ2lj2%OJ1kpoJ8J1j4%Pj2Rj0J0rLj1J3%j0KNJ2j2qMJQj7J1MJ
5.61697Ak0J5%j7MJ7j4%OJ7l1K0kKTj3J6qRQj9JKjTJ5k1J5opLj9K3qj0K1LJj9RmMLlpOj1J8rJ3
$$ y = [2, 0, 2, -9, -4, -14, 0, 0, -10, -11, -4, 0, -6, -11, 12, -23, -4, 8, -15, -20, -6, -19, 0, -5, -8, -6, 4, 6, -12, -3, -3, 7, -16, -15, -9, -9, -10, -1, -5, -6, -5, -10, -7, -6, 7, -4, 10, -17, -9, -17, -5, -7, -2, -29, -18, 8, -11, -6, -9, 15, -6, 3, -6, -2, -17, -11, -7, -16, -13, -8, -3, 1, -11, 15, -1, -18, 14, 8, -9, -6, 8, -4, -3, -5, 12, -5, 0, -6, 6, 33, 19, 61, 57, 27, 7, 16, 22, 34, 38, 22, 2, -13, -2, -10, -11, 10, -16, 20, 1, -1, -15, -8, -12, 1, 8, -8, 3, -11, -1, -18, 0, -14, -4, -5, 2, -6, -1, -4, -14, -6, 0, -12, -7, -7, -7, -5, -16, -2, -4, -9, 5, -6, -2, 8, 15, -9, -4, -5, 2, -6, 2, 0, -17, -7, -10, -6, 5, -1, -9, -17, -2, -15, -10, -22, 9, -18, 9, -18, 0, -10, -5, -9, -4, -10, -3, -7, 8, -9, -1, -3, -13, -3, -9, 5, -2, -1, 0, -16, 0, -8, -5, -18, -8, 0, -15, -11, -20, -12, -3, 3, 5, -7, 6, 3, 0, 0, 4, 14, 1, -11, 3, -10, -11, -11, 7, -11, -6, 0, -7, 0, 14, 1, -17, -2, -8, -13, 10, 0, -17, -2, 8, -32, -2, -12, -19, -8, -2, -16, -2, 2, -14, -11, -12, -16, 11, -7, 0, -1, 12, 8, -8, -3, -29, -10, -18, 3, -20, 16, -26, -2, 0, 10, 0, 4, -2, 2, -6, -10, -6, -9, 1, -3, -3, -5, -3, -9, 2, -14, -6, -13, 0, -2, 0, -4, -10, -22, 0, -8, -8, 16, 3, -4, -15, -2, -10, -14, -13, -8, -14, 6, -10, -16, -14, -2, -5, -17, -17, -11, 0, -2, -9, -15, 3, 14, 0, 0, 7, -5, 4, -6, 4, -5, -2, -13, 0, 0, -10, -8, -3, 9, -3, -11, -7, -6, 2, -15, -4, 0, 1, -19, -4, -4, -21, -17, 0, -14, -14, -8, 9, -22, -2, -4, -2, 0, -13, 3, -5, 4, 12, -7, -6, -4, -5, -6, 9, -12, 3, -3, -10, -7, -26, -3, -11, -21, 0, 3, 4, -15, -6, -10, -6, -3, -6, -13, -7, -18, 0, -9, 4]
5.59154Dj0J1l6L2j4K3k3J8Jj5J0k2J6j3J1LkmJ3nQk0J6npJjJJ2j4jJ2Nj6KnoJK5j4J5k6J6LO
5.56864Fj3kj8K2Qp%KTmlPJ5k0j2RKnRj5K8j5J5l8M5l5RTqJ2rMj0nJ2j1LO%J1kl0K7j0Rj1nRT
5.54372Bj9J7j2j0K5j1%J4j0nj1J5nrJ6%j9OJ2qJ3jqmKrJ5oJ5plNrPj2J4mLOnq%jQJoOk0LJ2J6
5.51777A1l3K4k2J8Oj4J2k3J3kJ6j8J4mT%jPj1J2j0J6j0Lk6J8oJ2j5J8j1K1j8JRk3J8j5K7k5J9
5.49692Dk1K0pK0k8L1l4POLKlqj1J4Oj3lJ0qj2K8j6JLQj7J4l2L7lLnj1J2mJ1j9NjK0j4Qkj5K0
5.47352Fj1nKK1j8Ojnj2J9qkoMj4K9nlkTk1K2j6J7J6oj3mJJ8j7J9k4J0Mj0J1j8RMOj7J8j7J3Lm
5.44961cJ4k8J5oPpQj2K0j9J2j9j5L7j0J3j4oJk2L4j6K3k2PTJmj4N%ROj6J6k5L1k1J9k8K7j4J6
5.42773Gk8K1Qk4Qj3J5k4K3JKpJ1j2OQj7Pj7J8nLPm%KplK5k5KK7k6kK2k7J0NLj4J4lOrOjqkK%
$$ y = [4, -6, 5, -31, 1, -13, 10, -13, 5, 6, -9, 1, -21, -5, -18, -7, -4, -6, -10, 3, -2, 6, -14, 2, -3, -10, -9, -10, -9, 3, -11, -12, 0, 5, -11, -9, -14, -20, -19, 6, -8, 7, -19, -3, 0, 6, -7, -9, -27, -5, 3, -4, -4, -2, 0, -4, -7, 0, 15, -5, -17, -8, -6, -11, -2, -17, 11, -4, 11, -27, 18, -17, -8, 1, -7, 5, -4, 0, -10, -15, -3, -14, -11, -5, -5, 6, 4, -26, 1, -9, 0, -11, -16, -7, 2, -17, 0, -12, -22, 3, -8, -8, 6, -4, -9, -20, -5, -10, -19, -3, -3, -22, -16, -4, -12, 1, 0, -8, -12, -10, -19, -4, -10, 5, -2, -5, 0, -9, -2, -14, 0, -4, -1, 5, 0, -8, -8, -9, -1, 0, -6, 0, -20, -17, -5, 11, -22, 2, -20, -2, 4, -10, 2, -21, -8, -10, 6, -12, 2, -2, -6, -6, -7, 0, -11, 1, -9, 7, -3, 0, -26, -8, -14, -2, -17, 1, -10, 11, -7, -6, 3, -20, -2, -17, 10, -15, 4, -17, 3, -4, 16, -12, 19, -15, -8, -2, 1, 3, 0, -8, -19, -5, 1, -12, -15, -5, -13, -25, 3, -13, -12, -9, -1, -18, -4, -36, 1, -2, 1, -4, -15, -3, -7, 4, -15, -10, -11, 9, -5, 3, 1, -14, 6, -5, -10, -8, 13, -5, 1, 0, -5, -17, 2, -6, -8, -14, -10, -24, 5, 0, -3, -5, -7, -28, -6, -22, -5, 11, 5, -8, -12, -11, 7, -10, 9, -15, -5, -1, -11, 0, -18, -9, -5, 1, -16, 2, -15, -2, 1, -3, 11, -17, -2, -8, -1, -8, 0, -12, 8, -11, 1, -18, -33, 4, -6, 7, -7, -13, -12, -34, 0, -16, 7, -15, -8, -1, 0, -4, -18, -13, -13, -4, 2, -14, 2, -23, 8, -13, 6, -22, 5, -9, 7, -21, 0, 8, -16, -8, -21, -6, -30, -7, -6, -4, -11, 0, -12, -6, 2, -15, -8, -25, -7, -12, -9, -2, -6, -6, -4, -11, -14, 11, -14, -12, 15, -11, -13, 9, -18, -8, -3, 0, -14, 0, -3, 3, -6, 0, -1, -9, -11, -9, -9]
5.40230iJ3pmQrLJOoLJ0j4J3j0lmJOTqnJ3j6MJPj5K0kj1lJ5j2kQkMj4K9k9Nj2K4nTJ%jMj0J8mj
5.37533@pKj0JJ0j2NQLpj0KMRmJqJ%TJ2j2j5MJ9oJ6%j1j2J4j5NJ6j3J1j0j3Qj1J4J6rorLJ0mR
5.35041aj4JJ7j0Nj0noK4j6J5%Tj8K5j7%KkLMok2L3j5PpK2k7K2k4K0%rLJ0j9K1l3J5PKmnJqK9q
5.32599Bk8J7%Rj3K2rj0MpLK6k7lJ0MKqMmkTQMj6J8l7L3rJ2j3JJ6jpj4J0NlOJj6J0rj6L2l6L8
5.30157Gk7K8k8OJ4nLjoPNj1%j4POoJ8j6QqJ1lQk7J6Tj0Mj9RJ5nlkmnj%nOJ5mj3NmJ3J1j9J5k1
5.27563a4J1Mjj1mPQJj6J3j5J3k1J1MTpJ0mPjnMKJ0j2%JpLmRMj5jJ2j7L2k0j5J9jj0RknJ6k3K5
5.25070Hlj1oQ%j2K1k5J6kj1J7Jqk3L0lNjKoLj3KMjOTmJ7l3N7m8n2M3j6K3mlJ5k4J3%OJj7PNRN
5.22526Dj3nOJmjKPrnJ1qJ1Pj9LTlJ5Lj7LJ3qj2oK5k8J7mMkqNPLj8K2%onrJ9k0NRQmj2%J1oj3
$$ y = [-9, 4, -3, -7, 1, -8, -5, -4, 2, -4, -1, 9, -5, 8, -2, -5, -9, -8, -2, 4, -4, -9, 4, -12, -8, -7, 0, -15, 5, 3, -8, -11, 4, -8, -10, -2, -4, 0, -14, 15, -14, -9, -21, 3, -2, -7, -6, -6, -7, -3, -13, 5, 1, 0, -7, -5, -15, -14, -4, -16, -11, -3, 0, -7, -17, -15, -11, -2, -6, -5, -13, -12, -12, -12, 0, -12, -27, -23, -4, -10, 6, 6, -5, -17, -3, -18, -13, 3, -10, 1, -9, -22, -14, -25, -11, 5, -4, -10, -19, -16, -6, -10, -1, -15, -14, 3, -7, -2, -12, -17, -23, 1, -15, 0, 0, 0, -18, 7, -10, -10, -8, -10, -7, -3, -9, -31, 2, -13, -6, -13, 9, -18, 4, -20, 0, 0, -9, -6, 4, -15, 6, -27, -12, -5, -3, -7, -12, -11, -19, 10, 2, -26, -9, -9, 0, -13, 9, 0, -10, -6, -13, -10, 16, -11, -14, -4, 0, 2, -6, -2, -6, -8, -10, -2, 2, -14, 4, -33, 0, -9, 3, -10, -9, 7, 6, -1, -15, -5, 0, -3, 3, 4, -12, -2, -11, -27, 5, -31, 7, -20, 8, -20, -14, 0, -5, -2, -3, -9, -2, 3, -8, -8, -22, -15, -9, -15, 3, -13, -5, -13, -2, -5, 3, -24, -8, 8, -2, 2, -17, -8, 7, 2, -1, -3, -7, -12, -13, -13, -18, -12, 3, -1, -14, -9, -13, 0, 11, -8, 7, -14, -3, 1, 0, -11, -15, -8, 0, 1, -15, -2, -17, -4, -25, -14, -10, -6, -13, -3, -7, 0, -1, -6, -2, 0, 10, -2, -2, -1, -8, -5, -9, 0, 4, -11, -12, 0, -17, 15, -5, -20, -1, -2, -12, -3, -5, -10, 6, -17, 8, 5, -6, -12, -4, -4, -16, 5, -20, -4, -6, -17, 0, 1, -7, -30, 0, -3, 2, 1, 3, -3, 0, -13, -11, -7, -8, -2, 4, 0, 17, -16, 41, -7, -59, -16, -32, -9, -13, -16, -1, -25, -12, -12, -6, -5, -22, -15, -10, -1, 4, -9, -14, -8, -7, -11, -12, -10, -3, -12, -17, -6, -14, -3, 4, -15, -12, -9, -12, 3, 6, -11, -8, 5, -3, -15, -21, 4, -24, -7, -11, -7, -9, -17, -12, -5, -2, -20, 2, 2, -4, -9, -18, 1, -19, -14, -5, 3, -1, -13, -13, -2, -8, -21]
5.19830b1J6LkPpk8J7J4JjpqPOLMj1Kmj3K3LoJ4j8Oj5J2pjlRrJ3RqkKJj3J5j5KpNJ0%j1J4j7l
5.17236a9J7lj2J0Tj0Oj2J3Qr%kRj2jJj0L2l7J8j2J4olj0J1j4K7j2L%oJRj6PJj7J9j9K0OokmLR
5.14794@j4KnJ8kOqj1LJ4k1OJ2kJqrQLKJoJ3nqJqPTnoQJ6k4kO%Qj1J2nj6K3j9K0k4J0Nj%rJ5kr
5.12047a3kJ3j8K3j5J0j0MQj9L3k5MJjnJ1Mj1K1j6mj0RMrQlRoJ3j8LJ9k7MJ0jrRj3JJ8j9K7j2
5.09707@j6J9lk1J8Rj7RmNMoJ2l4K2NlnNj0lJ4j0RqKj8L7j9LMl1K1j1K3k2K6k0RoJ4j6J3j1Onl
5.07316a3J0lLk0LK2pnRjj4J8lkk1J4Pk2K5lpJ3k2MJ4k%Jk7K0qkK0k1J0qMK7k7PJ7j6nRlTJ7j5
5.04874fNrl%TJ6kLj9Kj0J7Mk7L3l0K6j0J5j9kJ0j1PnJ1oPlpQrJ9j3Qj3J5nMqJJ8j8pNjoJ5KkP
5.02280Gmj7MOJ1k5MJ2LPj8Oj7K1NmTklK3k4rOKK0j3KmJ5j9OpJ6j3k0J7j0J8j8K4j2Qj4J7j3J0
$$ y = [-21, -5, -2, -4, 3, -4, -32, -15, -1, 0, -1, -8, -16, -9, -3, 0, 4, -7, -5, -9, -22, 1, 4, -2, 12, -6, 0, -15, -3, -10, -11, -14, -5, -14, -1, 8, 0, -2, 0, 1, -12, 3, -12, -10, -17, -12, -2, -2, -13, 1, -16, -19, -2, -5, -17, -7, 3, -7, -1, -13, 0, 8, -1, -1, -3, 6, -6, -7, -6, -16, 16, -21, -3, -15, -1, -7, -10, -20, -9, -23, 4, -8, -5, -5, -11, -10, -1, -17, -10, -9, -26, -7, -26, -6, 0, -6, -8, -12, -9, 0, -14, -12, -17, 1, -1, 5, -3, -14, -11, 3, -18, -12, 0, -2, -1, -9, -18, -10, -7, -5, -4, -10, 3, -2, -10, -9, -17, -10, -3, -8, -14, -6, 10, -14, -16, -10, -10, -2, -13, -1, -6, -22, 1, -18, 2, -22, -12, -7, -8, -8, -17, -2, -4, -13, -15, -2, -20, 3, -12, -2, -12, -8, 0, -19, 14, -11, -7, -6, -7, -12, -1, 3, -8, 13, -3, -7, -17, -8, -4, -13, -5, -8, 1, -5, 8, -10, -7, 12, -15, -11, -1, -2, -11, -2, -15, -14, 4, -15, 12, 0, -16, 3, 0, -21, -3, 6, -11, -2, -6, -1, 3, -3, 9, -25, -3, 2, -1, -6, -1, -11, -14, 0, -10, -1, -9, -7, -25, 12, -7, -4, 0, -31, -10, -21, 2, -20, 6, -14, -5, -11, 3, -13, 0, -11, -5, -10, -13, -3, -6, -3, -23, -20, 2, -5, -10, -1, -2, -16, 2, -1, -3, -24, -10, -3, -25, 0, -3, -10, 3, -19, -15, -1, -3, -3, -2, -29, -9, -17, -19, 1, -20, -10, -18, -14, 13, -14, -7, 10, -6, -11, -2, -5, -8, 9, -6, -1, -10, -13, -13, -13, 3, 1, 4, -15, -13, -23, -6, -2, -29, 4, -26, 0, -10, 5, -14, -16, -6, -17, -10, -15, -4, -10, -3, -6, -13, -5, -14, 5, -8, 0, -13, 2, -3, 1, -7, -6, 12, -6, -13, -8, -9, -15, 0, 2, 0, 7, 3, -14, -10, -4, 7, -18, -14, -2, 1, 8, -10, -4, -21, 0, 5, 1, -3, -5, -8, 15, -9, -18, -12, -10, 10, -3, -1, -5, 10, -9, -3, -10, 6, -7, -27, -10, -20, -2, -20, 4, -8, 0, -14, 3, -10, 0]
4.99940@%nj0J7Ok1Mj1K6k2J4j7K0j2KJj3L3j8%qJ0JjkRmLj0qJ6j5J2j4j5K3%lPJ4rLj3J1jmnM
4.97498ej1RKLj6OpJ9qnJ4jJrlJJ4j7J0rQj2J5JNl3J7J3j7%pKmJ5J1lj4MJ8k2J1j2QoJ3Jj2PK
4.95005cJ5k0J2plOk1J3j1J1KQj7krJ6J5Kk4lJ1PJ7j5nNk9K2jJ5j0Lk5K0nTROqLOj0jJ2MornRl
4.92462hMjTKmqK1pKj6J6k2K2kj5J1O%j9K0rJ3j6MqkK0k0PMNk1K6nj2J5j0pQMj6KK1j8J1%nj0M
4.89969a4J0rJ6rK6l4J4kJlJ3k6J7Tl1J4k8K4MQplj6KJ6j2j1J9MoLj0J3j5JNpJ7n%pOJrQj0J2q
4.87527a1Pj5K2j5JqJ8k7L3l6L6l1K7j9J7j2J6n%Kj5J2j5K0nj1j0J5nJ6j5KQpQj1%J2mJ%Mj3JO
4.85238foNqJ2j%j7J5J4k0J4mk1K4j5J9j0Pl0JJ2J8j3Oj0O%k6L3j6J2lPnLj0J3j1j%J4pnrOTK
4.82847eJ2k0mqJ6j1J4j3J3j0J4pnJ6j4J0j4PKjrJ4oUL3j2j5K0k2PRJoKqQO%j2rK0j5PQj7%J1l
$$ y = [0, 0, -5, -15, 2, 8, -13, -9, -20, 6, -16, -2, -19, 1, -11, -9, -8, -21, 12, -6, -6, -14, -4, -3, -4, -6, 3, -1, 2, -8, -16, 0, -15, -3, -17, -32, -9, -9, -12, -5, 9, 0, 3, -10, 1, 0, -4, -9, -5, -16, -7, -5, -2, -18, -12, -19, 0, -8, -13, 1, 0, 1, -8, -11, -10, 4, -13, -3, -12, -4, -16, -1, 0, 5, -28, -11, 2, -15, -15, -22, -20, -24, -9, 2, -1, -15, -11, 7, -15, -4, -16, -8, -14, -1, 0, -12, -5, -3, 12, -8, 4, -3, -6, 0, -21, -8, -19, -8, -6, 2, -15, -17, -26, -10, 5, 7, -17, -20, -9, -2, 15, 0, -5, 0, -29, -7, -8, 7, -3, 0, -25, -5, -10, -15, -6, 0, -8, -5, 1, -9, -10, 2, 6, 0, -9, -14, -5, -8, -4, -5, -6, -4, -8, -16, 5, -2, 0, -16, 0, -22, 0, -2, -17, -6, 0, 0, -19, 1, -8, 5, -11, -7, -15, -17, 3, -17, -10, -6, -1, -22, 4, -1, -13, 2, -8, -15, -7, -3, -19, -17, 4, -14, -3, -3, -8, -18, -14, -4, -13, 3, -6, 20, -14, 0, -2, -1, -4, 9, -17, 0, 17, -14, 0, -28, -4, 0, 8, 1, -2, -18, -16, 0, -12, -23, -4, 0, -6, -3, -13, 0, -15, -14, -9, -16, 1, -4, -4, -11, -5, -4, -13, -5, -15, -3, -11, -4, -19, 3, -12, -11, -19, -1, -28, 5, -31, 5, -26, 1, -18, -1, -13, 3, -2, -2, 0, -15, -3, -18, 2, -3, -14, -24, -9, -14, 2, -13, -11, -3, -10, -2, -13, -13, -1, -5, -4, -4, 0, -13, -12, -6, -12, -7, -15, -3, -4, -4, -21, -6, 8, -12, 2, -2, -23, 1, -14, 5, -5, 2, -28, -27, -15, 3, -10, -4, -14, -8, -8, -34, -1, -17, -5, -8, -1, -6, -3, -13, 0, -11, -12, -12, 2, -5, -10, -19, -13, -7, -5, 7, -13, -17, -25, -9, -20, -6, -19, -6, -16, -2, -9, -14, 2, -12, -2, -16, -9, -7, -8, -17, -3, -9, -15, -21, 12, 0, -15, 5, -17, -10, -1, 0, -6, -4, -12, -4, 2, 2, -10, -19, 1, -14, -7, 1, -16, -16, -5, -8]
4.80354hKj6K6rRj2Qk9J8mJ5j8J0KqOLj5NJ9j0pmJ4J0j5LlQj2K0qjj0KK0k1J1k0J7j0J7k7RkJ0
4.78014enQTj8NTMj6J9j2J8k3mKolJ9qLj4L4l0PrK3Rl0QTlJ4k5QmJ1oJlTMj7M2k0Pkjk1J5%j2R
4.75420iKJ5j0nOjn%Pnkj5J7JpJ6j2J4k1Nlj6L0l0J7j3K1Rnk3NQ%J2j5LJ0j9J1mKJ7j9Jj7RKK1
4.72978Ej6kJpL0k1jj4J3m%LTKmrJ8j3NqJ3j5J4PrlpQJ1oqOJ4oqmPLj0QMj4OPk0K5j4Lj8K3j8
4.70384b0J2J8j9pJ0Oj9J8Pj2k%jOKRk5pJ6j4K2j5TK6qmPj2K6n%jnLjj0J0j0j1J5QLk%j1oJ0j0
4.67942a8J3qK1k2K5nj7kJ9j3j7J9Pj8K5k2lJ2Lkj1PMkpJ4lPmk2K3pj7jJ2qJ2JjkjRj2J2j4QKT
4.65500bplJ2Rnj1mJ1oPj2nJ1Kj9K3l8M1j7J2j2J3k8L1j7QpJ7j5jJjlTLQj0J1jj1J5j3K1j5Lj6
4.63160b3J3J6k3pJ7pJ5rkpMPJ3j8J8j5Qj4PmrK0j4J1pTO%J2j7J9j4J5j1mpNj1J3JJ9l3J5NJ0
$$ y = [-8, -6, -22, 4, -5, 4, -8, 0, -29, -11, -15, 0, -18, -8, -6, -14, -8, -5, -20, -15, 4, -6, -13, -17, -3, 7, -8, -5, -8, 0, -12, 8, 0, -1, -11, -9, 11, -10, 1, -19, -2, -12, 5, -22, -13, -15, -5, -10, -2, 6, -12, -7, -2, 2, -14, 5, -7, 11, -12, -16, -14, -20, -23, -4, -12, -9, -23, 11, -19, -12, -21, 2, 11, -19, -11, -3, -6, 8, -17, -9, -13, -2, -8, -7, -10, -13, -9, -26, 16, -4, 3, 1, 0, -21, -6, -6, -18, -9, -7, 8, -2, -7, -1, -2, -7, -7, 0, -5, -7, -22, -5, -4, -11, 5, -7, 7, -14, -9, -12, -28, 2, -28, -11, -24, -3, 6, 1, -22, -17, -9, -9, 3, -12, -9, 1, -18, -7, -11, -9, 8, -11, -10, -27, -18, -16, 5, -11, -13, -12, -19, 11, -10, -11, -25, -12, -16, -16, -13, -10, -8, -12, -21, -3, -16, -11, -19, -6, -21, -7, 0, -9, -12, -19, -11, 0, -6, -14, -8, 6, 0, -8, -12, -5, -2, -12, -4, 0, -14, -8, -1, -21, 4, -10, -7, -25, -2, -20, -8, 10, -9, -16, -6, 0, -19, -1, 6, -6, -8, -8, -9, -3, -1, 8, -17, -24, -8, -22, 0, -15, -30, -4, -12, -16, -9, -21, 5, 0, 0, -1, -6, -3, -4, -14, -4, -14, -25, -10, -2, 1, -1, -1, -12, -18, -8, -18, -5, -13, 8, -14, 11, 6, -11, -13, 6, -7, -24, -5, 2, -16, 9, -13, -16, -4, -1, -3, -14, -7, -3, -5, -12, 2, -1, 6, 2, -20, 3, -4, -21, -22, -10, -18, -6, -5, -6, -8, -9, 0, -12, 0, -14, -6, -4, -2, -9, -12, 0, 9, 4, -7, -11, 0, -6, 1, -11, -16, -5, -3, -22, 1, -37, 4, -13, -1, -13, 0, -28, 3, -14, -6, -13, 4, -11, -12, -11, -12, -15, -18, -15, -7, -17, -6, -7, -18, -3, -16, 5, -10, -7, -23, -10, 6, -17, -24, -7, -14, 1, -8, -10, -17, -13, -6, 7, -11, 7, -8, 0, -14, -7, -11, -20, 0, -14, -3, -10, -17, -11, -11, 1, -16, 3, -11, 4, -7, -11, -18, -13, -24, -11, -10, 9, -24, -9, -4, 6]
4.60871Fj7lR%lJ1j0TqK6j3jJ3kTmOj3J5j6J0MpmOj5K0rKoJ4j1K4j9%J5k0J3qj7J6Kj2PJ1k3NR
4.58429iLj2J4k4K8mjRj8J0j0KqJ8j7jNTJ5j9%K1k0Q%mTrK6k5L1k9K4k2K2k4J2kjRrokTL1j5rj
4.55987a4MKJ1j6O%MpQk2J9NLj5jmK7j0kLj7J8jqkLRk6J3%pJJ2Tl0K8j9Rnj0MRJ0k4KQJ3j3OL%
4.53393aj3Nj3K7k4QPj3K3l4J2%J9lJ3k9PMj1K2k5J8J2j4k6L0j2JPjMk2J4j%Qj8nJ7J0k3RnJ1
4.51154ej1NKlPJqjRj3OJTj3K6lpjlmoj5K3lj5J5J3Nlj4J4j0J1mJj9Qj0RTMj7J0lJ2j8J8j7J0O
4.48611@j5KJ6j8J5Nj2kj5J8Pj2pJ8Jmj1J2j4J4j0j7J8J6nrj9J5J1oQ%k0PROj0MKj3K1j3Nj8O
4.46322a4J1NkTolPoMjTj1lJ3KjQpjj7K8l1J6Moj0J2lJ1mrJ2Pj2mJ3nLj4OLJ3nll7L8oj5KJ0j9
4.43727c0jK6j9K4Mmnl%kjRrmLj0J9Kj4PNj8J6j2NoJ8j2NPLRk7J8qOj2J4k6PJ6nj3J5Mj3J1Ml
$$ y = [6, -11, -14, -5, -5, -8, 3, -7, -17, -25, 1, -12, -13, 0, -2, -4, -8, -2, -15, 0, -16, -6, -2, -9, -13, -7, -22, -2, -11, -9, -15, -1, -12, 12, -7, -7, 8, -12, 1, -7, -24, -8, -6, -18, -11, 0, -23, -18, -9, -6, -18, -4, -28, 0, -4, -5, 4, -14, -4, -14, -12, -20, -2, -19, -20, -15, -10, 5, -14, -14, 7, -13, -5, -5, -9, -13, -22, 4, -21, 10, -19, 5, -17, 5, -19, -7, -9, -10, -1, -10, -16, -18, -20, 11, -4, -13, -14, -10, -8, 3, -13, -7, -7, -3, -10, -2, -24, -5, 0, 3, -12, -13, -17, 10, 0, -2, 1, -16, 2, 1, -7, -9, -6, 3, -23, -10, -10, -17, -16, -4, 8, -22, 6, -13, -4, -9, -19, -15, -6, 4, -20, -18, -10, 3, -10, -4, -1, -1, -14, -9, -22, 5, -19, -11, -4, -17, 6, -28, -16, -16, 3, 0, 13, -16, -9, -5, -16, 6, -19, -1, 11, -3, -29, 1, -11, -10, -3, -4, 0, -22, -8, -9, -9, -1, -19, -24, -7, 3, -20, -11, -16, -5, -16, -11, -9, -12, -5, -4, -12, -13, -4, -17, -11, -10, -9, -22, 4, 1, -6, -7, -10, -14, -20, -35, -12, -15, -30, -15, -2, 3, 0, -14, 0, -10, 1, -3, -2, -21, -13, -23, -14, -5, -1, -18, -8, -11, 1, -17, 1, -16, -6, 0, -15, -13, 3, -15, 0, 5, -7, -9, -24, -6, 1, -11, -18, 0, 1, -3, -14, -2, -16, -2, -12, -29, -11, 5, 0, -9, -28, -13, -2, -8, 0, 0, -20, -13, -4, 2, -8, -4, -2, -15, 6, -7, -2, -20, -14, -3, 2, 0, -2, -8, -11, -4, -10, -6, -7, -8, -19, -22, -9, -7, -8, 0, -7, -8, -25, 3, -28, -12, -8, -14, -24, -12, -15, -4, -8, -17, -5, 2, -10, -14, -1, -6, -3, -17, -11, -8, 5, 0, -3, -40, -2, -8, -23, -21, -11, -30, -31, -5, -24, 0, 4, 0, -5, -8, -8, -10, -11, -2, -11, -15, -12, -22, -3, -1, -15, -8, -3, -21, -5, -17, -12, -18, 0, -12, -7, 0, 3, 12, -15, 3, -5, 1, -11, 3, -23, -16, 0, -5, -18, -3, 1, -12, -1, 3, 0]
4.41234@j3LK1k2%oJ6nk5K3kqJ9j3OLk2J4PnK4k7J8k3J7j0k2K1Rj3MPj0J5k4OjJ8j9K3j4Qlj3
4.38996a8J4k1RPj8OJ1j0JrJ2J6j0Noj0J4K1j4jj2mJ0pJ1j7qL0k9K8J0k4%kj1PJ2KmKj6K1mKqO
4.36656fj5K1j3MTmjj3K1j6KJ2nMmj0J9j3J8j7oLOJ1j3PjmTKjrK3nj2J0j5K2j4J9k7J7Jj2lrJ0
4.34265a6LJ3j5J7j1KkJ8k6lJ0M%nlLPlk1L3k2J3J0l0J0Rj1J6%oJjkJ0Jj1Oj1J3k3J6qM%Qj0%
4.31874a3j1L9j7%j7OMPj2qK2j1J3j5Oj7J3qJ4mPk3J7JrOL%kPl1L5j0J9k4RkprK2oj1RlTRMrj8
4.29381b8L0j4QkNlm%j3oJ3pL4l0J6qpNOJo%oJ6j8OJ5j0kqKkJ7j5J5k1J1KkJRmnj2K5k8J3j1K0
4.26889bmRKj8J3j3Rk7K4jj2NJ0Oj7K0l0K7%oK4k2lQk1J4j7L1k9J7j3kK2k4J7j5K4k9K6lokqP
4.24650ik3M6k9QOlj2N%jTJqLJ6j0J1p%j0R%nj0K2j5K2k3K2j8K4k7RJ0ojnrpK5j3J5k0J3JqlJ8
$$ y = [0, -13, -10, 11, -11, -11, -17, -1, -6, -31, -8, -10, -18, 1, -12, -6, -3, -25, -11, -4, -9, 15, -12, 6, -17, 0, -10, -32, -11, -2, -15, -11, -4, -14, 1, -23, -17, -18, 0, -19, 4, -10, -2, -5, -18, -4, -25, -16, -9, -27, -21, -10, -20, -19, -28, -16, 0, -10, -5, -11, -21, -7, 14, 0, -1, -13, -17, -7, -14, -3, -20, -28, 2, -27, 1, 11, -13, -13, -15, -26, -19, -7, -5, -9, -7, -23, -2, -6, -4, -12, -6, -21, 0, -13, -9, -5, -9, -10, -23, -2, -18, -16, -4, -9, -5, -9, -19, 0, -13, 5, -12, -18, -15, -9, 2, -11, -4, -5, -9, -13, -11, -12, -21, 2, -3, -15, -5, -20, 2, -12, 7, -20, -3, -2, -14, -17, -26, -16, -13, 0, -15, 2, -9, -7, -9, 9, -17, -20, -10, -6, -6, -11, -14, -11, -4, -7, -28, 5, -17, -4, 6, -24, -14, -5, -16, 0, 0, -6, -5, -6, -8, 2, 3, -8, -2, -13, 0, -23, -7, -15, -11, -11, -3, -13, -13, -24, 15, -2, -2, -19, -13, -9, -2, -14, -22, 0, -11, 2, -13, -7, -24, -11, -19, -5, -9, -2, -25, -8, -7, -16, -10, -7, -7, -9, -2, -33, 2, -8, 11, -13, -4, -6, -13, -22, 0, -6, -17, -8, -11, -14, -5, -1, -10, -28, 2, -12, -4, -6, -1, -4, -8, -8, -21, -27, -14, -21, 13, -17, -1, -9, -16, -11, -5, -4, -10, -10, -16, 0, -18, -12, 3, -7, -9, -17, -15, -17, 0, -15, 0, -21, -10, -8, -10, -9, 0, -4, -9, -21, 4, -24, -11, -22, -2, -6, 3, 5, -13, 0, -13, -4, -31, -7, -8, -20, -15, -5, 1, -16, 4, -26, 1, 1, -5, 19, -3, -6, 2, -19, -5, -22, 9, -20, -3, -16, -18, 4, -20, -3, -18, 6, -23, 3, 0, -6, -8, -16, -9, -32, 14, -15, -7, -1, -4, -16, -11, -11, -12, -13, -12, -20, -17, -1, -11, 0, -7, -7, -17, -8, -8, -13, -23, -1, -16, 6, -17, 5, -13, 11, -16, -7, 3, -3, -4, -9, -18, -25, 0, -13, 2, -18, -5, -4, -12, -15, 3]
4.22209ClTj6QMpJkRmJ6j1J1k4QJLoJ6mpoJ5j1kjNjqJ3oqQj3mRmMjJ1%kjOk1J9k%j8OJ8j2Oj0Q
4.19411a0JK4k1Jj3J8k0K2m%k3J4pMJ0j2J2j7NjJ5k2L0qj7OK0kk0J9kj5jJ4mpkrQJ4%k3J3j1R
4.17121a2K0k5lMJ9lj1J2j5Or%TK3qNk4LJ3kj7QL%j7L1kJj5J6j1j3K5j5mJ1jMLmMj1J1l0M1l1
4.14781b0J4oO%j3J6%j4J1kj1LK7j9Ok1L6l5J5oNOmj1J6KqJ0j3L%TJ0k5QKkjJ4j2ljKPRl0K9j8
4.12340a8PJ5q%pJ6j8J3k3J8j5K0j4J0MJ8k5knK8k2oOkKoK3l2Qj2K6lJpJ0j3qJ5%pPqjRjJ3k8K
4.09898b0RLPj7MQTj9J2OK%j0Ok8L4j6J2j3J6qMj5pK2jpjRj0lMj2J6l%PpJmJ1j2J2j9K2pJ2k8
4.07456b0J5J2j4Mk7K9j7J4Kjj0jkmJ9j4OMPj9K1j9QnJ2lLPL%j5kMj6K7K%nJ0JJ8J4Tj1j9Rk7P
4.05014B1KJ6k2j6rJ9j3OplKpj1L3j0j1Rj6J0nLNLj6J7j9J5oROk1J1QKkKJ3J0K4R4M8J2m0l6k2
$$ y = [3, 0, -3, -19, -11, -7, -14, -13, -15, -6, -10, 6, -5, 6, -18, -10, -9, -6, -12, 4, 0, -7, -13, 2, -9, -11, -12, -7, -8, -16, -3, -9, -17, -9, -22, -26, -17, -21, -17, -18, -7, -7, -9, -10, -4, -25, -6, -8, -8, -26, -20, -2, -14, -8, -18, -10, -9, 15, -6, -5, -18, 0, -20, 2, -2, -2, -25, -11, -18, -14, -4, -16, -4, -21, -16, -17, -2, -24, 6, -2, -19, -13, 7, 5, -15, 4, 2, -13, -14, 0, -4, -11, -13, -22, -14, 0, 0, -23, -10, -21, -12, 8, -17, -20, -16, 3, 0, -11, 1, -14, -8, -17, -17, -17, 6, -2, 3, -21, -18, -5, -7, -24, -16, -13, -13, -30, 1, -1, 0, -15, 1, -10, -23, 2, -13, -17, -6, -7, -3, 0, -4, 0, -11, 0, -30, 11, -20, -6, -12, -6, -6, -19, -3, -3, -17, -6, -8, -19, -16, 11, -8, -2, -23, 13, -22, -7, -13, -8, -2, -6, -17, -1, 1, -7, 3, -10, -7, -7, -7, 3, -22, -14, -12, -14, -15, -1, -13, -16, -17, -15, -8, 1, -29, 0, -18, -11, 4, -4, -4, -11, 5, -13, 0, -23, -5, -20, 0, -14, -4, 0, 18, -7, -9, -14, 14, -8, -14, -8, -10, -8, -14, 9, -23, -15, -27, -1, -4, -3, -10, 0, -13, -21, -6, -6, -13, -6, -14, -15, -6, -7, 6, -22, -20, -11, -8, -1, -18, -14, -6, 2, -17, -5, 1, 3, 3, -7, -1, -29, 5, -11, 1, -12, 4, -4, 0, -15, -22, 0, -1, -8, -9, 0, -10, -13, -9, -21, -5, -8, -8, -1, -8, -7, -11, 0, -12, 0, -19, 3, -4, 8, -20, -5, 7, -7, -3, -30, -1, -18, -4, -2, -3, -13, -14, -16, -20, -1, -15, -9, -5, 2, -17, 4, -15, -7, -12, 0, -3, 0, 7, 10, 10, -5, -7, -3, -19, 8, 10, 10, 5, 15, 16, 34, 48, 62, 51, 32, 41, 14, 21, 23, 39, 17, 1, -8, 11, -2, 4, -3, -6, -4, -11, -22, 11, 1, -10, -1, -17, -7, -12, -9, -4, -1, -17, 0, -19, -4, -10, -1, 5, -16, -5, 3, 5, 3, 5, 18, 28, 52, 146, 194, 206, 166, 130, 108]
4.02725A08jmj4Jm1j2k0lNj0TqRJ5j4lJj7K4k1MKJoNJ2j6LnJ0KQjqlJ6njK9J5N2N7L5rk5m1k3R
4.00283A02qpj4k5k1k7J1k3J8j6L2k2Pj8kLPj7J3j1J1Rk1J0lPJpNj5K8p%j3J3J7k5RNL3K2Jnj9
3.98045C8nmJ1k2J4l1knoPlJ0joj4J5Mk0K0qKj0K%Qj3jJ1k1L1joj5lNJJ3j6QJ8pj5KTj1L5k7J2
3.95603dj5K3k2RTk3J5j4RTOk%j0j9K7j3j5J9LJ4rk1lRoJ2mJ6pJmLnPjnKmOLj5rJ8j6JjJ6qJ7
3.93059ak0K8l4K5j2oJ6oRMk2J6prNmqJ5ljR%J2k3J1k2K6j3K0j6Jj9L2j0J8l0K4k0K2prmjJ4j1
3.90770a1K2l0KJ1kK2j6RpJ8rNJ0TJ8K3L7L3rKm2%k%j7j0Ml4ok1JqTJ2j4J2pj3J6jnrMJ3Kj2j1
3.88379a8J1j7J2j1J3pTJ0oQKoRjpk3L4j6lJ2mPj3J0Lk3L1k1Qj1J5kTKLlrMj6K0kJj2J6mOj6kK
3.85887b3K7k8LJ9j1J6jj9LJrPJ9j4pTJ0Kj5K7k4J4nlpLj5K3qRj7J3j0nJ9j4jRj1Pj1J7j9opK8
$$ y = [108, 107, 103, 89, 90, 49, 37, 17, 14, 19, 9, -1, -9, 0, 15, 1, -2, -1, -18, 6, -15, -11, -9, -8, -14, -9, 3, -13, -10, -15, -5, -3, 5, 4, -4, -7, 9, 4, 3, 32, 47, 99, 156, 191, 182, 157, 116, 93, 102, 94, 87, 73, 48, 27, 0, 11, -12, 6, -10, 22, 0, 7, -11, -13, -10, -3, -20, -7, -18, -7, 2, -19, -9, -12, -5, -4, -11, -6, -21, 7, 0, 0, -13, 0, 17, -8, 1, 6, 39, 61, 62, 57, 38, 33, 29, 40, 18, 32, 1, -1, -6, -12, -5, -8, 2, 1, -5, -19, -4, 0, -20, 0, -8, -6, -16, -14, -14, -6, -19, -20, -9, -30, 1, 0, -6, -21, -24, -19, -18, -5, -21, -13, 5, -2, -17, -15, -13, -24, 11, -16, -4, -19, 4, -18, -9, 0, -23, -8, -22, -13, -4, 2, 0, 0, -10, -29, -2, -15, -30, -11, -8, 6, -3, -24, -27, -18, -24, -12, -16, 0, -7, -6, -10, -7, -12, -5, -6, -11, -9, -13, -7, -4, -19, -28, -10, -26, -25, -26, -10, -18, -1, -21, 7, -27, -2, -14, -20, -4, -10, -1, 3, -19, -3, -10, -19, -14, -18, -26, -11, -14, -15, -6, -6, 6, -17, -6, -28, -2, -15, 5, -11, -10, -29, 3, -7, 11, -19, 5, -15, 7, 0, -9, -13, -14, 0, -11, 11, -19, -17, -6, -8, 14, -2, 7, 0, 18, 9, 14, 24, 34, 52, 75, 112, 145, 136, 138, 96, 96, 94, 94, 77, 67, 71, 37, 31, 10, 11, 3, -5, 7, -7, 5, -2, -15, 1, 0, -5, -14, -10, 3, 5, -7, -18, -7, -24, -12, -23, -10, -17, -24, -14, -20, -12, -10, -16, -7, -8, -15, -38, -4, -20, -23, -11, -15, -8, -21, -11, -8, -31, 0, -21, -13, -24, -9, -11, -13, -11, -8, -11, -20, -16, -32, -12, -14, -13, -25, -9, -13, -7, -23, -25, -23, 4, -24, -21, -2, -13, 3, 2, -17, -14, -13, -22, -15, 4, -10, -17, -24, -14, -12, -27, 0, -24, -10, -15, -18, -25, -22, -37, -14, -22, -13, -30, -17, -27, -32, -13, -27, -28, -19, -30, -23, -34, -17, -36, -42, -49, -21]
3.83547b1l7K9NMK0kJ0mJOjmoK2k8%J6%lj1mMkLJ1k3QKMlJ6rj0J6qKk6J9kJ7j6JmPJ4k3J3j8K0
3.81054Ej0jlj3K4rkJ2jj6J1j5LqK0J1qoJ2rj0RJNkOjlkLrqQOoKoj2K1k4K2mMj2K4m0K6j9MjkQ
3.78409a5LkOoTJ3kK4m2K5j4OjPkqNKTj6J4Mj9J3J1j4K0pOj8K1l0K9Nk5K1rmj6JlmkJ3JpJ4j3O
3.75916a3LlpMRkmjPRopj1J6qK1j7Qk2L7l9K6j0J5j2lPj7J3qKLmj8L1j8L4k6Rk4L3ok1RLJ8mQr
3.73423EJ8j5L0j8qoLK3pj4nJJ1k0J0j1J6%l4K5mj4K0j1Rk5LjJ9j4LJ6opORnq%NTMK0k6K1k3J6
3.71032A6rJ9j6Qj9K0Qj4j%J0ToJ0j9J0K0kjmnTKJ6J1l4K5pKMJ3MPJJ0K0pJ7J8NK0M3J1L2K3K
3.68692B68M0%N4K3N2OM9J1M2qL4L3L8K7M1N1J8J02K6R9P6J06J15J41J60K09K53L49L96N99P42
3.67115D152J011J490K177L380M988O590O143K835l502m172k654j446o60q78k717l569l069
$$ y = [-21, -58, -29, -24, -20, 0, -2, 8, 4, 5, 11, 10, 6, 0, 22, -6, -6, 10, 10, 7, -4, -8, -4, -6, -3, 8, -15, -7, -5, -1, -4, 12, 3, -7, 9, 1, 3, -23, -4, -6, 11, -5, -4, -8, -1, 13, -10, 3, -15, 5, -5, -6, -9, -22, 2, -7, -9, 3, 2, -14, -3, -18, -15, -23, -3, 8, 0, -6, 6, -3, -13, -4, -3, 2, 0, 6, 5, 2, 0, 3, -6, -14, -6, 0, -6, -4, -10, -22, -1, -25, -3, -7, -3, -15, 9, -31, -5, -24, -20, -21, -23, -15, -12, -14, -8, -14, -20, -7, -9, 15, -27, -2, -16, -10, -11, -4, -6, -14, -9, -7, -5, -21, -7, -3, -22, -9, 2, -12, 8, 1, 7, -11, 10, -20, 9, 14, -11, 10, 1, -3, -19, -18, -21, -25, -27, -14, -13, -20, -6, -19, -13, -10, -13, -20, -16, -7, -9, -13, -14, -7, 2, -4, -11, -22, -6, -14, 7, -10, -2, -24, 13, -26, 0, -10, 5, -7, -10, -3, -20, -7, -15, -13, -10, -14, -32, -1, -19, 15, -11, -2, -26, 7, 1, -20, -11, -8, 10, 6, 14, 5, 23, 8, 38, 20, 12, 6, 9, 32, 25, 11, 6, 7, 18, -2, 8, -3, 13, 13, -21, 4, 0, -14, 6, -5, 4, -21, -18, -19, 0, -14, -11, 5, -1, -8, -2, 7, 2, -6, -6, -1, 4, 8, 28, 2, 23, 0, 16, 7, 26, 10, 18, -1, 19, 27, 13, 12, 12, 22, 32, 26, 36, 17, 27, 47, 45, 44, 40, 35, 30, 32, 48, 59, 25, 50, 43, 45, 49, 62, 66, 73, 74, 84, 104, 97, 114, 132, 137, 157, 200, 211, 243, 266, 268, 308, 308, 362, 385, 437, 443, 492, 503, 545, 537, 571, 604, 642, 669, 710, 761, 779, 881, 907, 1006, 1082, 1188, 1303, 1444, 1604, 1813, 2066, 2415, 2811, 3410, 4152, 5163, 6653, 8830, 12210, 17198, 23788, 29931, 32766, 29264, 25092, 22438, 20992, 20332, 19454, 16737, 13168, 10099]
3.66250A0099k446j784j272q64o16m80l63l14k56k48j69j75j10j13j02m2j04m5m8l6m2k4k0l8
3.65029C88k8Mj6k0j8%j9j3rj0k5npj6jk9J5k5K4j4OmOj9j4K2qTLj5lj5rK0j1j0jlj4j2K3oTOq
3.62740I6%j1mrOqKNLnj8J1j4J0K2j4j6J3pK1k4J2plJ5j8PMnk0K2j4PrJ7Kj2KQj6J8L%j3L6j4
3.60400H1J3K1L1J6J1k1k2j8J3k4K8k5Rl9j4J2k0QnJ1j8PnqJ3pjj5J7l4J5%K0k4MLnJ2j1Oj0p
3.58264A8J1oJ0j5K4j6LrMQNj2j5J9OqJ0lJ3j8J1KJ3J4p%J8Nj8pOk6Nk0J9j5lJ2k2K6k3J7j0j4
3.56025A2J4rJKLKlkrj5J5lj4K1%qNRonJ4k7J9Nk4J9Kk5QjJ5J2jj1Oj9K5j7J4k2L5l3NjJ9oTJ0
3.53583B5loNJ3j6J1qj5pJ6mrk%kPLlTJ7j1K2j0k3J2lJ6omj5J4j5MJ8k2POnpJ7oJ0lj6pL0j1J4
3.51142B5j8j6KJ8mPk2K1j8J5mJ0Nlqj1J2kj4J7OmJONJlJ6k6J2j2PolOK5k3LJpOk3K0k0J9qNj3
$$ y = [10099, 7653, 5869, 4597, 3733, 3117, 2637, 2274, 1960, 1704, 1456, 1287, 1112, 1002, 889, 787, 745, 641, 596, 548, 512, 470, 446, 426, 388, 360, 364, 348, 328, 310, 310, 291, 278, 269, 259, 234, 229, 222, 206, 205, 176, 191, 166, 190, 176, 182, 178, 184, 165, 151, 173, 165, 157, 160, 145, 142, 127, 118, 138, 127, 117, 116, 113, 99, 87, 110, 104, 98, 104, 96, 96, 85, 81, 72, 78, 70, 72, 77, 80, 75, 57, 68, 54, 64, 86, 72, 56, 69, 62, 83, 59, 71, 64, 61, 76, 58, 65, 69, 64, 44, 66, 52, 59, 50, 67, 69, 57, 59, 67, 51, 69, 72, 72, 59, 95, 81, 94, 115, 146, 162, 173, 152, 130, 112, 125, 101, 129, 104, 113, 74, 60, 72, 52, 60, 55, 66, 48, 55, 50, 42, 55, 48, 47, 32, 49, 15, 30, 30, 50, 26, 30, 33, 28, 40, 29, 35, 25, 18, 29, 23, 33, 18, 42, 26, 29, 20, 24, 32, 37, 25, 10, 29, 35, 27, 37, 34, 47, 29, 40, 42, 55, 69, 62, 62, 80, 85, 67, 60, 66, 40, 45, 25, 44, 29, 26, 38, 16, 42, 19, 36, 26, 12, 26, 17, 18, 20, 23, 25, 22, 20, 11, -4, 11, 8, -6, 15, 15, 7, 12, 21, 15, 10, 24, -3, 16, 21, -3, 16, 18, -7, 1, 0, 15, 27, 26, 15, 21, 2, 27, 10, 24, 2, 37, 4, 9, 8, 27, 21, 15, 25, 22, 16, 21, 34, 18, 29, 21, 6, -1, 15, 11, 2, 0, 0, -2, 5, 8, 5, 2, 19, 8, 30, 20, -3, 9, 6, 22, 16, 12, -3, 11, -4, 0, 18, -4, 3, 9, 4, -3, 14, 8, 18, 15, -1, -8, 22, 11, 25, 7, -9, -7, 11, 7, 14, -8, 13, -5, 10, 6, 16, 21, 18, 10, -1, 11, 9, -5, 12, 18, 14, 15, 21, 26, 27, 24, 40, 14, 26, 14, 21, 15, 12, 18, 43, 20, 23, 24, 17, 23, 0, 20, 0, 19, 11, 16, 3]
3.48700CJ6mo%j%j7PLjj2K2J3l3JJ4oJ3j2pJ1J3j0k2K2mJ3j0R%jOnMnMj1Qj8K7oj0JjPNj0pMTp
3.46105DK1k2K1rj5K6k1nJ1RrqJ8j0mJ2j0nJ3%mj3QROl2J3MPj3mOJ9rj1l%QJ1j0J3nJpK0j3K2
3.43714D0j6nRJ0QK4jM1K0K7Ll4j2pjk1Kj7k7J7j5oqj6RKk1OpJ5j9M%mp%PKJ7k3J1j8J9kJp%jl
3.41222dNTJ1j6lKj3K4j9L0k9J4j1lJ3j2J3j6NRqMKlkKJ4j6Qnj6LRLJqj3J2Mj2K2o%oKLJ4j6J%
3.38678bRkk3M4m4K6k6K4pnJ3LjqpLK1j5j1K3Mj4lOJ0k6L9j5J7j7J6QK2K0J6J3MK1NlJ5l6k7Qm
3.36389I4k5qKk5j2j5K0j5LrOlqMnJTLj2loJ2OrJ8k2JmJ0qNlQnJMknNj1J3%kJ4pOLj1J0kJ1j9n
3.33693@%K1k5K1j5lK9j7RMJ7olJ3J4NnKK7j8K3j2J6QJ1TJ4jNK0J9K0RJ7K0J8K2J1PM4L2L0L2
3.31505D46M3L5O7O6R2J03J48J74K56L40N16P65J095J421J484J012Q3o18q01o07m73m01m60n82
$$ y = [3, 19, 15, 9, 9, 8, 8, -9, -2, 1, 0, -12, 10, 23, -10, -9, 5, -1, 12, 0, -7, 4, 17, 7, -15, 7, 3, 16, 6, 15, 15, 14, 20, 15, 19, 14, 18, 7, 15, -3, 24, 18, 8, 9, 8, 15, 20, 10, 3, 7, 11, 4, 25, 3, 24, 15, 0, 26, 5, 0, 11, 20, 11, 3, 21, 11, 7, 19, 9, 4, 17, 17, 13, 0, 8, 17, 23, -9, 4, 8, 15, 2, -2, 4, 23, 14, 3, 0, 0, 8, 19, 9, 22, 17, 18, 11, 31, 18, 40, 24, 19, 28, 38, 46, 70, 69, 110, 130, 157, 160, 126, 114, 107, 106, 85, 87, 70, 43, 60, 45, 39, 31, 15, 24, 26, 5, 11, 4, 19, 0, 4, 4, 0, -7, -7, 0, 2, 19, -4, 7, -11, 8, 6, 7, 0, 0, -1, -4, 1, 6, 17, 1, -2, 0, -13, 11, -8, 22, -7, 7, -4, -7, 6, -6, 7, -9, -4, 5, -3, 1, 3, 0, -2, 0, 14, -2, 6, 1, -15, -12, -3, 0, 1, -7, -20, -8, -4, -16, 6, 0, 0, -6, -4, -1, 13, -3, -2, -2, 7, 5, -18, 26, -18, 8, -18, 6, -1, -6, 7, 10, 9, 1, -6, -3, 18, 3, -8, 15, 19, 5, 2, 8, 18, -8, 31, 16, 33, 16, 32, 40, 62, 82, 98, 111, 115, 136, 141, 138, 153, 117, 90, 98, 94, 69, 61, 63, 38, 26, 11, 31, 16, 19, 10, 16, 13, 5, 9, 4, 5, 6, 9, -3, -6, -12, 0, 6, -3, 15, -7, -6, -10, 0, -8, -3, -6, 2, -3, -2, 2, 0, -5, 0, -11, 2, 2, 0, 14, 7, 13, 16, 5, 15, 13, 24, 5, 0, 0, 21, -4, 17, 2, -1, 28, 11, 20, 24, 41, 35, 32, 45, 59, 64, 59, 61, 88, 70, 93, 81, 97, 105, 116, 127, 141, 140, 145, 165, 184, 204, 213, 230, 250, 268, 290, 301, 308, 352, 384, 414, 446, 489, 524, 591, 657, 749, 852, 1000, 1174, 1430, 1770, 2286, 3051, 4146, 5567, 7051, 8063, 8146, 7528, 6727, 6120, 5647, 5246, 4786, 4204]
3.30284D204p64p55o31m55l19k33j90j28j00p1p5n0n1l8o0k0k3nk0l9Rl6Lj7J3l0J4qj1j2J5l1
3.28657H6K8k8K3k3lJ0jj1jR%k4j1jkPJ2l1K9j4%j4Qj2OPJ0k8K1k9%OK0j1mMj7OjJOj7J3j4J4L
3.26317C2J0j8poK1j3pJ7j2J1j1J6mqNLj7K0jlrNmlP%j3qJ9j3jkLOJ9j4lj5K3pL0j8K9k4J4j7
3.23976C2K1j7nKj0J3j4lnMjnPnoj1J9kj9J0%NkoLpQK4k5%JJ8j5J9j4kJ2QJ5k9K1Npj4pK2nmk5
3.21484DNoK9j1j3J1Kk8K1kQk2J5oJ4%rNj1Qj5J0QOj4n%J0pJ1rnJ1J4k7MJ4JMnl%QqnJJ9Tk4J6
3.18940D3lOj5J6MNj0Nj3J1jJ3j5K8j5J3J1Pj1K2J0NL2J3K1PL7J6J9L7J3L8J6O4K1K6TM2J9L1
3.16905E94N0RN9N4M8P3N1R6P5J26J00J25J32J64J99K12K60L30M21O29Q84J371K146L174M307
3.15634A5689M588L514J538J412J322k55k367k591k648k428k049k046k482k433j975j501j070
$$ y = [4204, 3440, 2685, 2054, 1599, 1280, 1047, 857, 729, 629, 558, 483, 433, 382, 344, 284, 264, 241, 236, 216, 177, 186, 150, 153, 136, 149, 119, 133, 125, 114, 102, 117, 86, 114, 86, 109, 86, 83, 93, 92, 81, 80, 89, 89, 65, 54, 53, 51, 58, 70, 39, 68, 54, 54, 40, 48, 36, 42, 49, 59, 31, 52, 23, 23, 29, 49, 38, 34, 38, 21, 27, 26, 27, 33, 16, 29, 15, 29, 32, 42, 24, 17, 11, 32, 19, 12, 29, 17, 28, 17, 33, 29, 21, 26, 29, 12, 32, 31, 28, 19, 24, 20, 17, 24, 24, 11, 3, 22, 9, 8, 6, 9, 15, 34, 20, 17, 2, 25, 18, 48, 30, 59, 35, 49, 32, 53, 36, 31, 33, 23, 36, 22, 19, 14, 18, 17, 12, 19, 14, 8, -3, 16, 14, -5, 5, 5, 10, 8, 2, 5, -2, 6, 30, 5, 5, 6, 24, 9, 28, 14, 12, 24, 32, 47, 18, 39, 44, 37, 23, 16, 38, 33, 29, 4, 9, 3, 32, 21, 8, 19, 21, -7, 14, 12, 20, -2, 13, 7, 21, 21, 12, 17, 6, 14, -1, 9, 17, 23, 9, 4, 4, 14, 7, 18, 9, 4, 15, 29, 2, 6, 20, 21, 25, 20, 17, 17, 25, 17, 12, 13, 32, 51, 27, 43, 40, 46, 31, 47, 51, 56, 46, 51, 38, 49, 48, 61, 46, 74, 59, 72, 83, 90, 79, 101, 111, 116, 148, 161, 182, 189, 226, 242, 261, 298, 311, 349, 365, 429, 450, 476, 502, 544, 563, 594, 644, 653, 712, 766, 814, 887, 938, 1034, 1109, 1235, 1335, 1460, 1592, 1756, 1955, 2167, 2427, 2757, 3178, 3807, 4691, 6062, 8208, 11382, 15689, 20277, 23791, 25329, 26741, 28063, 27808, 25441, 22850, 20202, 17774, 15725, 13679, 11197, 8764, 6789, 5288, 4218]
3.14769D218p78n57m22k91k63j98j93j82j18j49r2j13q3q0n4m1o2m2l2k3j1l5k5k0j7pl0mk8j
3.13243B67j7J0j4l1Nj8J8j4mqK0oK5qK9jj9Oj6Rj6Jk8j1NKk0j5J0J2k3oQmnk5KqoMJj1rQlj9l
3.10852G4J4Oj9kj0K7j0Nj7Ok6K1j2NK3j0lmoJ7ljrQj3J3kJ7l4K1PQPJ5J4J0K9j1K5j8jj7jl1
3.08613A12K3j1mj1j4k3RLj4nqJ2j3J1JJ4j8RjmQTj8lRNrLk0K5krj7J2j2jJ5l2K1j3Mj7L1k2K2
3.06324E6mj8PTK9k7J2RJj8J9j3K5qorkj3JPk0j0Nj8J1jNj7K2JjrRTk1nK3r%qJ3j4Q%Mj4J7j2L
3.03831B6j1j7K4Pj7QMj4NK2rjj7K3Nl8K5kNj7J5%kj3JOJMJOjnjlJMlqJ5j5J9k5L4m3J6Nnj0Rq
3.01288FjK5k3L2l3L5m9M5l0J1rJ5j3J4j0j1nK4j3J9j6Oj3J4j1Qnj1OTLnK1k2Rmj0J2Qlj4MnKr
2.98999@%pK7rJJ0JlK1poK7l6J8krJ2J6k8QOj5Qmj6ONJ9rj8%R%Lj3ORj7rK1m0M3rnJ5k0K1k5K2
$$ y = [4218, 3440, 2883, 2461, 2170, 1907, 1709, 1516, 1334, 1216, 1067, 975, 862, 779, 699, 645, 604, 542, 500, 468, 445, 434, 399, 374, 354, 337, 330, 300, 296, 268, 267, 250, 260, 246, 215, 220, 202, 220, 206, 202, 194, 214, 208, 233, 225, 254, 253, 234, 240, 224, 233, 217, 218, 190, 179, 184, 186, 166, 151, 161, 173, 150, 144, 152, 148, 143, 118, 120, 112, 106, 110, 111, 100, 91, 99, 96, 77, 74, 88, 94, 75, 73, 63, 90, 80, 85, 68, 74, 48, 69, 57, 62, 85, 75, 72, 68, 62, 79, 76, 75, 66, 74, 61, 74, 72, 89, 55, 76, 83, 91, 98, 113, 127, 137, 166, 155, 180, 162, 161, 144, 143, 112, 135, 124, 120, 109, 95, 72, 81, 84, 70, 65, 57, 69, 56, 67, 68, 82, 64, 73, 72, 68, 76, 84, 66, 63, 72, 77, 68, 71, 51, 76, 74, 65, 48, 60, 48, 47, 62, 30, 51, 38, 42, 25, 56, 34, 56, 52, 34, 41, 48, 77, 50, 62, 71, 72, 54, 73, 60, 85, 77, 71, 62, 60, 47, 48, 55, 35, 25, 30, 12, 23, 22, 27, 10, 32, 33, 32, 23, 32, 41, 20, 15, 38, 29, 29, 21, 34, 20, 28, 28, 32, 18, 35, 23, 26, 15, -2, 22, 29, 12, 20, 24, 10, 15, 37, 28, 27, 10, 33, 38, 0, 25, 23, 28, 11, 26, 26, 24, 11, 12, 18, 19, 23, 24, 30, 29, 24, 23, 20, 21, 25, 22, 14, 29, 14, 33, 8, 42, -1, 15, 20, 15, 5, 14, 6, 5, 30, 7, 39, 6, 41, -8, 37, 7, 18, 9, 24, 11, 25, 15, 4, -1, 23, 10, 29, 13, 19, 6, 20, 9, 17, 12, 1, 7, 13, 16, 11, 32, 10, 19, 15, 5, 17, 25, 22, 8, 12, 7, 9, 0, 0, -7, 20, 11, 12, 22, 23, 20, 41, 34, 28, 55, 19, 37, 35, 26, 38, 54, 26, 34, 40, 25, 33, 29, 13, 19, 24, 43, 34, 16, 16, 25, 25, 28, 15, 21, 30, 13, 4, 25, -15, 28, 19, 14, 29, 9, 30, 5, 27]
2.96506B7Jk1J1kJoNpJ5kj7nK3rK2k3Pn%Pk2J9NJ0j2TMK3j5J8l6R%OLKJ6j6J%nLR%KJ4%L4J5R
2.93962A06J4K8oOJ9ql3J6l8kmj5k7rMj4J4k6oJ6rKk1K5k2K6prTLqJ8nlkmj0K2k0NJJ0j5J7mR
2.91622B5j8LqQNj3mK4k1K0pj4J6Nj4LJ1pTj3J3%MKqJ6j6LJ3j0kmPlJ8k5jTJ0LmlKmMNQj6MRMO
2.88977B8k8NJ1lJ2j7J7k4mnOJ6Nmk2LK1j6qLRL6j8pTJ6k1K7j1nQmTjoj5mJ5jnJ8j8%QKmJ1oj6
2.86484gJ7j3j7K0J8k1K1j1%J7j4j6J0j3J2Rj1J5j5J5j2J2lj9J2j9J6nJ0Lk5MNJ4j7K4j9K3l1
2.84500a1K1j0KLJ7j8jTJ2J4j1j5OkJ0pRj3J1j4J5j1j3oL7k3NjlMlTQpJ1j3P%K0l3NKJ5k3K5l0
2.82160a3J5%JJ6k3J4rkJ1Jq%LOj2j3K2qJKj4J7KolJ8pkqpJ2KTk%lkPk3jJ1jkKNjJ3j9JL6l3J2
2.79515A0j1Pj6J9j4J6l%j6K3k2KPmLrRTj1pRjNnJ5j5J4j7jJ0Kj0K0Mj5j4pJ7oLMj3K2j3rJ3Jl
$$ y = [27, 28, 7, 18, 16, 17, 11, 16, 9, 24, 22, 5, 0, 23, 14, 36, 13, 20, 15, 15, 22, 0, 19, 24, 34, 22, 10, 14, 37, 22, 40, 4, 13, 13, 19, 22, 24, 40, 24, 25, 25, 20, 23, 32, 32, 34, 48, 48, 82, 97, 106, 120, 148, 142, 148, 167, 159, 126, 142, 104, 102, 98, 83, 56, 47, 51, 37, 51, 25, 19, 35, 26, 28, 7, 32, 10, 36, 29, 20, 11, 14, 6, 24, 19, 16, 14, 10, 0, 22, 2, 7, 8, 18, 3, 20, 16, 25, 7, 10, 2, 10, 15, 2, -2, 22, 1, 21, 14, 0, 16, 21, 7, 10, 21, 14, 7, -6, 7, 7, 11, 13, 5, 21, 5, 8, 21, 11, 9, 5, 12, 9, 27, 2, 1, 0, 10, 13, 9, 6, 8, 4, 8, 13, 21, 5, 9, 18, 22, 28, 0, 5, 16, 13, 25, 8, 25, 1, -3, -8, -2, 14, 19, 15, -7, -4, 17, 1, -7, -4, 5, 41, 23, 16, 9, 25, 4, 31, 20, 15, 23, 19, 15, 14, 8, -7, -11, 4, 3, -2, 16, -2, -2, 6, 8, 4, 15, 9, -7, 10, -3, -20, 0, 18, -3, 18, 7, 7, 24, 10, -6, 4, -9, 3, 12, 1, 16, 1, 16, 4, 16, 13, -6, 6, -13, 3, -2, 8, 11, -14, -10, -5, 9, -8, 16, -3, 20, -11, 10, 0, 2, 5, 22, 4, 3, 2, 14, 28, 17, 2, 8, 6, 16, 9, 18, 5, 16, 2, 17, 6, -7, -13, 24, 1, 6, 5, 2, 6, 3, 0, 8, 1, 12, -1, 6, 6, 26, -7, -2, 0, 15, -8, 17, -13, 2, 2, 3, 19, -4, 10, 1, -1, 10, 11, 3, 3, 6, 12, 0, -13, 9, 1, 2, 4, -10, 7, 9, 3, 0, 18, 11, 9, 1, -6, 6, 8, 10, 8, 8, 5, 3, 10, -13, -14, -3, -4, -6, -4, 1, 0, 13, -6, -5, 31, -2, 10, -1, 6, -10, 9, -5, 11, 8, 8, -8, 15, -7, -5, 2, -2, 1, -8, 1, 10, -1, -8, 1, 0, 5, 0, 15, 0, 14, -3, -4, 6, 8, -2, 18, 22, 7, -7, -14, 3, -3, 0, 4, -9, 13, 0, -9, 4, 5, 2]
2.77073Bk%nj1J5j1RrJ7JQj7L%RKrLrJ6k5K0pOKjqJKQj1J4l0K6nJ9k3qkJ0Rj1oLkJ8rJkjm%J6
2.74377A2j1J4k4J7K%j0J1k3J0k0L4k2K0j8K4j1kpjJ3lJ4j8K0j0loJ4Kj4lPjj4L8j5J7k7J9KnN
2.72190B7loOnMJ2pMK2k7lJ1j4RlrJ1NKk6J0JPj2J2j7Nj2K0oOj2OqJjJ3k6MJ8j9JKOqRk0OjJ2q
2.69595aj5K5j6PpJ6pJ7k8K4k3K1j6MQj5J2j4J2k%npJ4kOk2RJ3j9J1nK%NmJPj1OmTJ3loj9L3l1
2.67153b0J5rJ4kJ7kj3J1k0J5pJ0j9QKrK2j0j4PJK8k4J0j9oJ0NnkK1qJ7k3lJ9Nj5moPmOTroJ1r
2.64712aJ2KkKj4J7j6K1k5K0pPnOLj6Oj6K6j4J0j5j0J6k1QJ5k2K0nOj3K1rQmj6LJ4j4J0KJk1N
2.62422eJ3MKj0lmJ0j3Pj1NMNnj6L0j3TJ6rkQqQpRTjj0J2mj0nJLK5k3klj0J4N%RJk5MJ5j4J5LT
2.59777A4kk6%J5NlJ7k6LQJ0j7JlQRj3LKj2J6j2J0k3J6pPMj3J0j1K5k2NmNk4K6j3K8l0J5j4K1
$$ y = [2, 0, 0, -5, -16, -1, -12, -3, -12, 5, 6, 14, -3, 0, 0, 9, 11, 2, 5, -4, 12, -13, 7, 0, 6, 8, 7, -1, 0, 2, 10, -1, 13, -17, 9, 4, 23, 0, -8, -10, 0, 9, -2, -8, -5, -7, 11, 2, 3, 1, 0, -4, -4, 12, 1, 15, -9, 8, 10, 10, 0, 11, -12, -2, -22, 12, -10, 10, -8, 16, 5, 3, -4, -5, 8, 5, 19, 1, 21, 11, 8, 2, 16, 18, 4, 1, 8, 7, -7, 31, 16, 33, 6, 25, 27, 22, 27, 24, 18, 24, 19, 23, 35, 28, 32, 54, 27, 24, 35, 21, 30, 27, 18, 29, 34, 36, 10, 20, 21, 28, 16, 28, 11, 16, 4, 24, 18, 24, 12, 18, 10, 11, 10, 23, -3, 1, 19, 0, 1, 3, 9, 1, 10, -10, -4, -5, 7, -1, -16, 9, -7, 0, -7, 9, 2, 19, -9, 15, -8, 13, -3, 1, 9, -6, 6, -8, 4, 2, 2, -3, -10, 4, 2, 8, -14, -5, 8, -11, 0, -5, -3, -3, 2, -2, -1, 6, -5, 1, -3, -7, 6, 3, -3, -22, 11, -20, -5, -14, 0, -2, 15, 13, 0, 11, -9, 6, -1, 9, -10, -2, 0, -9, 13, 3, -11, -4, -3, 25, 1, 11, -8, -14, -4, 1, -4, -6, 15, 7, 24, 1, -2, 17, 22, 7, 3, -3, 4, 0, 6, 12, 3, -3, 8, -1, 11, 13, 11, 13, -1, 16, 0, 21, -4, 16, 9, 16, 11, 17, 20, 4, 10, -6, 20, 6, 16, 1, -9, 7, -14, -6, 9, -13, 7, 2, 8, -5, 16, 7, 15, 11, -5, -2, 12, -2, 8, 10, 11, -10, -5, 8, 12, 14, 4, 1, -3, 7, -6, 1, -10, -5, -1, 4, -1, -17, 13, 0, -13, 3, -6, -8, 0, -8, 0, -7, 2, 11, 10, 0, 12, 8, -2, -7, -6, -3, 22, -1, -3, -6, -16, -2, 3, 3, 12, 13, -12, -8, 7, -7, 8, 11, 14, 12, -14, -14, 1, 6, 3, 20, -6, -3, 5, 15, -2, -1, -4, 4, 13, 0, 3, 5, -7, 9, -3, 7, -16, 0, -7, 0, 4, -9, 1, -10, 15, -7, -2, -6, -1, -25, 1, -12, 16, -14, 1, -13, 8]
2.57539Hj9J4j5KnJ4PpjnJ6k0J1%NRk1J6qLj8J9qJ3j5NJ6k1J5omMj6J4Kj1J0pKN%Rj6KJ1j7J0J
2.55097Ckj9K0j3J4kJ4k1j0J1kPMj1J6rpMNj5J4j3J2oQkpoJ6KnPJk5J5JMlJ1l0L2j3K%NoRj0l
2.52604cK2k1QRKj0OJ5NpQJ4olk4K6MLK9nJ7nJ0lL8l0L3j0K5K0j8K4K9JK5K9M8N8R3J10J99K05
2.50468I70J75O7j8n3jTP1L7R7J43K84L62L70J37j15j60j44k5N2L4N8N9K57L99M78K33j34l57
2.49043C275k86j56k3k7q8j56q4R9J65J44j04l14k57j91r7m1q1j77j47o3Pl0l3j35j64j19o3p3
2.47619G81o5j01j12r4j06p5m5j8m2Lj0nl2Pl3Qj4J2j1Kj0Kj1nK5k8K1plRJ4nj8j1MJ3j2mjj2
2.45584A1L0j4J7j7Nj%nkoJRoNqRj1j0J1QLl2K1pkJ8jPqj2K1j9OJ0j8J2mQj8K4jnj9L1j5J6k3
2.43193A9J9lj4J5j2kJ1k4K9j9KPQj1lTj%TMj%m%J4k9J1K2k6K0MpPj5J3k3OKrK1nrK3J4Mlk6J1
$$ y = [8, -11, 3, -12, -10, -15, -1, 6, -1, -2, -7, 9, -11, 0, 0, 5, 14, -7, 9, 1, 4, -14, 5, -3, 10, -5, 0, 16, -5, 10, 4, 0, 4, -12, 2, 4, -7, 3, -4, -2, 3, 3, 12, -4, -2, 9, -8, 2, 3, 1, -18, 2, -11, 3, 1, 15, -6, -16, -5, -7, 0, 4, -7, 9, 0, -7, -3, 2, -13, 1, -12, 0, -6, 2, 0, -7, -13, 3, 5, 0, 7, 8, -17, -2, -1, 3, 0, 11, -19, 13, 0, 2, 2, 7, 1, 10, 0, -3, 19, -2, 6, 15, 17, 7, 13, 28, 33, 26, 34, 48, 42, 39, 15, 41, 45, 48, 77, 72, 89, 84, 94, 91, 129, 99, 132, 122, 147, 167, 149, 173, 202, 203, 228, 257, 305, 363, 456, 566, 765, 970, 1145, 1212, 1194, 1141, 1140, 1139, 1210, 1247, 1344, 1487, 1771, 2133, 2503, 2640, 2525, 2365, 2221, 2196, 2248, 2282, 2340, 2399, 2656, 3055, 3533, 3766, 3632, 3275, 2989, 2833, 2810, 2783, 2695, 2539, 2455, 2554, 2719, 2863, 2759, 2445, 2188, 1997, 1900, 1859, 1778, 1601, 1454, 1391, 1398, 1368, 1335, 1200, 1036, 917, 854, 781, 716, 615, 503, 409, 303, 228, 183, 165, 123, 126, 116, 111, 79, 86, 53, 61, 47, 59, 48, 50, 40, 42, 31, 26, 51, 23, 44, 37, 34, 43, 57, 52, 34, 23, 27, 40, 28, 24, 23, 11, 41, 27, 44, 27, 32, 31, 31, 26, 24, 18, 19, 28, 22, 27, 19, 28, 17, 7, 18, 26, 29, -3, 18, 11, 9, 27, 26, 33, 25, 13, 34, 15, 21, 31, 13, 25, 21, 29, 11, 35, 34, 29, 10, 41, 26, 42, 19, 38, 35, 21, 36, 24, 22, 33, 9, 38, 19, 21, 28, 36, 25, 22, 19, 18, 18, 18, 22, 21, 21, 17, 17, 31, 2, 13, 35, 9, 29, 33, 26, 33, 18, 31, 8, 14, 16, 7, 28, 23, 14, 37, 51, 55, 52, 26, 37]
2.40751C7qLOk1K0jj4J3j9J2lLoNrJ7l6L8k2NRjj0jTJ8pJ0k5KJ0lnLpmMJ4pK1j3J0J1J8k5j3J3
2.38360D1jj4PqrJ1JnMnk0QTjqom%kJ3J4lk3K0ojPj2QOk8K0KmjNj4J8k2J4qK1nJ1j2%k5J0J1Rj
2.35766B1J1k4RoqlOTlnj2K3k2J5Lj0Pk2L3j5jj5J8PrJ1l0J9NoK1j1oJNj7K5j8J6j1qTJ6kRj6
2.33426aJ6lonlJ7kj0K0j5Rj1MmJJ6mk7L2k2J6Mk1J4oJ3k1K4k6J8j7MRoJ2j1j0J0nrQPonJ1rm
2.31035dK0oJ1j3jpKrj3K3j1Q%OkNrNkKpJ1%Qj0Qk4K0j6J4nrJ1jj1JJ6m%Npj2PJ2k1J9j9J6Lj0
2.28491@J2j1J8j3j7K5j0pJ6lkOj9K2k7J0K5j5J4k0lK5qNj8K0k7L1l7L4j7qJ6J9j8OmJ5j4Rrm
2.26355A7J1pJ4Oj2LkqJ9j9JJ2jk7J7LpOPLl7L0j6J5k1jMj1J3j1K0nTQj7kMPj9RoK0kKj4oQLqK
2.23811@Qnl%TJ3lj8J7%prJ4j7OJ0MrjJ0njNj4rJ4%mJJ5j4J6oNj4QjTpJ1lk5K3mJj1POrPjpJ7
$$ y = [37, 29, 32, 38, 17, 37, 36, 22, 35, 16, 28, 25, 28, 22, 27, 18, 35, -1, 37, 15, 20, 29, 28, 18, 17, 16, 34, 27, 37, 12, 14, 24, 21, 16, 19, 12, 8, 12, 26, 19, 40, 27, 37, 48, 66, 41, 28, 41, 40, 26, 33, 25, 16, 27, 28, 23, 27, 22, 2, 10, 18, 17, 9, 3, -1, -1, -3, 10, 24, 21, -2, 18, 12, 11, 18, 6, 14, 20, -8, 12, 14, 10, 9, 14, 0, 18, -4, 10, 2, 23, 18, 29, 17, 17, -8, 2, 13, 22, 21, 32, 8, 17, 11, 3, 0, 6, 12, 9, 4, -8, 15, -7, 8, 11, 1, 8, -14, 19, 4, 3, -12, 6, 13, 4, 15, -15, 4, 9, 3, 24, 13, 7, 8, 13, -4, 21, 3, 19, 8, 0, -8, 8, 6, 15, -1, 15, 12, 6, 1, -2, 15, 13, 3, 23, 8, 17, 6, 10, 6, 7, 23, 19, -8, 24, 2, 18, 22, 1, 15, 9, 22, 1, 25, -1, 17, 0, 4, 13, 7, 19, 8, -2, 8, 3, -6, 2, 9, 3, -2, 9, 0, -4, 16, 10, 21, 8, 7, 0, 2, -7, -20, 3, -8, 0, 0, 6, 4, 9, 0, 5, 3, 5, -2, 9, 9, 17, 7, 15, -9, 11, -5, 9, 4, -5, 6, 5, -6, -5, 11, 7, 7, 12, 5, -7, 0, 12, -9, 10, -9, 7, 10, 0, 12, 1, 19, 6, -11, 14, 4, -3, 13, 10, 8, 14, -5, 17, -10, 0, 25, 10, 24, 4, 1, 26, 18, 23, 5, 25, -2, 29, -8, 26, 9, 1, 17, 36, 18, 24, 20, 35, 21, 30, 21, 17, 28, 21, 35, 41, 29, 32, 30, 22, 41, 22, 23, 35, 34, 7, 24, 27, 20, 26, 33, 36, -1, 29, 13, 28, 7, 6, 10, -1, 12, 1, 21, 16, 11, 19, 2, 0, 4, 11, -8, 1, -5, 15, 13, 15, 1, -5, 3, 6, -2, 0, 8, 3, 0, 0, 0, 13, 10, -8, 9, 9, 2, -7, 7, -10, -4, 6, 10, 1, 0, 10, 5, 4, 9, -5, -14, 0, 0, -4, -3, 12, -2, 14, 8, 13, -1, 7, 6, 5, -2, 9, 6, -19, 4, 0, 1, -10, -3, 3, -6, 1, 0, -7, 10]
2.21115A0j0QPnj4mRkK1j8J3j3Rnk3L3l8K2nNJ4rNRj2Nj3j4J6mjJ0pnJ3Mk0%RJ2orJ8pLrRj2J2
2.18622A1qj4J2nNj1J6pNj1TJ5PLOmj7J3jj5j1J9J2jnrLMrQJ2j0LnJ5j8Pj2L3k2Mj9K3j4qOJ6J
2.16181A2Kl3LJ4JlkJ4Lj0KNj2J1mqNpOlJ6j5oRNKp%j1J1rM%nJ6RpoJ6j3Pk1J6nJ5k6RoJ1nqQK
2.13484Bj6J1TJoj1JTNLkk0K7k3J6K0j5njJJ0k0kK2j0J4j4kJ8pk1J5mJNj3J4rJ3oQmqMpLjoKJ0
2.10941ErjMTj0K9k2NnJ8j8PkJ0k5ONOMmoqK5j8jqJ0jk1J6K%J2j9qJ2QnNolK2k4j0K4J1j6qJ4
2.08448FJ6m9K7j6K3k2K6k6K9nrmjoK3nTMrJ5pmKJ3j8LlJ7j1nKNr%J3k5K4j8J4mjj8L1j7KkNQj
2.05955Hk8K7pQj8J6pLnmMJ0qj1QJ4j2j1J5J1l4K7%k8K6J8k5J6j0Pj0Rj4lP%J2k7J8JlQj1KLkr
2.03564iJ2j1PoJ3k3K0kPk0J5j0J8j0J0j2lK3k5OnrK2j9QjJ0j6oJ2J7j5pK5l5K9k5J8lnoJ0ql
$$ y = [10, 0, 8, 15, 10, -4, -8, 1, -1, 20, 2, 15, 2, 11, 6, -17, 16, -22, 0, -5, 0, 14, 5, 10, 19, 7, 12, -1, -15, 1, -3, -4, 6, -1, -6, 7, 11, -9, -9, 0, 12, 6, -3, 15, 8, 11, 2, 11, -1, 11, 3, -11, 1, -4, 1, -10, 6, -1, 4, -7, -18, -3, 4, 7, 13, 9, -8, 5, 4, -11, -22, -3, 9, 8, 3, -6, -3, 1, -8, 0, 12, 2, 5, 0, 15, -3, 4, -8, 25, 3, 7, -12, 11, -3, -11, -5, 11, 12, 14, -19, -16, -2, -1, -4, -6, 8, 11, 1, 3, 8, -4, 7, 3, -5, 0, -7, -1, -4, 12, -3, -9, 0, 5, 7, 0, 0, -11, 0, -9, -5, -5, -10, 6, 15, 8, 2, 18, 5, 12, -9, 7, 2, 17, -9, 0, -6, 5, 0, -8, 0, 2, -14, -3, 8, 9, 3, -8, -7, -6, -1, 2, 0, -20, 7, -16, 0, 20, 5, 0, -1, 0, 10, -10, -12, 10, 0, 14, 0, -2, 16, 9, -12, 3, -1, 0, 5, -8, 6, -3, 10, 4, 12, 8, 0, 4, -3, 0, -1, -7, -5, 5, -4, -5, -1, 3, -7, 22, 0, 5, 0, 18, 0, 7, 5, 15, -10, -4, 1, 7, 11, 7, 1, -7, 18, 0, -1, -9, 1, 0, -21, -5, -3, -3, 9, -10, -18, -6, 2, -3, 2, -4, -7, 15, -9, -19, 5, 16, 0, -8, 6, 22, -27, 0, -16, 7, -15, 11, -15, 14, 9, 0, -4, -5, -11, 12, 7, 2, 6, -3, 12, 5, 1, 3, 16, -2, 1, -2, 15, 4, -1, 1, 6, -3, -3, 10, -15, 9, -9, 5, 1, 0, -18, 13, -4, -2, -4, 1, 9, 8, -20, 7, 0, 8, -10, 6, -1, 2, -3, -7, -3, 7, -1, -12, -4, 10, -2, -13, 2, 13, -21, 6, 6, -22, 4, 22, -3, 13, 3, 10, 0, 9, -5, -8, -1, -1, 11, -16, 2, 3, 0, 8, -3, -1, 2, 0, -9, 3, -8, -1, -7, 6, -17, 3, 1, 8, -12, 3, -7, 11, 1, 11, -1, -4, 19, -6, 0, -5, -14, 8, -11, -3, -4, 6, -10, -16, -4, 13, -2, -9, 16, -19, 10, -15, 3, 0, -5, -11, -1, -9, -12]
2.01326a2J0RJTj6K4j9jNMqJ4n%j1MTNqmJ5j0j5J2pJ1O%j4jJ2NmpOJj0J5j2L0k9J7j1nJ3j6QnR
1.98833A1nK3l1J9rK1k1LJ6k6NTJ5lJ7k0J5J4J8L5J08K40L00J77q0k38j56m2K0L7k7j18j07r6
1.97104A20m3k5k1Kk8J2%OoTJ9l5J3LnJj3PlKJ5k5J7j9NJ3%J7k7J7j2TJ9k%J1j7Mj1K8k4NJ0k8
1.94866a6K4k0RLKj0J4j6J7pJj0J1kj4OMj8J8oP%NlNOj0Mj5PoK3j4kJ8j5%jNJ4j5nK3j1j0JNMO
1.92373A6j6Qj8PjLnTJJ0KqJ2Nk3J1J3j2jmJLPlLj9J2j5K8Mj3J1jk5QrJJ1lTLnJ0q%J0Jkj3J8k7
1.89778b0L4k5Lj2K6j4lJ6Rj9Oj3KJ4pJ4lNk4J9j1j0J4njoK1nJ1l7J8K1k5Pj1J9KLnrOj1NnLPmk
1.87337bmjMJ1%lrMoMKTrJ5j3J7j2J3mKrpOj1J6j4J2rJ5rKpOrPNTLj3J1j5J1j7K8j9j2LmRk0K8
1.84742Cj2Ro%Rj3J1j7J6J0oj2QmRk1K0j3J4nj1J3LMoMrM%J4j7oLnQk8K5j4J7mR%j3nPlK5j5J3p
$$ y = [-12, -2, 7, 8, 9, -7, 17, -2, -3, 2, 6, -2, 12, 7, 7, -4, 0, 4, 9, 1, -3, 12, 2, -13, -1, -8, 3, 9, 9, -5, -6, 6, 11, 7, 0, 6, 7, -3, 12, 0, 30, 1, 18, 7, 2, 15, -1, 7, 2, 11, 6, 29, -2, 17, 8, 29, 8, 11, 27, 1, 6, 11, 26, 23, 40, 20, 35, 49, 67, 102, 210, 450, 750, 927, 847, 609, 453, 411, 431, 468, 441, 323, 216, 120, 77, 52, 31, 33, 5, 17, 17, 23, 17, 11, 30, -5, 8, 11, 6, 7, -6, 1, -2, 0, 15, -10, 7, -12, -7, 6, 6, 23, -4, 13, 1, -11, 8, 6, 6, 17, 0, 4, -7, 21, -3, 2, 12, -16, 8, -12, -3, 0, 2, -8, 6, -10, 7, 0, 1, -9, 2, 0, -14, -8, -4, -22, -4, -10, -3, -3, 2, -1, 4, 10, 0, 4, -11, -4, -10, 13, -1, -3, 15, 0, 0, -1, 4, 18, 3, -2, 21, 10, 0, 1, 6, 10, 16, 0, 8, -10, -3, -4, -1, -6, -11, -10, 0, 2, -6, 6, 11, -12, -1, 12, 0, -1, -5, -4, -1, 6, 3, 6, -13, -1, -16, 12, 16, 3, 14, 13, -12, -4, -13, -12, -1, -4, -7, -4, -9, 1, -7, -7, 3, 4, 2, -11, 7, -20, 14, -11, -8, -20, 6, -8, -11, 5, 14, -5, 1, -12, -10, 4, -3, 11, 8, 13, -11, 8, -3, -13, 1, -4, -5, -11, 10, 5, 16, -21, -3, 18, -7, 0, -11, 8, 10, 13, 8, -1, 5, -6, -1, -6, -3, 4, 0, -2, -6, -7, -3, 8, 8, 5, -4, 0, -6, -2, 0, 2, -7, 8, -5, 12, 0, 13, 9, 11, 2, -5, 1, -10, 6, -8, 4, -5, 10, 1, 3, -4, 2, -7, 0, 5, 10, 13, 0, 11, -4, 7, -10, 18, -1, -13, -10, -14, -5, -25, 3, -9, 0, -6, -6, 3, -10, 1, -16, 0, 10, 4, -8, 0, -4, 5, -16, 4, -9, 5, 0, -11, 2, 5, 9, 3, 7, -2, 2, 2, 16, -1, -7, -4, -9, -1, -29, -4, -18, -1, -5, 4, 4, -9, -14, -7, -10, 15, 0, 13, 6]
1.82199Fj5J7j4oJ6njkJ7k9K4j9L1j5pk9K7j8L2k2J0nJJ6rj9L0j4PnkKRp%jmKoJ2k6K7j5MJ9l0
1.79859a6J3%KjKmJopJ6qRJmrJ4jk2L4m2J7O%J0j8QK2j7NrJNkpRJoQk0K6mj9J1k9M1j7Pj6J6j7
1.77315a6K0j1NKTj3lJ8j7L6k0jj4J4j2J8pnj2J3Qk1PK8k6LPK5k8Mk3J1LpJ3J1k7J7j5J4jJ7l4
1.75128a7J7rOj%j2J0Pj4OLpOKQj5Oj9K7j3J0Nj4J6rNpNklpJ9mnj2LJ3j5KjONj1KQj0mK7j4J2k5
1.72533a4J9j5J3k2J3j0J6pmjJ1mJ3j1k0L1j7J6qj3KJ6pJ2oLj1KJ3k6K4j2PKmkTJ1pJ5j9%KMj4
1.70244a1K1pmlNRl2L4k5K5k9K9k7QpQNj0J7k4J4pOpNj3J9jKj4PnQmJ8j8K0k4J5j3J2J1jj1njJ8
1.67853A3k0K0j4pJ5qJ0k1MJ9k1J2mnqK0j4K2j3KNk1RjOjMk2J4nJ1k0K0oj0J5Rjk8K0mJ3k0%PmJ
1.65462gLM%J1j1j8PlQj2J3Lj2JJ9q%jOlJ5k6ROj5j8J6J3pKK7l1J5j0j2QKJPj0NTj7OJ1nNqOQj5
$$ y = [6, -9, 8, -6, -12, 4, -1, -2, -4, 13, -16, 8, -11, 20, 5, -2, -31, -4, -22, 10, -12, -2, -7, -6, 10, 1, -18, 12, -2, 5, 0, -2, 0, 9, 2, 2, 1, -3, -1, -7, 5, -21, 6, -9, -5, 14, -16, -3, -3, -1, -2, 0, -4, -3, -9, -16, 0, -8, 1, 2, -2, -11, 3, 2, -20, 14, -28, -11, -5, -5, 5, -13, -5, 17, 0, 5, -4, -3, 2, 0, -7, 2, 3, -3, 5, -15, 11, 7, -12, -1, -30, 11, -6, 1, -15, 1, -16, 4, -7, -2, 0, 2, -11, -14, 4, -13, 23, 3, 2, -12, 2, -10, 8, 1, -4, -16, -3, 5, -16, -9, 19, -7, -4, 3, 28, 0, 4, -19, -8, -5, -12, 1, 12, -15, 2, -13, 1, 0, 17, -17, 0, -9, -3, -4, -4, -16, -6, 1, -13, -7, -4, -11, -5, -3, 5, -10, -4, -23, 4, -9, 1, 6, -8, 8, -1, 4, -3, 2, 0, -3, -10, 9, 5, 0, -12, -9, 4, -11, -9, -10, -4, 1, -10, -8, 0, -10, -14, 13, -1, 11, -14, 5, -10, 3, -19, -6, -16, 0, -7, -11, -12, -1, -5, 8, -3, -23, 8, -9, 7, -1, -14, -12, 4, -3, 9, 3, 6, -5, -3, 10, -16, 8, -4, 3, 5, 1, -1, -3, 8, 1, 16, -3, -3, -1, 3, -11, 10, 3, -1, -4, 1, 10, -22, 12, -13, 12, -17, 12, -15, -7, -14, -6, -1, -11, 6, -18, -4, -11, -5, -12, -7, -20, -1, -2, 0, -14, -7, -12, -4, -8, 10, -8, 12, -12, 3, -10, 2, 13, 12, 1, -4, -5, 13, -7, 13, -1, -8, 7, -1, 9, -12, -8, 11, -10, 2, -2, -7, -15, 5, -9, 13, 0, 2, 7, -14, -5, -6, 0, -1, 3, -19, -5, -10, 1, -19, 1, -5, -15, 0, 9, 8, -20, 0, -4, 9, -11, -11, -4, -8, -7, -4, 0, 0, 11, 0, -18, -11, -14, -6, -18, -5, -2, -14, -13, 6, -2, -2, -3, 3, 0, 15, -11, -2, 4, -11, -29, -13, 0, -7, -5, 22, -9, 6, -4, -16, -8, -6, -5, 2, -8, -3, 2, -15, -9, 2, -3, 2, -6, 0, 8, -7]
1.62868gj3K1qJ0NpKpMJ1k6J7j0Qj3K0k7J4Nj7PNJ4j1mJ0j9J5j1K4j2kOj1Qj1K0nmKkj4J7Poj2k
1.60477ilJ6j1NTJ4k6J0mJ6j8lQKqQpQj2RJ5k1J6lj1j5RNL1m5J1j2J2JNMj4mkJ3jJ3pOjrOk7K9
1.57984Dj5PJ3j0ojQKjTNqnlQJ5k4K1j3qJK0k8L1k9J1kmJ6rLRk3J7rlJ2mpJJ6Qj9M%klJ7j7j5K4
1.55390DjLk0J1jJ2k2J2j1K8j4jTnjNjPj0j3L1k2Rj3NJJ6plonK5jj3J0j3J1k0J5Nj2J1mnRjojj2
1.52897a5L0nk2OUnkRj4J6j1j0J2qoqL4k9K4j8krL0mnpnJ7j8KTJ2j4jKJ5j0KJ3j0nJTJ4k1J2Ll
1.50404Bj0K7j7mrRj8J3PjJ1k2RJj0J5Qk1Kj0J9kmMj0J0j9K8kj5rJ8KMprNLKJlkJoJ3j0kJMj2J9
1.47810Dj9QKJ1nLj4J1%j2J0j3LRnQjOj2kQj2lTNJ1Ljj6J6j4Mj3L4j3j4mkK2j8K5pOlJ3j4kmNj
1.45266@j0LJ4k1J4lqJ0PnNj0MKo%j8J7jj0J7kOmjQk2J0pKJ1j4LkNOj3K4j1LJ2k0kPrK0pk6K5jm
$$ y = [-7, -20, 1, -7, 3, 8, 1, 3, -4, 0, 11, -15, 2, -8, 0, -13, 7, -20, -6, -1, -18, -11, -6, 8, -3, -7, 3, -16, -1, -12, 12, 0, -2, 4, -7, 1, -10, 10, 5, 1, 3, 1, -13, 4, 11, 5, -7, -9, -12, 4, -7, -2, 3, 17, -9, 1, -3, 13, -5, -8, 0, 2, -6, 2, -5, 3, -9, 0, 15, -6, 10, 7, -4, -19, -10, -5, 26, -19, -8, -20, -8, -7, -2, 2, -12, -16, -18, -5, -6, 7, 0, 6, 5, -4, 2, -25, 4, -11, -4, 9, -1, -7, -8, 0, 2, 1, 0, 5, -3, -8, -11, -3, 12, -12, 9, -4, -12, -11, 9, -19, 12, -17, -6, -8, -12, 4, -5, -2, 7, -16, 1, -8, -11, 1, -3, -10, -9, 7, 15, -4, 0, 0, -2, -5, 12, -5, -20, 4, 3, 6, -14, -3, -4, 8, -14, -2, -13, 15, 1, 0, -1, -6, -7, -2, -3, 4, -6, -19, 12, -10, -1, -14, -9, -8, 8, 1, -2, -8, -13, 12, 11, -2, 8, -5, 6, -14, 1, 6, -6, 5, 1, -4, 5, 4, -2, -3, -15, 15, 10, -12, -6, 0, 6, 1, -1, 8, -6, 10, -1, -11, 1, -7, -13, -21, 13, -16, 8, -10, -12, -21, 9, 5, 0, -7, -12, 5, -13, -11, -9, 3, -11, -12, -10, 5, -5, -3, 10, 0, -5, -4, -3, 11, -10, 2, 5, 2, -8, 19, 2, -2, -11, -2, -20, -7, 0, -1, 10, -12, -3, -2, -12, 3, 11, -10, -8, -18, 1, -1, -5, -1, -11, -1, -20, 8, 6, -9, -18, 0, 2, 6, -1, -10, -5, -2, 0, 1, -2, -4, -3, -9, 4, -6, -8, -7, -3, -15, 4, -15, -7, -5, 6, 1, 4, -10, 1, 1, -11, -1, -14, -11, -2, -7, 1, 0, 6, -6, -8, 0, -12, -15, -18, -13, -2, 1, 0, -16, 0, -14, -10, -23, 11, -2, -16, -20, -22, 0, -18, 7, 0, 6, 3, 16, 2, 0, -4, 1, 0, -10, -7, 7, -14, 0, -3, -11, -1, 6, 1, 6, -4, 0, 2, -4, -4, -22, -5, -6, -16, 1, -1, 5, 1, 0, 8, -14, -4, -11, -9, 2, -12, -9, -11, -6, 0, -13, 11, 0, 3, 15, -5, -7, 0, -9, 11, 4, -22, 3, 2, -2]
1.42672bJ5j3Nj6J2Jj8OJ6pj4QJ2rNMqKOj%nJ0r%lToJ2KlnJ0jKoTMpK7pNj5J%QJ2j7JoMNOJ0j4
1.39874A0k0J8j4J5k0RlJ8mNl2K6lJ0poJ0nQpKJj5K0m2L3qj0NJ7Nmj7LJ5opNj6L2k9L3l5K4j5K9
1.37534B8m4RJ8nlRnTJ0j2PRMJ0j6J2pJ6k2RomMl%mj5J6jrJ3j3J7%k4QjJ8l3NK1l1K5j2K0j4PqO
1.35041Dj0J0LJ1k2K5j3JpNnTJ3jj1KJ6rmOJ0qKj0pNj6J2MTKqjNjTmkJ1j1J8l6L0k4qK2LrPMkNQ
1.32345A3rK6k4LnljTLj4K1q%j6J4M%Lk5K5k3K0j9P%JK2j7J0j3J3k6K7lMk2K1pjRmknNj%MqJ1j4
1.29801ePMJ0k0RTl2K4pJ6l5L7k8J5j6KK0j1KjNLolLMj3J1M%j1JTrJ9j4LKToJpmL3k0qK8j7JpMJ
1.27156AqN%J2nTOJqoj8M1k7QL0m0K5j0Njj7J2Pom%UkmRpPToj6K7j7JQJj6J1j5L2lnJr%KJ0l1L6
1.24409A9k1KJ0J1mj1nJ6j2kj1J5nK%TJQj3J4%rOj1J0jOj6oL2k8RmJ8k7K6oJ2j9JMjJ0j2qPJJ6o
$$ y = [-2, 13, 0, 5, -11, 1, 2, -16, -10, 6, -1, -15, -7, 5, -4, 1, 5, -3, -1, 5, 4, 4, -1, 9, 0, 0, -3, -6, -12, 0, 2, -1, -6, 4, 3, 5, -1, -7, -3, -10, 17, 10, 15, 0, 1, 1, 9, 21, 4, 5, -1, 3, 8, 14, 24, 10, -10, 8, -6, 9, -11, -2, -5, 13, 9, 14, -18, 8, 5, 15, 8, 2, 12, 7, 15, 8, 10, 11, -4, 16, -26, 7, -1, -11, -6, 11, 16, 12, -5, -2, 13, 7, 0, 5, -11, 21, -8, 25, -10, 14, -1, 28, -16, -7, 11, 6, 3, 12, 7, 2, 12, 0, 7, 16, 20, 30, 14, 26, 19, 35, 13, 22, 16, 12, 16, 13, 13, 9, -6, 10, 9, 0, 13, 0, 17, 17, -7, 1, 0, 18, -15, -10, 11, -20, 5, -7, 13, -1, 6, -2, 4, -6, 4, 7, 18, -4, 21, 8, 9, 2, 7, 2, -3, 10, 9, -2, 0, 16, 7, 3, 9, 19, 11, 13, 3, -4, 1, -15, -3, 1, 5, 7, -1, -2, 3, 2, 1, -3, -5, 6, -5, 13, -23, 7, -17, -25, -3, 0, -9, -2, 2, 0, 5, 13, 4, 30, 6, 9, 4, 1, 0, -1, 2, -12, 9, 1, 1, -15, -1, 3, 3, 6, -19, 6, -17, 3, -16, -9, -9, -8, 14, -3, 7, -6, 7, -19, 8, 5, 9, -13, 8, 1, 0, 9, 5, 3, -2, 3, 2, 2, 6, -2, 9, -5, 2, 6, 16, -4, 5, 14, -18, 6, -1, 15, -20, 17, -11, 4, -12, -10, 10, -1, 1, 0, 5, 8, 2, -1, 2, 6, -7, 4, 8, 8, -3, -2, -1, -10, 9, -5, -2, 0, 2, -4, -3, -10, -14, 19, -1, -9, 19, 2, 3, -4, 0, 1, -7, -2, -2, 10, 5, 0, 6, 7, -1, -7, -25, 16, -11, -3, 27, -13, 12, 2, 7, 6, -11, 1, 8, 2, -2, -2, -2, -2, -4, -8, 1, -6, 1, 8, 2, -14, 13, -4, -3, 5, 6, -10, 1, -14, 18, 15, 10, 11, 2, 2, 4, 14, -17, 19, -2, 0, 10, 21, 17, 6, 1, 17, 5, 3, -8, 7, 2, 4, 4, 4, 5, 13, 0, 14, 14, 5, 11, 0, 10, 9, 15, -1, -7, 25, -3, 6, 2, 20, -7, 19, 13, 25, 6, 7, 11, 10, 20, 8, 0, 7, 8, 24, 18]
1.21916A8pJj0K1j7njNkJ3%TLj3J9rj2J5k3MkNJJ5npkJ3k5L7l0J2j6K9j2Qj0J2rJJ2j6J6mrlRqo
1.19424FL5j4Jj3Rj8J4J2k9pK7pRK4P9P7Q1n5r5j8j0J9mjk8l2ol1j2LMoqK2k9K3qj2J4k2J5Rpn
1.17185FJ5kQk6J0nRJ9l0K6k0L6l4K6nK1O9J60J89J20k16j12n9J5TL8p2p1l2l9ql0J3j0jnjqoN%
1.15100HmNrOj1J8j5J3LmJ2j0k%JJ1%K0j1J7j7J2O3O6R5Qr4l8j5K4Kkm0m1k3Mj8j0Nj3K1j9KMk0
1.12810DJ7j8Klj0J8k1J8j4K8n1M0Kk0kJ3oLTrO%qJ6qlrMkJ4prK0j5J4j1LJ9j6Jj4J9k5J7LTj6
1.10419a0L3k3Pkj8J5NpRj0JnKJ6j0J0j0jpj5K6Mqj5J8nNKj2NkMKrjLmJ3j3J4k2L3l6K8j4rL3l2
1.07978a2K1nRk4J5j6RkOJ3k0Pj2J2mK%kMqjJ1j9J7JljK0j3pJ1m2L8k1%K4k1Pj1J5njOKkj7J8k1
1.05536b2L0qmrPRj7J9j2PJ1k0J4j0OlJ4oQr%Nk6K6Ml0J9j7K6j1Rj2Lk0K1okNnoK3nj4JKlKoLRm
$$ y = [18, 11, 12, 2, 23, 6, 1, 0, 5, 3, 16, 16, 16, 19, 6, 25, 16, 4, 19, -4, 0, -2, 3, 4, 19, 14, 7, 5, 18, -7, 30, 0, 12, -4, 25, 13, 21, 11, 23, 14, 15, 27, 11, 27, 23, 14, 11, 20, 12, 6, 41, 27, 28, 15, 24, 6, 20, 32, 3, -4, 23, 16, 25, 49, 128, 205, 286, 231, 136, 118, 108, 127, 123, 122, 94, 62, 56, 25, 13, 16, 20, 14, 6, 28, -1, 22, 14, 2, 16, -6, 9, 18, 11, 6, 21, 19, 27, 1, 11, 6, 15, 34, 4, 30, 10, 46, 12, 38, 33, 54, 123, 283, 472, 592, 376, 264, 205, 220, 235, 273, 201, 130, 98, 59, 51, 21, 34, 24, 23, 18, 17, 9, 3, 8, 8, 4, 9, 0, 6, -5, 13, -2, 11, 14, 10, 22, 12, 10, 10, 11, 22, 22, 42, 31, 48, 31, 43, 106, 172, 267, 275, 181, 143, 128, 152, 154, 152, 112, 71, 48, 52, 34, 24, 29, 16, 37, 18, 20, 24, 4, 21, 3, 5, 2, -8, 10, -11, 7, -7, 21, -30, 10, 12, -8, -10, 3, -3, 0, 3, -6, 0, 0, -8, 8, 0, -3, -12, -8, -10, 4, -3, -12, 8, -7, 7, -4, -1, 18, 2, 3, -11, 8, -17, 0, 3, 6, -10, 23, 0, 7, 5, -13, 2, 7, 0, 9, -1, 0, -5, -3, 13, 3, 13, 3, 2, -5, -20, 6, 10, 2, -13, 5, 0, 5, 7, -5, 0, -2, 2, 4, -5, -6, -3, -7, 6, -7, 7, -15, 18, -18, 10, -4, -13, 20, -12, 9, 4, 13, -11, 4, -12, -3, -5, 1, 14, -6, 1, -11, 1, -3, -1, -1, -3, 1, -7, -8, 3, -16, 1, 2, -1, -2, 18, 5, -2, 9, -33, 5, -16, -16, 8, -13, -6, -17, -2, -7, -8, -2, 0, -2, -19, -1, -22, 8, 0, -4, -13, -6, 3, -14, 5, -7, 0, 11, -9, 5, -5, 1, -2, 12, 6, 14, 5, 5, 10, -16, 10, 14, -16, 3, -14, 12, 1, 10, -2, 1, -19, 2, -4, -6, -1, -6, -12, 11, 6, -8, -7, -5, -8, -6, -12, -9, 0, -4]
1.02941dJ5mJ1k4K7l1mRTj3J9j2rK0j5J2j0jRj0pRj1K4j5lRrJ0lk2L2j4MjKmK2j1Kk7J4k0J2QMo
1.00550gQj6PnJ7k3K5rJJ3nrj3J3nJ7k8K1k4L3j4J3jrnjoOJ5qPqlJ9j5LmrqJ7j7J6J0k3Qk2L7rk
0.98058bj2LK4l0J6jJ4k3K3l2J5JOj7K4Ll8J4TJLTJ4j9lqOpMmRPJ4k2JqKJkmROk1J5j6L5l6J8%M
0.95514DkjKmNj4J0%j8K1nmNO%j7L2qj6Oj2K4j6OLrJorK8rTQjTNlQj8K4j0Oj0Nj2M7j2Mqpoj2J6
0.92818A7Mj4J8j8%qj0J6j7J3j6J5lqK0j6KJ6j8J0j9L1j7J4k0nPOkMrJ0j8J3PlK3QK7RJ5l9Jj4N
0.90529C7j0J6j3nj4pnJ2nk5K4Kj3kJ5k0J4Kk0K3pKj1QTj6J1j2J1jJoTLJ2%mOrK1J0J2kk4nJ5j1
0.88138A2J0mJj9J6k1NPj3QJ6j2LoJ0j4mQjoJ5k2J6rJJ8j6J2l0K3moJ0j5J7j2Oj3J7nkOJqJ6j0j
0.85747AQk4QPR%j5K1j7J%J3k8K4j0Q%j4K2j1Qj4J9Jj4qJ4j2J2J6j0j6qMOqJ9k0QkmK1k9MlL0j1
$$ y = [-4, 11, 7, 18, -6, 21, -10, -14, -5, 4, -9, 10, -2, -11, 9, -6, 6, -4, -5, 4, -6, -13, -4, -15, 9, -6, -9, 0, -9, 1, -2, -24, 8, -6, -2, -3, -1, -5, 17, 6, 8, -19, -5, -25, -13, -5, -1, -7, 1, -15, -8, -13, 4, -19, 6, -3, -2, 11, 6, -3, -16, -3, -8, 9, -19, 2, -22, 11, -3, 10, 9, 0, -5, -6, -12, -6, 9, 1, 8, 0, -3, 16, 1, 4, 0, -9, -17, 0, -17, -1, 9, -14, -6, -28, 9, 0, -2, -14, -11, 13, -17, -1, -2, 12, -11, 12, -20, -5, -4, 2, -15, 9, 12, -26, -12, 2, 3, 6, 9, 23, 4, 1, -7, -1, -8, -4, -8, 1, 8, 22, 0, 1, -7, -5, -4, -6, -10, -1, 5, -16, -1, -17, 18, -18, 0, 0, 4, 2, 1, 3, -1, 4, -10, 0, 0, -18, 3, -2, -6, -1, 5, 5, -12, 20, 12, -4, 2, -10, 14, -2, 4, 7, -2, -1, -7, -16, 12, 3, -6, 2, 1, 0, 5, 2, 10, -8, 16, 6, 12, 2, 7, -5, 42, 30, 34, 26, 19, 13, 1, 17, 21, 7, 25, 7, 7, -1, -11, 5, -12, 1, -15, 0, -3, -11, 9, -7, -5, 11, -7, 3, -16, 15, -2, 12, -8, -13, -6, 0, -2, 2, -7, 3, -15, -2, 5, 2, 25, 33, 60, 69, 84, 45, 46, 32, 37, 27, 43, 30, 25, 11, 4, -1, 11, 6, -19, 5, 7, -6, -8, 7, -13, 1, 3, -17, 6, -1, 1, -10, -2, 6, -10, 1, -11, 0, -1, 0, -6, -12, -9, 3, 3, -1, 5, -4, 17, 27, 39, 37, 13, 8, 23, 12, 22, 18, 19, 0, 16, -5, 0, 7, -6, 2, 18, 6, 9, 3, 13, -1, -5, 3, 2, -4, 11, -11, 5, -4, -3, 15, -1, 11, -19, 4, 0, -6, 4, -11, 6, -6, 0, -13, 4, -1, -3, 3, 4, -4, 12, 2, 1, 9, -15, -7, 0, 9, 9, -6, 15, -2, -1, -1, 12, -16, 8, -2, 6, 6, -8, 14, 3, 11, -3, 16, 17, 3, -5, 9, -3, 9, 25, 15, -1, -9, -5, 1, -7, 12, -8, 0, -2, -6, 15, -14, -10, -13, 17, 6]
0.83356Fj0JJ1%VJ9j9Pk%j3LJ2j0K3l5J1kNmj1QKQk0RKJKnJ4k1K5l1K0j0jJ7j5J1j7N%J4MpKJ5q
0.80762A6jj3Pj0K1j6J6j9Mj1NoTJ7nJ4mpjnmJ3j3J2p%nQr%K2opMmJ1mj1J0Kk1K3j5K3j6pJ1j9
0.78320a3L3j0j5J0J3k3L0l9J1%J0qKOKj2lLlOJ9k8K3j4Qj5OMqJ1oJ5k2RkqJ9k0K0j2Lk2J8pOJ0
0.75980Glj1JnOmJ6rpJ8j1OpTQNmj7J0JKpJ2Lj7K6jj4LoJ2qPoj6NJ2pj3K1%j5J3TrmlJ0rqKJ8j5
0.73284fK1k7rJ9j1ONJ2jk0j6L0jLrJ4j4MNnPjj4J4j9K4qj5NMOrORj1Kpj0J6kMj0lmJ1J6j7RoJ6
0.70740A3j6JPj0RmjMkJ8l1J1j0K0Jj1kTjlJ7j0k2jK5k3J2J3moMJ1j3j0J6j8J0Qk%kJ0lrmnRJ0
0.68298Dj9K2j1KnMmMj2PJ6Lk0%J2k1K8k3J7KrPm%k7M2j9J1j0PpRkj6LmpJ6nJ1J2j3PqnoJ1Mj9
0.65805a5J5pJ1lrRjkKPj3Lj5J2PKlk0J4NpJ3j0Nj9K4k5J7nQJ7k9OMQj1kNKqQTj3Rq%lJ1Pj6Oj4
$$ y = [6, -4, -3, 8, 8, 8, 8, 8, 27, 8, 15, 13, 13, 0, 3, 15, 5, 28, -7, 4, 2, 7, 3, -8, 0, 2, 10, -10, -1, 1, 2, 4, -1, 13, -8, 17, -14, 6, -4, -5, 12, -3, 8, -9, -4, -4, 10, 14, 7, 9, 24, 16, 15, 2, 9, -1, 20, 4, 20, 1, 5, -6, -1, -7, -13, 4, -1, 13, 9, 2, 1, -4, -8, 5, -8, 4, -3, -3, -8, 0, -9, -9, 13, 7, 0, 4, 0, 11, 7, -4, 6, 8, -13, 10, -5, 18, 2, -5, 6, -13, 20, 10, -5, 5, 18, -5, 25, -14, -3, -3, 7, -1, 1, 7, 9, -3, -6, -3, -6, 0, 19, -9, 14, 0, 8, -7, -1, 3, -5, 6, 0, 15, -7, 2, 0, -8, 11, -9, 11, -1, 2, -20, -2, -9, -3, 7, 4, -7, -6, -11, -5, -9, 7, -2, -9, 9, -2, 4, -3, -10, -2, 3, -1, -18, -8, -7, -5, -12, 0, 3, -14, 12, 11, -3, 0, -6, 6, -2, 5, -1, -17, -12, 0, -7, -20, 1, 1, -14, -1, 12, 3, -1, -4, 6, -3, -11, -9, 9, -6, 15, -12, -21, -2, -13, -7, -2, 10, 9, -11, -27, 3, 2, 5, -4, 10, -4, 0, 5, 0, 7, 6, -8, 6, -13, 11, 3, -12, -7, -3, 3, -6, 0, 9, -2, 0, -7, -17, -1, -3, 1, -9, -12, -16, -5, 11, -6, 3, -3, 13, -3, -2, 5, -5, 4, 0, -1, 3, 1, 19, -12, -1, -11, 9, 10, -1, -3, -5, -6, -9, 8, -2, -24, -25, 0, -23, -11, 2, -2, -8, -4, 7, -6, -16, 0, -18, -8, 0, -2, -2, -4, 6, 3, -6, -10, -15, -6, 4, -15, 7, -4, -2, -7, -3, -7, -3, -15, -8, 8, 11, -9, -9, 3, -18, 10, -13, 4, 6, -3, 4, 0, 0, -27, 15, -4, 7, -3, 4, -3, 6, 4, -12, -9, -13, -20, -4, -9, 2, 14, 1, 8, 0, -5, -11, 0, 4, -15, 0, -7, 4, 1, -8, 1, 0, -2, 0, 7, -6, -3, -18, -6, 1, 3, 0, -20, -6, -1, -8, 5, -5, 0, -19, 5, -20, -3, -8, 0, 17, -12, -6, -2, 6, -5, -7, -2, 0, -8, 0, 8, -5, 4, -4, -4, -7, 4, 11, -5, 1, -13]
0.63160a3J6j7J1Nlk0K2k1L2j3J1k2%jJ3j0J0Onj2nJ5NrMj4JJ1qJ9j1j0RJ0pjKorOTpklQkJ3nj0
0.60667a1PqRMno%Qk0J5J9pj8J7j1mNlKOk5J9Pj3J4Mj6Oj4J6J7j4j9K0QKj1rRpPmqQj0J4J1j6j0
0.58175a5J3j0L2n0L2j2K3j7j1J4j4J3j1Nm%Rj0NOj2QJ2lqJj3LJ7NJk5J3pL2k2lTMLj0KpJ7lj8
0.55835a8J6nlj3K8pJ0j5jK3k5J0%J2qpoK0j1Klj6J6kTKJ0mlk1J7lQj4J2nmRj2J5lonLNoK1k5J7
0.53342Cj5J6j5L%JJ6Jj0%J2l2J9Rj0lNmpJ5j5nTJ1j3K3j1jJJ3oJ1JRl5J8LJ8k2prQTj1J1qJ2k7
0.50900b4K5pJ5j3Ok6RKJ2J1j4mqK1qOTk5QKJ4j5NJ3j0PkqQJk3J6pj0J3RpnLMTLj5J2j4KlJ0j8
0.48408a9J4K5k6j9K5Lj1J6k5J4lJ5mnj1KjJ0k5J5K2k5J8njLTnmlOnrJ6j1J8k3J5JNlpJKj2J4kJ
0.45966@nRj8J4j2Mkjj9K5LqJTJ4j5J1J5l1K2j5LoJ0knJrLNoJ2j1K1j6pRNoPOkJ9k6pKPm%rK7k2
$$ y = [-13, 3, -14, -3, 2, -1, -21, 1, -20, 12, -1, 10, -12, -12, -13, 0, -10, 0, 6, 1, -11, -16, -1, 4, -5, -1, -15, -14, -3, -11, 8, -3, -13, -4, 6, -1, -2, 0, -6, -15, -9, -3, -10, -12, -15, -7, -9, 4, -1, -11, -4, -12, -3, 1, -4, -10, -10, -2, -22, -7, 12, 5, -13, 4, -7, -11, -6, -9, -7, -1, -26, -7, 0, -13, 1, 5, -11, -5, -19, -3, 14, 0, -19, 1, 9, 11, 0, -9, 0, -7, 0, -4, -12, -4, -14, 0, 11, -5, -15, -2, -12, 20, -30, 2, -10, 13, -4, -15, -1, -15, -2, -13, -8, -12, -12, -3, -13, -8, -2, -14, -6, 6, 3, -5, -4, -17, -14, 3, 8, 9, -16, -3, -10, 22, 0, -3, -6, -2, 1, -9, -7, -14, 3, 0, -18, -2, -7, -10, -23, 5, -2, 8, -7, -8, 15, -10, 0, 0, 12, 4, -3, -9, 11, 0, 2, -1, -17, -1, -3, -5, -3, 7, 3, 0, -21, -4, -7, 1, -13, -1, -6, -10, -1, -13, 2, -1, -7, -12, -9, -4, -10, 11, -14, 3, -12, 4, -11, -8, -8, -7, 9, 10, 0, 0, 12, -20, -1, 8, -2, -5, 0, -4, -11, 4, -11, -16, -21, -10, -23, 0, -11, -12, -11, 2, -4, 7, 8, 17, -18, 0, 3, 21, -1, -8, -17, -9, -1, -12, -1, -9, 3, -24, 1, -6, 9, -4, 2, -24, -15, -13, -1, 10, -4, -8, -16, 5, -3, 3, 9, -16, -8, -6, 8, -7, -2, 11, 1, 8, 6, -2, 6, 7, -16, 0, -7, -17, -4, 5, -2, -7, -4, 0, 4, 7, -8, 4, -10, -8, -11, -1, -19, -5, 20, -6, -25, 0, 3, -8, 8, -17, -3, -6, 9, 5, 0, -11, -9, -10, 0, -25, -10, 12, -13, 5, 0, -1, 2, 5, 0, -4, -7, -1, -6, -15, 1, -10, 8, -15, 0, 1, 6, 3, -4, -3, -1, -13, 1, -1, 0, -5, 4, -14, 0, -12, -8, -10, -11, -30, -5, -2, -10, -9, -8, 6, -9, 2, 17, -14, 8, -7, -4, -10, 0, -2, -7, -6, -15, -12, -7, -13, -1, -12, 9, -7, -14, -5, 0, -6, 1, 7, 5, 24, -2, -9, -7, 0, -4, -4, -13, 14, -8]
0.43320hK0k2PjJ1j3OqjJ3nOj8QJ0Ok4J5Oqmj0K6j7J6k1J3j8MJ1j6J1oJ1j0K0j8Nj2K2plLj2NM
0.40980cj3J6J0Ml7K1k7K9Qk2J7jQk2kK1olmMrLjJ1J6j8j3K4j3j7K2Kk3K5pLljkoTkL1k5K1mj0
0.38589dj6K3k1J0J5qk9L6k8J3KqL1j7KpLTk0K1kNmLpMlJ0k6J1TpJ2kJk2K1p%MkjpK2k5Lj3J2j2
0.36097b0mK0Lj4Nj3K3j0J3j5j3J9OklMpRoPk1J7pnOK3j7kn%J5mkQrj0PnJ1j7J1KLJ%j3oQTj2J3
0.33502@J2j2TKqK5k2K2k0pJ9J0Jj1Pj1j3OJ2lj6K8r%rqJ5j5ljK1oOoj0PJ2J5k6Q%jj0J1LpQk5
0.31060b1M7m9M0k5J7j4QJ4l4NmM0m3J0JTRnkMKPJj7nJ0rOToKJ6j3oj1K6k0J7qJ3k1QORk2RMPr%
0.28517Ajj3J2OrlLOmJ2m9M3k0K2jTk0J6j9QK3j9qJ2lqPMnQJ8j7mkNk5J9j3J5jJ6j5k8M4k0J4j2
0.26126f%KOpNnPoQj2nJ2Jj5J1pRj2JJ4MQk1j0J6j7J6jOKmJTj8J3J4j0j1j%J6p%jk3K8j8L2l5RL
$$ y = [-8, 12, -10, -3, -4, 7, -6, 0, -8, -9, 4, -1, 5, -13, -5, 5, 11, -13, 2, 8, 0, -4, -14, 12, -5, 11, -10, 3, -15, -11, 0, -16, -5, -11, 0, -10, 10, -8, -3, -15, 7, 0, -3, 0, -12, -7, -3, -16, 0, 10, 14, -23, -2, -29, 0, 8, -14, 3, 2, 10, -12, -14, 7, 1, -2, -6, -2, -11, -8, -9, 2, 18, 0, -13, 11, -2, -19, 3, 5, -18, 7, 0, 3, 0, -1, -3, -9, -15, -17, 14, -11, 10, 6, -4, -20, 3, -18, -8, 7, -1, -30, 6, -22, -9, -7, -15, 16, -1, 1, -6, -3, 0, -20, 1, -1, 4, 0, 3, -4, 0, -3, 7, -19, -8, 3, -4, 8, 6, 7, -15, 6, -1, -1, 3, 1, 0, -7, 15, -10, -7, -20, -8, -20, -24, -4, -1, -15, -10, -23, 0, -10, 3, -12, -25, -6, 0, -2, -5, -1, -8, 1, -5, 2, -19, -2, -9, -14, -8, 15, -2, -4, -9, -9, 6, 2, 0, 8, -1, -11, -4, -9, 2, -15, -4, -2, 1, 2, 2, -11, -17, -9, -1, -13, 0, 12, 0, -12, -10, -18, 7, -15, 7, -13, -20, -1, 9, 10, -1, 6, -5, -18, -12, 0, -3, -19, 9, 0, 0, -9, -17, -2, -17, -20, -21, 0, -6, 0, -6, -16, -9, 3, 18, -8, 0, 0, -1, -11, 0, 3, -4, 4, -21, 26, -23, 17, -8, 9, -5, 3, 17, -17, -12, -16, 24, -19, -9, -8, -7, 2, -3, -5, -1, 1, 8, 9, -8, -13, -3, -12, -6, 0, -6, -4, 12, -1, -7, -18, 8, -12, 5, -3, 10, -11, -3, 3, 12, -10, -1, 3, 10, 1, 1, 0, -13, -1, 5, -4, -7, -4, 2, -2, 10, -39, 4, -16, 6, 5, 4, -16, 0, -19, -11, 12, -7, -15, -3, -6, -14, -7, -3, -8, 0, 18, 1, -3, -5, 0, -25, -6, -19, -4, -5, 11, -4, -32, 12, -8, 6, -6, -6, -4, 2, -5, 0, -5, 2, -4, 4, -8, -13, -1, 0, -15, -4, -11, -2, -14, -13, 1, 5, 13, -8, -18, -2, -19, -3, -4, 2, 4, 0, 1, 2, -16, -3, 11, 1, -10, -11, -11, 5, -2, -2, -3, -26, 2, -16, 16, -19, -10, -7]
0.23532gPmJ0j4%J2j4J0j7OK2j5JokJ1j2K3lj9jJ2mJ0k1K2j9J4J1l7RTl%K1k2JTNlpK0j8K0k9K0
0.21191@k4K8k7rL0Rj9K1j2pLNJ3k6LJ1ljlnJ7k1RnRj6K3kj7J3j4MNJ3j1JpkJ5j4J3Jj6J4rJ1n%
0.18750dJJ0Jj2j9J5RplqPNnJ6k3J1J0k5J5J3j5J1k2J8j1K3k6K5j4Rmj8JlNnK7j5QjlJmP%j1mJ0
0.16308dJMlj1qK1qL1l7J1OnTj4L7k9K1k3J6j1J5j3lPMlLknj3J5j4J7qQLoKOjj0j2J2jRnTJ5Rj4
0.13764@rmTK9nj0LJ6k6J6mj0J4Kj3RPj7Pj5QLloJ4j5PK0k3LoRnNJ3j7Qj7nKPJ0Tjpk8K6Pj0Mj2
0.11170a3J1J3k7MkRmQnJ2k2NP%j0J3Jj2M0l9Oj6J3MJj5J6J0oj2%Oj3J3kqJ7J1k8%Qj9K4Kj0J5
0.08830Fj7kJ5jqjQrOlRrqJ8J0l3J9%Kj4P%nlJ5rKLK%qj2K5j5nK1j7KMmROo%Pk6K4qjKjkRj8K1%
0.05981Gnlmj6K0j0pPJ7j7NJ2j6JMl3N2j3lKrRopJ7qKJ7j5nJj1kJ5JLj7J7j0J1k1J9j0J2pKmj3
$$ y = [-7, 0, -4, 6, -8, -8, 4, -10, 0, -17, -11, 11, -4, -3, -9, -11, 0, -12, 11, 8, -11, -12, 0, -4, 6, -15, 7, -12, 2, 13, -24, -15, -6, -9, -9, 12, -10, -9, -8, -3, -6, -13, 7, -11, 9, -20, 0, -24, 4, -23, -32, -2, 7, -12, 9, -3, -10, -7, -2, 11, -15, -12, -1, -4, -5, -8, -13, 4, -17, -8, -13, -4, -20, 3, 1, -16, -3, -17, -13, -8, 5, -6, -5, -12, -14, 1, -13, 0, 1, -15, -1, -10, 1, -4, -4, -3, 7, 8, -4, -23, -8, 1, -6, -9, -17, -10, -5, -10, 6, -17, -6, 4, -21, -6, 7, -8, 3, -19, -1, -12, 11, -15, 10, -4, 5, 1, -17, -16, -19, -14, -19, 8, -7, 1, 0, -3, -2, -6, 1, 1, -10, -14, -4, -3, 1, -2, -13, -21, 0, -8, 23, -14, -3, 3, -2, -7, -21, 16, -13, 8, -15, 1, -10, 5, -8, -11, -4, 0, -3, 0, -2, -7, -20, -5, -19, -2, -10, -2, 1, -5, -3, 3, 2, -8, -20, -8, -9, 0, -5, -10, 5, 14, 0, -9, -13, -17, 12, 7, -3, 0, 16, -10, 6, 2, -8, 6, 8, -5, 4, 11, -6, 1, -14, -6, -3, -6, -12, 2, -13, -6, 14, -9, -6, -12, -3, -8, -3, 10, -7, 1, -16, -21, -19, -12, -2, 8, 7, 0, -28, -2, 5, -5, -1, -13, -2, 11, -16, -12, -14, -5, -9, -1, -6, 6, -16, -11, -4, -4, -14, -1, 0, -12, 28, -11, -5, -21, -8, -4, -3, -18, -2, 8, 2, -10, -10, -4, -17, -4, -6, -14, 3, 14, -14, -14, -6, -25, -1, 1, -9, 6, -11, -13, 2, 1, -7, -8, 0, -9, -3, -6, 3, -6, -14, 4, 14, -19, 0, 0, 2, -12, -5, -5, -10, -13, 2, -7, -5, -2, 0, 0, -8, -20, 5, -10, -15, 6, -11, -9, -5, -9, 0, 6, 0, 0, 7, -19, 5, -3, -4, -2, -3, -5, 4, -14, 7, 7, 2, -1, -5, -21, -1, -11, -18, -11, 6, -11, -6, 6, -10, -9, -5, -38, 14, 1, -2, 0, -9, 0, -6, -13, 4, -4, -2, 15, 0, -5, -4, -15, -17, -2, -1, 2, -15, 2, -8, 3, -18, 1, -9, 3, -4, -2, -6, -19]
0.03539a9J0MJ0j6J9oj3J2j2J0lpQj0J8j2%J1j8QOmKLTj1Ok5L1j3Qj5K0nMToj0Qj9J7nKJ1oj0J1
0.01148Aj7J6%lTLJ3k1J9k0jRL0k7jpK5j8kKkTJnJ3j5KmJ9k2K0j0PljQrOl%pQLNpqj8JK7j6Kj1
-0.01497b3K4j0Rjj2QKj2K5l0K0qJ8j4Nj1K1rkpJ1j4Ok2K2J9rk9K9l0K8j9J5j5K4rKJ0j2j4JJ0p
-0.03685a0J2JRj3jJ5nj2OQ%k7J0j0J2jNj9PJ6k2J6L%mjPj6j3L8j0jJ6j8%plJ2%j3J0Pj2JnJmJ1o
-0.06177a0J2k2J7LMj8J8j6J3oPj3J3j1MqRpNOqPj0K7k9J7k2K1jj9J2J1j9J4j1J3qPj1K1j7pJ2j4
-0.08416a4QkKTqK1Oj9MoMnMTj6J0mK4loj2Nj9J8J4j5Kj8J4Tj1NKjoK%kj2QKPlmpKTN%kMjj3K2j1
-0.11213cnTJ5mJ6k1J7j4M%nmKNoLk5K2lJ0j9L6l4K7k0J4LNj8KNj3J2LmrJ4k0K1oj0LoJ6rQLj5Ml
-0.13757a1J1nNk0J0J8mj6KQLj9QJ4opJ3Ok3J8l1K0pJ3Nj6Qj2J6j4Qj2K1j0NKj0lJ1JKk9K7j9J7m
$$ y = [-19, -9, -5, 5, -11, 8, 2, -11, 1, -11, -1, -4, -11, -3, -13, 5, -7, -7, 4, -14, -6, 0, -4, -2, 1, 4, -7, -1, -26, 5, -8, 0, -15, 5, 0, 4, 8, 2, -8, 0, -19, -2, -7, -5, 6, 0, -10, 1, -16, 0, 0, -3, -6, -3, 10, -11, 8, -12, -13, -4, 26, -1, -2, -9, 16, -2, -4, -2, -4, -6, -5, -10, 3, -12, -10, -14, 5, -17, 3, -7, 0, -3, -4, 4, -5, 1, -2, -2, -9, -1, 2, 7, 0, -8, -26, -25, 2, -14, -12, -23, 1, -9, 0, -1, -13, -5, -3, -15, 10, -20, 0, -8, 10, -4, 1, -10, 11, 2, 0, -7, 4, -10, -4, -26, -4, 15, 6, -23, 6, -24, 4, -15, 0, -15, 9, 0, 2, 12, 0, -14, -13, -3, -10, 2, 3, 12, -1, -2, 13, 8, -4, 2, 10, 10, -17, -7, -17, -5, -6, -1, -20, -13, 3, -19, -3, 0, 0, -4, -5, 2, -14, -27, 11, 1, 0, 16, -2, -2, -9, -12, 0, 0, -13, -3, 4, -8, -7, -12, -11, -15, -4, -10, 2, -20, -3, 0, 4, -14, 4, -12, 1, -5, 2, -11, 2, -9, -5, -13, -4, -11, -6, 0, -8, -1, -11, 16, -13, 4, -18, 3, 2, -17, -5, 6, -13, 1, -10, 3, -5, 2, -9, 12, -5, -12, 0, -14, -6, -8, -6, -4, -12, 9, 15, -4, 0, -6, -2, -7, -3, 1, -15, -5, -9, 15, 12, 6, -6, -1, -20, -2, 12, -3, -1, -19, -5, 9, -2, 3, 5, 4, -2, 0, 0, -2, -14, -6, -4, 3, 0, -4, -11, -9, -7, -2, -2, -4, 0, -1, -14, 8, -3, -8, -13, 2, -2, 14, -7, 10, -4, 0, 0, -5, -9, -7, -2, -8, -5, -30, -8, -11, -1, -20, 16, -18, 9, -11, 3, 6, 11, -7, -5, 0, -13, -1, 2, -2, -11, 3, -17, 4, -2, -12, -9, -15, 1, -8, 0, 3, -12, -8, -11, 0, -5, 0, -20, -10, 8, 4, -12, -10, -2, 1, -18, -10, 4, -2, -9, 4, 10, -13, 5, -26, -6, -13, 0, 5, -11, -3, -15, 1, -13, -5, -17, 4, -6, -1, 1, -9, -12, -1, 0, 2, -27, 0, -19, -2, -6]
-0.16097fMjj2oJ5jj2R%kK7j1j5%PK0k4LTmJk4K3LJ1j9OlJNj2L5l0J5m1RK6pK0k6Qj9L3j4jj7K3j
-0.18539apJ6qomj0PJMRj1K1l1J3j8J6OJ3k5J7Pk6QmMKNj0LJ4k2J2OJj4nK0J2rnUj1K2rLK0l1J0K
-0.21082ckLrJ4mqrJ5j5K0j8J3lpPKMk7J7mJ7knOj9LJ6Tj8rMqJoJ3J1k0K3k9K7qMj9mKJ8mJ0j6Qr
-0.23677a1J8pj3J2j6K0qJ0onJOk0J2PKJjkrJ9k1QjKpJ0jj0LOLj0QlTJ5qJoJ5j3j7K1kpMqQkRQk9
-0.26373a7K2j1J2rJ4l4K5j0QlrOJ2j4Nj7LlK3j4QqJ5rjQTj1nOmoKjLoK1Kj9K4k7oJ9J2j2knJ5j2
-0.28866bJ3k1J5j2Pj7J8pOTj4RnMj8J9qQTj1JJ1MoJ5l5Nm%J0J1rk0K6j0JrJ0OMjoj1J5j3LMk5M1
-0.31358A6m1K1pJ1j2PrRJj0J5j6K4j7mRmJ6j0OJlrJ9j8J6j1UJ5qROPj5jRJjk0J4LNM%lTJ0k6J2q
-0.33953a2K7k7J5Nk7J9jJ2k8J0j1J9k1M1k4LJqK2j5j6Qj3J6plJ6Jj6Rj4K7j2rJ5Jj7LJ9lnl0K1m
$$ y = [-6, -2, -3, -15, -21, -6, -7, -19, -10, -10, -12, 15, 4, -11, -11, -4, 16, -8, -5, -2, -6, -5, -29, -6, -3, 8, -11, -5, -8, -7, -2, -14, 21, -9, 6, -35, -26, 0, -7, 13, -13, -5, -24, 9, -5, -6, -23, 0, -1, -8, 8, 0, -6, -10, -20, -13, -12, -8, 1, -10, 11, -20, -7, -25, -9, -3, 10, -15, 2, 9, -17, -9, -13, -9, -7, -2, -12, -9, 5, -17, -5, 1, 2, -12, -17, 3, 15, 6, 1, -4, -9, -20, 2, -7, -4, 16, -15, -5, -3, -5, -2, -11, 3, -1, -9, -18, -3, -18, 2, -16, -3, -6, -13, -6, -4, 0, -27, -10, -14, 3, 1, -4, 2, -17, -14, 2, 18, 0, -9, -5, -13, -12, -18, -5, 6, -14, 9, -20, 7, -1, 3, -16, -20, -18, 0, -4, 6, -10, -2, -11, 7, 0, -13, -1, -17, 3, -5, 5, -1, -6, -5, 1, -19, -7, 0, 2, 3, 2, 0, -9, 10, -11, -3, -4, -2, -9, 1, 0, -10, -7, -1, 2, -8, 0, -3, -6, 9, 1, 2, -4, 11, -2, -19, 2, 0, -7, -3, -11, -3, -5, 4, 12, -17, 5, -6, 6, -3, 11, -23, 2, -8, 0, -3, -12, -6, 6, -8, -3, -20, -17, -20, 3, -11, -3, -11, 4, -5, -6, 2, 10, -1, -6, 0, -4, -10, -8, -9, -6, -12, 9, 11, -8, 16, -11, -17, 2, 14, 2, 0, -5, 10, -2, 11, -10, 5, -7, 0, -17, 1, -6, 0, 6, -8, 1, -4, 0, -18, 1, -7, 1, 9, -2, -1, 10, 14, 8, 23, -12, -7, -11, -11, -1, 10, 1, -19, 7, -3, -2, -11, -1, 5, 9, 8, 2, -9, 6, -7, -4, 0, -25, 16, -25, -4, -11, 0, -12, -5, -14, -5, -4, -14, 1, -15, 9, -8, -12, -3, -7, 9, -1, 5, 6, 3, -6, 13, -5, 11, 0, -11, -22, -7, -15, -6, 0, 7, -8, -9, 0, 1, 0, -20, -6, -3, 2, 6, 6, 3, 0, 10, -16, -4, -12, 15, -12, 3, 8, -19, 0, -1, 11, -17, -7, -18, 1, -20, 21, -3, 0, 1, -7, 15, 0, -16, -8, -21, -5, -12, -15, 1, 2, -14, -5, -19, 8, -4, -13, 2, 3, -14, -11, 8, 5, 0, -30, -9, -13]
-0.36191a3J6Rj4j3L1j7j3LNoj4PK5rkJ8k6Oj3QJ1Tj9J4Nj7J6qPj4MoRJloLoOj1J7j5K4j1j3J7j0
-0.38582fmKOlj2K3o%qPj8J5rJ2k0K4J3j6J8j9PokJ0k4J1j2J7j2J7k9J0J1j7K0k2K5k6L0j7PQl%
-0.40820Bj4K4k3J2qQl%Pj1Qj0nNJ9l6K0J7k6%J6jj2JJ2nJ7j9pJ9k0LJ0j0NmJ8j6J4j1qJ6j4RKj3
-0.43161a2QOpMj3J5j1J5nj5K6onlQTj5lOJ2j9J3j1Rj2J3j8J3k0J4MJOj8K5pMk6K5j7J1mqK8j7Kj
-0.45551CoLnJ8m5M5l3L7j6mjKRjoj%JlQrOjj0MKJ4j6JMj3J9j1lJMJmK4k7Rk4K1j2J7k0J0PomJ2R
-0.48197A0j0roJ1mJ4Pj3Nj2Oj4K4Jmj8J2%j6RPTj8J5j9J5lTnJ1RmLk5J7k9J1RmJ2nKJ1JqTmLK%l
-0.50791a0J4Nnk2LJ3j0J2lMlJ1k0nK8l5L0pl%TKpkmL1l2J2j2J5lJ1k1j0OK0Lk1J9prK9j9KjJ8k4
-0.53182glJ3j5%J1Tl2J0%KJ1jRk4OJ7k1J3lj4J4qOJj3QOPj3J5qQj8L0j5j2OLmpMTrKK9j9jqJ8k5
$$ y = [-13, 3, 12, -2, -15, 16, -1, -14, -11, -6, -12, -26, -19, 6, -3, -5, 13, -13, -7, -20, -12, -1, 10, -9, 5, 10, -7, 9, 1, 8, -6, -2, -8, 1, 2, -1, -7, -4, -10, -4, -15, 2, -13, 11, 0, -13, 4, -6, -10, -8, -2, -5, -17, 6, 0, 0, -8, -1, -19, -4, -13, -1, -21, 3, 16, 0, 18, -1, 6, 0, -2, 8, -16, -5, -17, 0, -12, 5, -24, -14, -3, -20, 0, -22, 3, -23, 7, -10, -3, 5, 2, 2, -12, 12, -11, 1, -7, 1, -2, -2, 5, -6, 2, -8, -13, -8, 11, -25, -5, 12, -14, -14, 2, 1, -11, -10, 2, -3, 14, -5, -12, 7, -13, -10, 0, -10, -5, -9, 9, -7, 7, -4, -12, 4, -10, -1, 1, -12, -4, 2, -5, -1, -14, 1, -10, 5, 0, -15, 11, 5, 0, -3, 5, 13, -2, -5, 1, 13, -6, 7, -4, 5, -7, 6, -12, 1, -19, -5, -1, 0, 6, -12, 13, 6, 10, -16, 9, -8, 3, -1, -9, 19, 2, 4, 3, -3, 0, -5, 13, -32, 13, -20, 17, 1, -3, -4, -2, 7, 6, 0, -1, -1, 0, -3, 5, -4, 2, 1, -9, -5, -3, 11, -5, -4, 0, -13, 6, -5, -8, -7, -3, -2, -6, 18, -9, 0, -24, -3, -15, 2, -18, -8, -1, -7, -11, 1, 10, 0, -9, -15, -4, -8, 6, 13, 0, 5, -7, -1, -15, 9, 10, 6, -12, 0, 0, -16, -7, 0, 7, -11, 4, -15, 0, -3, -6, -11, 0, 9, 5, 8, -17, 0, -29, -18, -9, -13, -1, -6, -4, 7, 8, 0, -8, -12, -9, -7, -7, -10, 4, 9, 4, -18, -15, -2, -12, 0, -3, 1, -2, 9, -11, -16, 12, -23, 7, 0, -3, -3, -3, -1, -8, -10, -14, 17, -15, -3, -15, 0, -3, 8, -13, -23, -17, 3, 6, -15, 4, -3, -12, 17, -2, 0, -1, 17, -7, -10, 3, -12, -12, -1, 10, -22, -12, -12, -10, 1, 0, 9, -15, -9, 8, -13, 0, -3, -17, -3, -11, -5, -4, -17, -9, -3, 4, -9, 6, -2, 6, -12, 18, 3, -9, -3, 0, -4, -11, -7, -3, -12, -10, 19, 0, -1, -9, 9, -16]
-0.55726a6LlRQJkrK2j3j8RJ2qNj0J2nqnJ6%jLj4J3j1rK1jnk1K3Kj3Q%TJ0kmMj0J3kj0J1j1K1j2P
-0.58269A0pLj3KK0j1Mk1QjrK0kpqpOJ3J0k1RJoTJMJoJ8k0J4pqJ1Nj1QjJ8k2kTJQk2K4mlPj3kJ6O
-0.60965FqJnRJqRj9J7qkpJ6j2MTpRkLNLk2nkK7K0m7J3PJpQoRj8J9j0jQqk1L1k3J8j5J9k1RKQj6
-0.63611a4J5k0J9k1K3j9J1KJ9l0J4oj6RJjJkK3k1L1l2K4k5J8k6J8j2J6j9K0pOJkNJ0j8k2K6KLj2
-0.65798hJ1j6K9nj5nLQJj8J7mJ5j3pjK0l1J5jrK0Oj6j9K7J4k5J3k0J1LJ4j4mKjJ0j7J9j4jj3J8%
-0.68087arJJ2j9J5j1J5j0P%lpOj5K0j8K7j7J8qoj1K0no%oPJ3k1K1j3j0J5k5K4%j1K1j6Mk3K8jkn
-0.70427eJ5k5J7j3MJ0KrJ0j2qK2j5JK3k0Pj2PJ6rpJ0j6o%J8Jj6NoJ0rLjj0Rj8L7k7K9nl3L9j1p
-0.72768eJ5k2J2JmQk5K8j1Rk1J3rJ8j3j0J7Kj0RmJ4j9J2rJTpTJ6Ro%mlkOmqJ7rJ8l4J8j4J1LKR
$$ y = [-16, -13, -16, -7, 1, 2, 0, -9, 13, 0, -18, -9, 3, -5, 0, -10, 2, -3, -11, -16, 0, 0, -1, 2, -12, 1, -10, -19, 2, 1, -4, -25, -2, 0, -13, -5, -5, -5, 5, 3, -1, 3, -7, 6, 4, -6, 5, -6, 15, 3, 10, 3, 6, -7, -5, 15, 4, 8, -13, -5, -6, -15, 5, 3, -4, -12, -19, -13, 0, 10, -11, -2, -1, -7, -13, -12, -8, -7, -13, 5, -15, -1, -8, -16, -5, 0, -11, -3, -4, 14, -8, -10, -12, -11, -3, -25, -1, -5, -8, -1, -14, -16, 0, 6, -2, -1, -6, 3, 4, -4, 5, -14, 3, -5, -7, -14, 2, -10, -6, -2, -9, 0, -2, 1, 6, 9, -13, -18, -20, 7, 27, -20, -7, 0, 1, -6, 2, -4, 5, -13, 6, -4, -5, 3, -5, -26, 5, -18, 0, -15, 4, -17, -8, -6, 2, -14, 1, -19, 0, -21, 2, -17, -6, -4, 15, -15, -1, -7, -23, -14, -13, -14, -13, -15, 8, -13, 18, -14, 10, -15, 3, -23, -5, -17, -1, -20, 0, -7, -1, 0, -2, 3, 13, -5, -27, -1, 1, 4, -8, 3, -13, 16, 11, -4, -9, -6, 2, 3, -15, 2, -2, 13, 0, -7, -8, 12, -19, -4, -5, -14, 6, 12, -4, -23, 4, 18, -7, 6, -14, -3, 0, 14, 0, -4, -2, -3, 7, -10, 9, -5, -6, -19, -1, -1, -10, -9, 3, -16, -1, -12, 3, -7, 0, 0, -3, -10, -4, -19, 1, -17, 10, -7, 11, 3, -3, -14, 6, 1, -5, -5, -11, -4, 9, -12, 9, -4, -14, 1, -24, 0, 0, -11, 10, -6, -2, -25, 3, 2, 0, -5, 10, -15, 2, -11, -7, 3, 5, -4, 6, -6, -14, 8, -7, -6, 17, -3, 4, -8, -1, 15, 6, -1, 9, -7, -13, -13, 5, 6, -10, -5, -11, -1, -10, -7, -8, -18, -9, -27, 10, -17, 12, 7, -26, 13, 2, -5, 10, -12, 0, 1, -3, 5, -20, 8, -3, 6, -15, -2, -11, 7, -6, -16, 1, 3, -7, 2, -2, 12, -7, 5, -4, -3, -2, -9, -16, 0, 9, 3, 3, -1, -4, -6, 0, -4, -12, 5, -4, 14, -20, -2, -16, -5, -2, 0, 9]
-0.75260Ij7J5j2jqJ1Nk2RJ4Kj6J8j5NkLNj5KjOj3J9%kJJ2j0Lk1J1MJj1K7k3MqJ0j4RJ0mj%j1J0l
-0.77753eQpPj9J2j6RmKK1JrJ2%k0L7l9NJ7j1J4k0oJ1jNTj4JTj2NJ0J4j9MRj3mK1k3L0j2J0l2K2
-0.80093Gj5NL%j1LJ2j8J4nj1J8ljJ3k8J5OqkJ2j4RqNjk4M2l3M2j8J6k2mlJ3j6J4Llj9MPK%mj7J4
-0.82535ij2L4j3j9K9k3oJ8pK0j2%jK7m3J5JnJ0l3K9l4M2qnJ7j2Qk5J4jTj3J8oJ3j5J3jJ0l2J4q
-0.84722a2J2Mj5QJ1j2Pjj3qJ2J8j7PpKlj3J6kKjOKrLQnTJ0qlK4j5j7QJ0J1k3K1olj5ORj7RMJrj4
-0.87317b2QKK6j8J0j8LKNjPm%rK1oj6OPTj2J9k8KOJRpolJ9oTkomJ7rK3k3J3j9Q%J0k3L0m1K4k1
-0.89860b5L5kj3Kj5J6JK1m1L4j7J1k2mJ9j0J8lj5J3mOj0j1QJ6k8OJ3J2J0k6pJ5j3JJ6oKRl3L1k1
-0.92048a1J5LTk5NJ0LnKUJjNr%pqLML6l6KrK0j3J3Lk8K1j4J1J6j1kP%j4kNMjqJ4Mj9Mj4M4k9oJ3
$$ y = [9, -8, 7, -5, -6, -14, -3, 2, -20, -11, 3, 5, -11, 7, -8, -3, -5, -2, 3, -12, -10, -11, -5, -18, 1, 1, -1, 0, 12, 2, 5, -16, -5, -1, 0, -11, 16, -7, -3, -11, -1, -15, -6, 4, 0, -1, -1, -12, -2, -5, 3, -4, 3, -16, -4, -20, -11, -15, -13, 8, 9, 0, 12, 12, -8, 29, -10, -5, 12, 1, 15, -5, -11, 0, -1, 4, 9, -5, -4, -3, -15, -10, 0, 14, -5, -1, 8, -5, -9, 12, -11, 19, 7, 17, -15, 7, -8, -3, 0, 0, -11, -8, 4, -14, 0, -5, -16, 2, -1, -2, 11, -17, -2, 4, -4, -6, 6, -8, 1, -7, -2, -3, -27, 15, -18, 24, 6, 22, 0, -4, -7, 6, -10, 4, 7, 4, -15, -11, -4, -2, -2, -6, -23, -9, -21, 13, 0, -19, 10, -13, -19, -1, -8, 12, 0, 0, -1, 26, -17, -2, -1, -6, 4, -29, 0, -34, 8, 0, -5, 12, 0, 8, -17, -3, -4, -5, -18, 0, -6, 7, -8, 5, 4, 14, -18, -4, -12, 0, 4, -11, -3, 8, -4, 3, 2, -11, -19, -7, 11, -6, 1, -6, -4, -7, -20, -4, -6, -4, -5, 1, 3, -6, -3, 5, 0, -5, 5, -3, -6, 18, 3, -14, -6, 4, 15, -8, 13, 7, 4, -11, -5, 4, -13, -4, 0, 1, -8, -22, -14, -12, 14, -4, 6, -12, -9, -7, -2, -3, 4, 0, 0, -9, 12, 6, -10, -4, 3, 10, -2, 17, -11, -9, -3, -2, 7, 0, -6, -9, 10, 4, -2, -4, -10, -14, 3, -6, 17, -6, 7, -12, -4, -4, 6, -17, 13, -28, -4, -25, 10, 8, -5, -3, -18, -2, -1, 20, -21, 13, -4, 7, -15, -19, 0, -10, 8, 5, -10, 3, -1, 5, -5, -16, -8, 8, -20, -14, -1, 11, 21, -5, -12, 3, -10, -9, 7, 1, 3, 12, -21, 10, -11, 4, 7, 10, -15, -10, 0, 3, -2, 0, 2, 4, 5, 4, 9, 0, 0, -7, -15, -12, -8, 28, -8, -6, -15, 5, -8, 5, 8, -20, 1, -13, -2, 14, 3, 1, 8, 8, -6, -8, -3, 1, 0, -8, 6, 10, -9, -5, -19, 25, -4, -10, 3]
-0.94693CQk0OLjj2nJ4j5K3j2mJ2kJ1j8J8k1Q%MNj8J5j7J4j3OJ9k1J0Nj1lj1K3j0J1k2RJ0NLoJj2
-0.97033hNrmL3k1j1K8k3j0J0QoMj3J0j9J8qK0j6J4j0K2Lk7Pj0J8j1J9j1prJ8qpJ1oJ0pNj6JRkJ4
-0.99373Hk6J8nmOPJkpoMJ4q%j2OoNKJ9m1L0j4LnjK2J0kj1o%lj4J1J2j5K2j2J3k1J8lj5J3PprKjo
-1.01968i%NJ3k3J9j1J0j9K2k3K6k8OJ0qRj2jJ0J1JmJj5L4l0OmJ6l1J9PKk2K6k2K4j5k7QK1j1KJ2
-1.04206Ej2MK0k7J0Ok0K2pKL%l4K6j2JJ8k1J7j3J8j7K0j0JoJTnR%j6KkK7j6MqJ1jJ0jj0lqK3j5L
-1.06648@%jj2J3j8QpJ8j5J7l%Qj3JMj1j3J7PjOj0j2J7pPJ3k0lL2k4oMJ2k1J3okJ2j2j6M7nk9jTP
-1.09090fJ%J6l5L2qKOj8%J5Kjpmj2K1j9J3j9K5j0J0qOj0K6mj6nJ7k5L9j8rk4K9J%rj0J7oOQjJj2
-1.11531cJ3l1K3j3J0JNl9M1qLk0L3j2mj7NJ3Qj8J8j2j1NJj0K5rJ9k8PJ1Pj6J5j8J2L%TKk9J8KJ5
$$ y = [3, 11, -9, -3, 0, -1, -13, -18, -4, -19, 4, -8, -12, 0, -2, 9, -9, 9, -12, -4, -4, 0, 5, -13, 2, -15, -1, -14, -8, 11, -10, 0, 5, -6, -9, -20, 3, -7, 4, -18, -9, 1, 6, 9, 3, 4, -8, -3, -12, -16, 17, -4, -15, 13, -10, -20, -10, -2, -8, -4, -17, -7, -26, -8, -16, 4, -12, 2, -8, 14, 17, -10, -3, -13, 5, -6, 13, 2, -5, -14, 4, -4, -11, 0, -6, 4, -3, 2, -14, -13, -4, -6, 8, -18, 0, -5, -9, -3, 4, 5, 3, -4, -10, -6, 8, 0, 0, -12, -6, -12, -7, -5, 14, -27, 3, -11, -8, -13, -14, 8, 18, 16, 5, -1, -1, -4, -18, -7, 5, -10, 12, 0, 13, -8, 10, 7, -8, 5, 12, 5, -4, -2, -3, -9, -9, -4, 9, -14, 5, -6, 4, -15, 7, -16, 10, -18, -12, -2, -10, -1, -13, -14, -4, 7, 8, 4, 5, -10, 24, -6, 0, -4, 12, -19, 0, 7, 9, -13, 13, -9, 15, 0, -27, -19, 2, -9, -7, 5, -7, -3, 17, -10, 0, 6, -14, 8, 1, 3, 6, 6, -28, -2, -14, -13, 5, -16, 1, -12, 6, -11, 9, -1, 0, -6, -5, -4, -9, 0, 0, -16, -14, -16, 11, -5, -1, -9, 2, 1, 11, 10, 0, -3, -11, 12, -3, 0, 0, -1, -13, 0, -18, -10, -17, 1, -14, 3, 0, 0, 8, -5, -4, 0, -11, -24, -7, 0, -1, 5, -5, -17, 0, -7, 0, 13, -7, -10, 22, -2, -8, -4, 8, -13, 0, -6, -8, 4, -8, -24, 23, 18, -11, -12, -13, -6, -5, -5, 11, -24, 8, 0, 2, 8, -10, -10, 5, 7, 6, -1, -5, -17, 4, -15, -2, -21, 4, -6, 4, -4, 2, -8, 18, 14, -2, -7, 10, -15, 24, 6, -3, -27, 2, 3, 3, -6, -16, 1, -5, 1, 9, 8, 9, -3, 10, -21, 2, -11, -1, 0, 5, -34, 7, -1, 2, -18, 15, 3, -1, -18, -13, 0, 8, -10, 8, -4, -15, -10, -9, -19, 6, -3, 16, -12, -5, 6, 13, -3, 12, -6, 6, 9, 9, 9, 11, -18, 0, 2, 17]
-1.13821A7k7K9j9j%Jj2mJ5mj1J6lJ3%pn%Lj1J0LqJ2k0PkJ5oK0j7k5K7k%j2J2QKqoMoJ2j0QpToJ2
-1.16364@k1K1Pj6KqJ1j8K8kJ7k8L0k3j6lKK1j1J9j6j2MJ2KrJ5k3J6j9J0J1nJj2MJ0LJqpJ3K0k0
-1.18602Cj2Rj1J0KlJRj8J9j6RpnRPj9KJ4k3J6JLmj2M%J5kl2K3OjMj8J5%Rj8J6j3J7j0J3j9Nj5J3
-1.21044dmoK3Jj1%KrJ5jRpqNj8J5mj3J5%k2K2Kj7K9k9J0NrK4k4oJL4l0JOj5J7LjrqkJ2TPk8LTK6
-1.23639A7k1PqrOKnMTLmQj1k1RL6k3KOk1QPK4l0LmjJ5poRJlk0J8LmMlm%MoJ7j4ONMq%JlrKJ8qj0
-1.26538a0J8qj0TK4j0O%Lj3J1ojJ6k0J5nqlPkj9J5J8pJkTjTQkmlqK2rMj7QMRj5J4pJ0rJmkKkMQ
-1.29285Hk2J2KOk3MJ9JqmJ1qJRqJj%jj0PK6j7nj2nJ0j1K7j7jJJ3K1l3RJ0k9J5pJnK0j0J1j5RkKo
-1.31829djoRK2l3K0j7NRj2J2kJ4k6J8Kj6QkJ0k2J7oQp%k3K0J0k1J8oTpLPJ5j5K0kj3j9K2Npj3RJ
$$ y = [17, -10, 19, 0, -1, -1, 0, -12, -16, -1, -5, -16, 0, -3, 10, 10, 3, -2, -2, 1, -10, 0, 3, -5, 7, -13, -6, -8, 7, 1, 21, 4, -21, 6, 4, 4, -8, 4, 12, 14, 6, 0, 4, -2, 10, 0, 8, 1, -6, -12, 0, -21, 0, 7, -9, -7, -15, -4, -22, 6, 4, 21, -7, 23, 0, -16, -19, -17, 4, -7, 12, -4, -16, -12, 0, 2, -7, 8, -15, 1, -18, -8, 3, -2, -1, -13, -9, 1, 4, 5, -3, -10, 3, 23, 3, -9, 0, -11, -1, 1, -2, -1, 8, -10, 9, -7, 2, -5, -10, -1, 6, -13, -11, 3, -20, -4, -3, 0, -4, -16, -12, -12, 3, 1, -31, -8, -2, -3, 1, -17, -2, -2, 7, -11, 5, -8, 9, -1, 12, -7, -2, -17, -4, -8, -14, 9, 10, -1, -1, 1, -8, 7, 6, 15, 8, 0, 5, -13, 2, -2, -15, 0, 0, -22, 0, 2, -15, 14, -15, -5, 0, -9, 15, -9, -15, -14, 20, -10, -9, -3, -18, -1, 2, 1, -8, -16, -18, -6, 6, 13, -15, -12, -9, 17, -4, 3, -5, -14, -8, -6, -11, -7, -3, 0, -4, 4, -7, -28, -19, 17, -6, -4, 2, -19, -11, -4, 20, -10, -7, -11, -12, 3, -4, -10, -1, 0, -3, -23, -5, -2, -6, -2, -5, -9, -9, -5, -11, 6, -8, -2, 3, 7, -1, -1, 0, -3, -12, -10, 8, 0, -10, 8, 0, -10, -20, 4, -6, 0, 0, 3, -10, 1, -5, -6, 10, -10, 5, 0, -8, -11, -4, -6, -25, -10, 8, 1, 2, 0, -2, -3, -4, 4, 2, -2, -5, -13, 9, 0, 4, -13, -5, -1, 8, -7, 7, 0, 10, 1, 2, -2, -4, -2, -4, 0, 8, -14, -2, 0, 6, -17, -13, 6, 7, -1, -5, 6, -2, -1, 8, 0, 1, 0, 0, -1, -11, -4, 22, 5, 0, -12, -17, -7, -18, 9, -8, -9, -8, 5, 26, -7, 2, 12, -17, -2, -9, -8, -13, 7, -3, 8, -7, 2, 0, 2, -4, -5, -11, -2, 20, -13, 7, -10, -5, 4, -8, 4, 2, 16, -10, 8, 10, -6, 2, 0, 10, -12, 5, -1, 7, 0, 0, -23, -3, 7, -14, 4, -2, -8, -15, -12, -5, 10, -5, 15, 13, 0, -19, 3, 8, 1, -12, -3, -2]
-1.34271bJ0j0Pk3J5Lj6K3J1qj2MqJ3k3K1j6J7olQTj3k0L0j1Pk8L2k4PORok2J7mJ8l2K9j3J3j1j
-1.36509dj0J4Oj1%LNj8J7NkLk1J8jqJ1j4K7j6oJ2nrQj1J7ok1J1pJ9j9J3rJ6%j5Qk0J5Qj6RmLmJ6
-1.38951GnTjJ5l4K3opJ0LQJPj8L5n8K6rQj2K9k4Pj0J2mPNTl1Oj0L1j7kJLkj4J4LlKkRj4J1PkLj5
-1.41545gK%pJ2MJ4k2Nj7K8k2J6J0Kl2J1pNJ1j4J2mlOMmrjJ0j1Qj8QJjJ4j4j1J7%Qj1kMJ0Jj0OP
-1.44038Ij9J0oKrnJ8%Nj0MkqJ4oTKk1J6LTJ7j0mQj6Lj3PL1j7%j2RoJ3Tl7K8j1rJ2%J3k1JjOj2K5
-1.46582A1k4J3J4k3qJ1OKOj4MRk9K3J0j1jJ%KJ1rj0Lj6K5j2J0mJ4kj5J3j5%oj2J7pJ3%mMmJ3j1j
-1.48972cPj2J7lpj8J1J2nJj1LRmjJ1%j2JPqkPrJ1J4k8J6lJ4j9Pk7K2JKJ2qjoQj1J5Kk2K4k5J6j7
-1.51465a2LKJ3oOTk0mJ2J8j2mj3J6qNj3J5j7J0j5K6j9J7k%Qk4J6Oj0jJ1j5J1kOj7PLqRj6J2Mj9
$$ y = [-2, 8, -2, 5, -18, -3, 0, -16, 7, 18, 10, -2, 2, -6, 7, -16, 5, -11, 6, 0, -3, 5, 13, 0, -20, 10, -1, 6, -22, 10, -14, -7, -1, 8, 2, -20, -3, -7, 11, -21, 8, -5, 8, -3, -4, -14, 0, 6, -5, -5, -2, 3, -15, 2, 7, 5, 8, -13, 5, 4, -4, 7, -7, 20, 4, -2, 10, 5, -4, 4, -7, 10, 4, -17, -6, -13, 6, -13, 0, -9, 7, 7, -8, 0, -20, -5, 3, -13, -4, -8, -5, -9, 7, 2, -3, -4, 11, -23, 0, -6, -13, -3, 0, 8, 9, 16, -2, 33, -25, 1, -8, 0, -12, 17, -7, 0, -10, 2, -2, 5, 10, 15, -16, -10, -20, 11, -6, -8, -7, -4, -6, -20, -6, -3, -6, -4, -6, 3, -11, 0, 7, 5, 8, -7, -5, -5, -12, 0, 4, 18, -4, 1, -16, 12, -10, 6, 16, 18, -14, -3, -10, -5, 6, -8, 4, 0, -3, 3, 7, 3, -6, -7, 3, -8, 0, -18, -10, -9, -10, 4, -10, -21, -4, -4, 4, -7, -9, -5, 5, 6, -4, 2, 9, -10, 0, -6, -4, -13, -18, 0, 0, 5, -5, -1, -3, -11, 3, -3, -9, -7, -28, -12, -9, -6, 11, 1, -3, 5, -11, -8, -21, -14, 17, 0, 0, -12, -3, -9, 4, 17, -20, 8, -3, -12, 0, 0, 13, -8, -7, -8, -2, -14, 11, -13, 0, 14, -9, -17, -6, 0, 2, 8, -6, -2, 7, -22, 1, 11, 0, -1, 0, 0, 2, 13, 4, -6, -3, -19, 6, -6, 4, 0, 14, 12, -3, 10, -5, -5, -11, -23, -6, -13, 0, 0, -4, 0, -4, 9, -2, -3, 4, -8, 9, 6, -1, -19, -8, 4, -1, 0, -11, -8, 1, -3, -4, 7, 7, -5, -4, 3, -5, -7, 0, -9, 2, 16, -12, 4, 1, 15, -4, 3, -24, -2, -1, 1, 13, 5, 4, -2, 6, -5, 10, 12, -10, 14, -11, 5, -12, -9, -7, 6, 0, 6, 12, -8, -12, 0, 18, 6, 2, -11, 5, -3, 2, -11, 4, -13, -3, -18, 8, -11, 6, 4, 4, 12, -12, 4, 10, 0, -1, 10, -5, 6, 4, 10, -7, 0, 3, -5, 4, -12, 0, 4, -15]
-1.53805a5J7Nj3J6k%j3%KJ5j8LKoKPJLJ3j2Jok1J7lkk1K8JpPj5J1pJ4j3K5m0K4jRj7RJlMjj3Rnk
-1.56400a0J6j8O%NJ2rQnQj0lJL%J2j9lj3J9%J1j1%j7J1Rk7J9JJ7jl2jJ8kJ3j3J6k7J6j0mKK3pM
-1.58791Hj4qJ4Nj6J7k2J6JLj4J2JlLJ2j9nJ9j4J8j6kPnJ1k0J3nlTK2lnj9K5qj5j1J1J4k0J5Jrn
-1.61131a6J8j1KRJnPJj6K0j1J2k5QlLmJ3nNkPknmlRJ5j5jNk1K5oNj8J2%LOj6TJ1JoK1k0QJ0lnqO
-1.63827dkRj9K5l4L0j1qJ4ToJ1k0Mj6K0j5%KJ7noLj2KkOPj9QJ0pMpkKPj3J8k0L3j6Qj3j2K7k5K6
-1.66269A3j3K2m0J8j%k2K9r%jMQk9J8J1j5PlJ0Qpk5J8kJ1k6K9l1K8j0K2m1K2K4l6M%K3j4KoK1k2
-1.68507apPmnJ7j1jknJ2j0J0j9J0kK0k3lQJ3nKnpJ8k1L6k4MKj3J6Plj1J8j6nJ5j6kJQjj3Pml%NO
-1.71101@j5%K0J5k4KrNTJj4PmJ1LJ4m8M8k2QonJ2%rPJ2j4TNqLOJ0lOpK4k8PqK2l1J5Pj9J4j2J6
$$ y = [-15, 2, 7, -6, 10, 8, 8, -5, -5, -3, 12, -6, -3, -1, -7, -5, 2, 3, 6, 19, 7, 8, 2, -19, -2, -5, -7, -28, 0, 1, -6, 1, -14, -3, -10, 4, -9, 16, -24, 0, -1, 8, -9, 0, 1, -2, 2, 1, -12, -3, -8, -10, 6, -12, -6, -6, -1, 11, 2, 10, 5, 13, 3, 0, 1, 4, 4, 16, -3, -6, -19, 0, 0, 11, 0, 0, -17, -6, 3, -24, -5, -4, 13, 12, -20, -21, -3, -5, 8, -5, 11, -16, 0, -10, -14, -12, 11, 4, 8, -6, -14, 0, 5, -11, 6, -16, 0, 1, 4, -10, 2, 3, 0, 3, 15, -4, -9, 10, -4, 14, -2, -4, 3, -2, 9, -11, 2, -3, -6, -9, 13, 10, 5, -14, 11, 3, -12, -23, -12, 2, -18, -3, -2, -11, -16, 2, -9, -7, 2, 3, -2, 5, 6, -10, 10, -1, 11, -14, -6, -9, -6, -10, 3, -2, 3, 1, 8, 6, 1, -3, -6, 3, 18, 3, 2, 7, -14, 11, 5, 10, -8, 4, 4, 7, 13, -3, -19, -8, -7, -13, 8, -12, -4, 6, 3, -2, -10, -4, -6, 3, -16, 9, -25, 5, -6, -14, 0, 14, 8, 19, -1, 3, -13, 7, -8, -8, -6, 11, 6, 0, 3, -9, -7, -9, -3, 4, -15, -7, 3, -4, 0, -7, -9, -7, 0, -13, 5, -15, 18, 2, 10, -3, -15, 12, -13, 13, 0, 22, -18, 0, -1, -1, -23, 6, -3, -3, -4, 0, 8, -21, -3, 8, -7, 0, -3, 7, 15, 8, -17, 1, -1, 10, -16, 13, -18, 10, 0, 22, -19, 3, 27, -9, -5, -5, 18, 4, 6, 0, 21, -1, -8, -1, -5, -10, 7, -4, -5, -7, -12, 0, -10, 0, -19, -9, -11, 9, -14, -17, -9, 4, -1, 1, -4, -11, 7, -14, 22, -2, 2, 4, -9, 7, 14, 11, 0, 18, 2, -3, 12, -4, -6, -5, 3, 2, -11, -4, -8, -11, -11, -6, 0, -15, -15, 5, 20, -4, -2, -11, -6, -1, 0, -14, -7, -11, 0, 3, 17, -31, 17, -5, 3, -3, -8, 4, 4, -5, 2, 14, 0, -14, -9, -17, -14, -8, 2, -1, 5, -2, 22, -6, 1, -7, 15, -16, -1, 6, -13, 1, -11, 5]
-1.73594Ek6J6NQj3jL6l5RmJoJ%jJ4mqj2K7Kj2LJj4J3%Nnk6K5j0OKmjJPlJ4j2Rj1j3J2j9K2Ml0L3
-1.76138A1j9qRTLJ4l2JJ5j3K0mprqJ2OoK5l8K2KNqRj0J1j6KMlJ1j0jnJ5kroK0j4Mj3jPK3k5J4%
-1.78630Gk5K1Jk3J2LRj7J2J7j4lj1jJ3NjoLqKnK0Mk3J2j2Mj0K1ok0J7kQoJ2j9R%Pj4Pj4K0o%j1
-1.81072a1J3Olj9J0J1l1L4k8J5RMQor%nOj9L4j8NQOk7J2nJ0j9K1pqJ1rOj8J6%J1J0jk5QMj0Qokm
-1.83565dkTRqJ2j3PNQk7J8kj0RQ%k3%K4J4k0pnkPJ2kojMJ5k4J9j7PqKjJ2j0KLojlJ4j4J1r%J2k1
-1.86210a4J4j1L2k5J2k2JK2%lj8K0pJ3k1J9k9K9j3J0jj8LPKJ8rj1J0%k7J9pK3m1L0oj3L1k1pNRk
-1.88448CLj0J6pj0oK0k8K8mj7J2LKTOj9PJk%MJk5K2pqJ3j7K1LjlknK2k0J6j1rJ4rK%lkMmJ0Jl%o
-1.91145bOQoKj0roJ7j2K2k5J5j2J3njJ2j3OLPj6J3pJ7j7Nj6LmJ0QJ1k1oJ9%kj9J4nkmJ2jNj9J4
$$ y = [5, -21, -5, 0, 8, -5, -6, 30, -5, 4, 0, 1, -5, -4, -4, -5, 9, 5, -3, -15, 12, 14, 2, 5, 6, -8, 5, 5, 10, 5, -21, 4, -6, 0, 2, -2, -3, -2, 5, 2, 16, 4, 13, 2, -11, 1, -18, 4, 8, -22, 11, -8, -16, -7, 2, 5, 19, -13, -12, 3, -10, 10, 6, -1, -10, -18, -6, 0, -6, 19, -19, 3, 5, 10, 2, 11, 1, 12, -4, -2, 2, -1, 10, 0, -1, -6, 9, 7, -2, -8, 12, -2, 2, -11, -12, -5, 18, -7, 7, 7, -18, 3, 4, -19, -7, -4, 5, -12, 0, 17, 3, 0, -11, -12, 1, 6, 5, -1, 2, -6, -4, -9, 11, 15, -8, 4, -8, -4, -14, 7, 1, -19, -2, -4, 4, -2, 10, -9, 0, 0, 7, -7, 0, -14, 6, 0, 0, -11, 2, 8, 5, -14, -4, 7, -24, 10, -18, -3, 6, 10, 18, 12, 3, 3, -2, 4, -15, 19, 1, 6, 14, 20, -7, 5, 0, 10, -9, 12, 5, -3, 8, -1, 5, -13, 3, 3, 14, 24, 23, -2, 6, 10, 0, 8, 2, 0, -4, -6, -8, 1, -7, 5, -8, -1, 4, 12, -15, 3, 1, -9, 0, 8, 8, -15, -15, 9, 23, 3, -4, -9, -11, -4, 8, 6, 0, -1, 3, 18, -6, 13, -4, 3, -5, -3, -4, 8, -2, 0, 3, -3, -4, -7, 7, -7, 4, -5, -5, 7, -14, 0, -11, 21, -4, 8, -14, -13, 9, 9, 6, -12, 8, 1, 14, -7, 12, -17, 12, -1, 9, 8, -10, -7, 0, 2, 20, 11, 0, 10, 10, -17, 2, -5, 18, -23, 7, 1, -12, 19, -2, -9, -4, 5, 3, 6, -4, 12, 5, -5, -11, 9, -19, 9, 5, -12, 0, 3, 5, 7, 13, -6, 1, 2, 0, 0, 4, 5, -20, 2, -5, -13, 0, -17, 4, 7, 6, 3, 1, -4, 18, -2, 14, 3, -6, 8, -1, 1, 1, -2, -4, 0, -4, 6, 7, 4, 4, -2, 4, 12, 6, 8, -2, -11, -17, 0, -12, 10, -15, 0, -12, 1, -4, -5, 7, -6, 0, 3, 10, -6, 7, 0, 17, 0, 5, -11, -8, -12, -2, 6, 17, -4, -10, 9, 9, 7, -12, 2, -3, -5, -9, 3, 2, 7, -12, 2]
-1.93586BJ0k2K2j2kj4J4PopJ9rQj0Mj3J1qJ1k0J2JpQK1k6OpJ3k5K4j7K5mj2J6j9OKmkLkrK1j8K2
-1.95977A3j5%J6jj7j1L4k7J5j4K0k0j4L0k1K1j3MmJmqJ5nMJ6k7J0jJ2mkj5J6oTJ6j5j2QK8k2QMn
-1.98267Bpj4J7J0JKj1QlMjk2L1l2K6j6PmKJ1j4kJ5k2KJ9J6l7J2kRj0mK2k7K0JqLj3oj2K7rLmJ5p
-2.00708bMnkLTj0J8oJ8j5opJ8Nk7K1j8j0L1j3mMNj3lRNjpJ6Kj7MRj4J4j4mTL0j9j5KJ4Pk2PJ6q
-2.03201aJ3k0K4j6KJ5j8j0OJ0mkqNj0L8k8J4lm%kJ1k0K2k3J0j3M4k1j2k0K3jLj6K1k6K8j5nJ2j9
-2.05389a6J6j4K6j2qQKnmj8L1rpL%J2qOj1J2j9J6qrK3j9J1k3MTQmMK0rlTLJ2k9J6%Qk4K3j2kKk
-2.07881hJ9k9J8nK6k0jRkOj7%Jjj2J9qmK3lmj7K1k1KJ2J4k5MPJ3j3pL%Pj6J0jmJ1k1J5LmJJ8k2L
-2.10374@J4k2Nj3K2j3J6rj6Qj0J9J8k1J1KpOk6%RQplK6k7LpL8j2mjj0lOj2MPj3OJ6qPj8J8j4PkK
$$ y = [2, 12, -10, 12, 0, -2, -16, -2, 5, -1, -8, 11, 2, 10, 0, 4, -9, 2, -6, 5, -15, -3, -2, -9, -1, 20, -6, 0, -7, 6, -19, 5, -12, 13, 9, -3, 13, -6, 0, 2, -2, -4, -1, -3, -12, 9, -9, 13, -2, -2, 14, 13, -4, -15, 19, -8, 7, -7, 13, -7, -21, 9, -12, 9, -4, 0, -4, -3, -7, -15, 0, -5, -1, 15, -12, -2, -3, 9, 5, 3, -12, 4, -2, -8, 8, -7, -19, -11, 17, -5, 3, 7, 2, -5, -19, -2, 8, 9, 11, 0, 8, 5, 9, 8, -14, 17, -15, 11, -5, 2, -2, 0, 11, -3, -5, 10, -12, -10, 9, 25, -12, 0, -2, 7, -3, -7, 15, -12, 8, 9, 1, 4, -9, -15, -27, 0, -9, -6, -10, 5, -2, 2, -3, -5, -2, 1, -9, 9, 3, 21, 6, 0, -7, 11, 16, -11, 10, -8, -18, 13, 0, -4, 0, 5, -8, -11, -2, 3, 2, -5, 11, 13, -4, 0, 9, -5, 9, -5, -9, -13, 17, -2, -17, -15, -1, 6, -16, -9, 7, -1, 12, -8, 16, 0, 2, 17, -1, -11, -5, 5, 1, -1, -9, -4, -14, 24, -4, 10, 7, 3, 3, 1, 12, -8, 14, -9, 1, -12, 32, 11, -1, -21, 2, 1, 4, -12, 9, -17, 11, -4, -9, 3, -16, 0, -14, 12, 0, -8, 0, 2, -3, -7, -25, 6, -3, -10, -7, -7, 5, -3, 3, -8, 4, -15, 1, -7, -16, 7, -12, -1, -24, -20, -16, -8, -12, -8, 12, 3, 0, -3, 0, 12, -17, -1, -1, 7, -17, 6, -6, -8, -6, -8, 11, -18, 0, -5, 21, 1, 0, 9, 7, 13, -4, -4, -3, -4, -16, 3, -5, -9, 14, 11, 7, -10, 11, -10, -8, 4, 18, -7, -3, 4, 17, 4, -3, 0, 0, 7, -9, 1, 0, -4, 7, -14, 1, 4, 0, 1, 19, -3, 0, 14, -8, -3, -16, 6, -7, 9, 0, -16, -8, -18, 1, 19, -2, 9, 11, 4, 10, -16, -16, -7, 1, -6, -9, 17, -10, -7, -14, 24, 12, 8, 7, -3, -6, 0, -12, -8, -1, -14, -8, 8, 0, 7, -11, 7, -7, 0, -2, 0]
-2.12867@j4jK8k0J3J6j1oj7J9Oj3J4k1p%RJOqlJ0jPj4NJj1K0qj6J9Jk6K6%jrkJ5j3PoKlKJ0kmRn
-2.15461DJ0k2j2K6onoQLMkjj4K1qNnL0k3Kj6J0Jj2J1nmJ9mknj6J7Mj0oNJ6j9J9j1MjqRPj0ROj3
-2.18005Dj2J4mKjLJ2k2QoOnJ2lj5J8qJ3k1j6K2qQNpj5J6J1oj5LL2pj2j0NJRl%qJj0J0j9L0j6J2o
-2.20497BJ3l5K3j8J4l%jRnLKj2%J6Lj5Qp%QkJj8J2kK5j6Nj0k%Opjj2K2j0Q%oOKLj2J0j0R%Kk0J8
-2.23143Flj1M%qJ6KJ1k0NJ3j5%TQj4QTj0Rloj1J8%Nj9lNTkKPq%RmTj1J9k6K1mJ3j4jj1J2RoRj5P
-2.25839BJ0j2J3m0M3j9J6rNj5Oj6J3lK7k9J0j5J3Lj3J9okoJ2j1NlMoK1j7nJ1lJk1K9jmoj8K5qR
-2.28179Ik2J8kT%K0j5Mj8NPj1Kj1J5K3j6Kj3PKk1J9jloJPlMqQPorJOJ0Mk0K1l6K5ojRoK2k5OqNR
-2.30875IrJ1j2oK0j0Jm%J0k0NJ8j3j6J6Njj3J1MqPj8J2jPQJTj4Mjmj9K2qQOjk0OJJ8kj8J0j7K3
$$ y = [0, -14, -15, 13, -7, 6, 22, 11, 5, -12, 7, 13, 0, 14, -7, -14, -14, -5, -4, 2, -6, -9, 1, 0, 7, -7, -2, -1, -12, 8, 0, -16, 3, 4, -22, 4, 4, 3, -6, -8, 7, -6, 1, -5, -3, -6, -4, 6, 4, 0, 9, 4, 14, -8, -20, 6, 0, -5, -11, -3, 0, 4, 2, 1, -13, 8, 0, 5, 0, 30, 7, 9, -7, 3, 4, -8, 3, -2, -6, 13, 9, 7, 2, -14, 3, 7, -3, -9, -4, 12, -7, 12, 1, 5, 4, -4, 5, 12, 2, 11, 17, 4, -8, 6, 2, 4, 3, 6, 18, -4, 4, -2, 4, -1, 11, 8, -7, 11, 3, 16, -5, -21, 1, -7, 1, 6, -1, -16, 0, 11, 5, -10, -7, 25, 18, 6, -4, 1, 2, 11, 8, 8, 0, 1, -9, 1, -18, 12, -4, 8, 2, 15, -20, 3, -15, -1, -4, -4, -5, 4, -1, 2, 4, -8, -8, 8, 11, -4, 4, -3, -3, 5, 3, 4, -14, -2, -4, 21, 5, 10, 0, -2, -2, 4, -3, -4, -16, 6, -4, 4, 4, -2, 4, 6, 9, -3, 7, -3, 6, 6, 8, -12, 6, 3, -8, -4, -4, -12, 4, 6, 17, -3, 2, 15, 0, 0, 0, 8, -6, 2, 10, 0, 9, 6, 0, -11, 7, 7, 12, -7, -10, -5, 0, -2, 0, 7, -1, -1, 8, 4, 0, -11, 8, -18, 3, -1, 12, -2, -3, -14, -2, 7, 1, 10, -5, 2, 12, 0, 13, -27, 16, -3, 13, 4, 9, -6, 0, -16, -3, -6, 21, -8, 2, -13, 0, 3, -10, 9, 3, 1, -5, 7, -4, 1, -2, 2, -4, 17, 0, -5, 6, 3, 4, -17, 12, 11, 7, 1, -17, 8, 0, 9, -13, 5, 3, 1, 1, 21, 6, 10, -8, -3, 4, -7, -5, -16, -1, 22, 6, 8, -5, 2, 4, -17, 2, 1, -2, -8, -7, 0, -3, 1, -7, 1, 8, 2, -7, -6, 0, 10, 14, -6, 15, -21, 4, -2, -3, 6, 0, 22, -3, 3, -5, 0, 9, 0, 11, -1, -7, 13, 3, 4, 0, 0, 10, -10, -5, 13, 0, -16, 0, 5, 4, -9, 2, 6, -2, 5, -13, -1, -2, 5, 13, 14, 15, 1, 5, 4, 0, -19, 3, -5, 3, 9, 8, -12, -6, -5, 13, 11, -7, 3, -14, 9]
-2.33368Ij1lJ1pQMNl1L1k2J6Nj7j6J8Pm%mJ7pMk0J0mRj5J5j0NJkj5J5KlJqLrJ7j4MJpJ3Pk2NJ9
-2.35911A1j0J4j1qlJ4j6PLkj3K6j2J3rk4J6mTQRkQl1J6K0j1k4K8j6K0k3J0J2kTlj7L0j2Kj7PQlr
-2.38251fQlJTOPJ3k8POlnkJ2noj6M3m5K6l1K8oJJ0l0J0%K1j2NkLj2Lj1PQpoOMJ6oj8NlPNjTqJon
-2.41049a4K4J7k3j4J4oJ6k0J5k2L1j5j1J5%k2J3kJ0koKMj2OK1j1pjKJ3j7Jj0J1%J0j1j0K9pnLj2
-2.43288coQnJjnK8k6QrJ6j4PK4j1k1J9k5J3KoPNJ3j9jj1J6NJj1Rj7K3j3oj4K0J2j7K0j6%LJKOj2
-2.45729@J0jj0J0jK6k8qoL4k4lJ9j8J7k7J3QjK0j8rlkMk1K0%J1k1K5poKTmJNJj0JqNJ1nTmj0J1
-2.48222dJ0mj6RN%PJj2LJ5j3N%j4MJ6j5RQqTJ7j2kj3J0mrJ0nJ0K1j6J4j0K1k5Rk3j0J5j1K1j0K2
-2.50562A8l1J9oPj0J4mj4KK3j1j5J2qJ9k1J2NJj0k5J3LJ4k0K4j4Rk9N2k8K9l5J9oqj0JJ1%pOK6
$$ y = [9, -2, -5, 6, -1, 7, 11, 16, -15, 16, -6, 10, 15, -2, -18, 0, 7, 3, 3, -1, 16, 9, 13, -7, 3, -1, 8, -7, 8, -2, 3, 4, 2, -13, 2, 4, 1, 2, -6, -3, -12, 5, -9, -5, -4, -11, 2, 9, -13, -8, 11, 1, 15, 4, -4, -7, 7, -9, -2, 1, -1, -14, 12, 0, 13, 4, -20, -4, -8, -12, -4, 5, 3, 11, -20, -4, 16, 5, -19, 9, -7, 13, -10, 0, 12, 10, 8, 5, -12, 18, 6, 8, -9, -2, 6, 3, -6, 2, -1, 0, 1, 7, 14, 27, -1, 6, 12, 9, 4, 2, 14, 9, 3, -13, 30, -15, 11, -20, 8, 2, 3, 13, -17, -7, -7, 14, 2, 7, 5, 8, -4, -1, -12, -5, 3, -4, -10, -4, 0, 16, 10, -8, -3, -6, 1, 6, 5, 4, -4, -3, -9, -14, 10, 27, 4, -10, 4, -2, 14, -6, 9, -13, 18, 3, -8, 7, 7, -15, -2, -4, 6, 4, -2, 0, 4, -8, -2, 19, 8, 1, 0, 2, 15, -2, -1, -11, 0, 0, 10, -1, -11, 18, 11, 6, 9, -3, -9, -1, -6, -5, -6, -11, 17, -9, -1, -10, 6, -8, -1, 23, 12, -9, 10, -15, -2, 0, -6, 1, 6, 19, 0, -1, -12, 4, 9, 10, -1, 8, -9, 14, 1, -5, -19, 1, 13, -4, 16, 0, 0, 3, 4, 6, 12, 0, 10, 9, -1, 9, 8, 34, 6, -2, -8, 26, 2, -1, 18, 0, 17, -10, 3, 11, 10, 30, 12, 3, 0, -2, 2, -19, 1, 1, 12, -9, 16, 9, 3, 5, 7, 3, 4, 9, 10, 0, 1, -7, -2, 9, 4, -1, -5, -15, -4, 6, 2, -14, -5, 0, 0, 7, 8, -4, -1, 14, 1, 6, 6, -8, -4, 12, -3, 6, 14, 6, -2, 15, 3, 1, -12, -2, -6, -15, -5, -10, 0, 21, 5, 19, 9, 30, 5, 14, -9, -19, -4, -15, 6, -4, 18, -13, 6, 0, 7, -3, 11, 7, -7, -5, 18, 7, -8, 4, -4, 15, -6, 6, 11, 12, 2, -23, -10, -7, 7, -13, 11, -3, 6, -23, 29, 1, 30, -5, 14, 8, 0, -10, -9, 2, 2, -5, 1, 27]
-2.52750B7m3K4k6J9qQj4PL2l0J4%mPj3K4k2Ljpj0MQ%K8k8KN%j5J4nL0l3KRjJ2j1J1%j7jk2K7j5
-2.55090iJ5oJ3k0OJ0mLj4J1qNKk0L3l6K9kk3jJ1jOK0k2J8qRk7J6j9J4Qmk6JJ9J4k4RMJKj4RjJ3
-2.57481A2j1NpPJ2j0kjPk0K1l0J7kqJ6oPnJl%TnQj2J6lJj7RNJ5j2mjQOrprK0nK3m0L6k7%J6jrqr
-2.60177a5NJ3Kmk3K4pKPkRj4KMJK4j9Nj0%m%MKoJ8rl0K6KpoJ0Roj4PpPNrNj0J6Lj9K6k0J3pJ8j6k
-2.62873CJ3Tj5rTmJ3nJ2lplrK8j3Pj5KlmK1k7K1lJ0j2mK1rj0J2j5J2L%qK3m5K5j2JJ7j4J2pKoJ2
-2.65315A2j3PJ5k6J6j1NmJ3k1J5npMj0J6qK0j5MpJ2Qj4J1j7j6J9j3K1nj3J3pJ5qJ1j7MK4k4KpJ1
-2.67553A0j0mJ1j3N%j0j3L9j4K0k7J1oRQj8KK1m2L0j0J2j9L1k4RNTk2K4l1K1J3j5rJ5j4J4pjJ8k0
-2.69741DKNLqj3J1kJK0l2J5Jj5J4Kpj3MJKJ2%ko%lTJ6LKj7KjK1j2J1j8kRJJ2k4J4j4kK4j8QJpkU
$$ y = [27, -16, 8, -18, 1, -7, 1, -13, -6, 26, -4, 10, 10, 6, 13, 0, 24, 2, 5, 4, -3, -13, -9, -1, -1, 27, -1, 1, 6, 6, -9, 5, 0, 30, -3, -1, 8, 7, 19, 8, 19, 19, 2, 1, -21, 6, -9, 6, 0, 13, -7, -1, 9, 5, 8, -6, 5, -3, 2, 4, -16, 17, -19, 10, 8, -15, -16, -5, -6, 0, 20, -2, 16, 8, 17, -10, 6, -13, 1, 9, 5, -21, -20, -1, 13, -11, -2, 2, 3, 5, -9, 0, -1, 12, 1, 6, -1, 6, 18, 8, 6, 5, 12, -8, 13, -17, 0, -2, -10, 6, 0, 7, 2, 3, 0, 0, 0, -5, 3, -9, 7, 4, 5, -12, -3, 2, 17, 5, 1, 0, 8, 14, 5, -2, -11, 9, 4, 27, -13, 23, -4, -4, 12, 11, 2, -6, -15, -10, 3, 5, 1, -22, 2, -5, -3, 4, 2, 11, -3, -1, 3, 4, 28, 9, 14, 4, 4, 0, 0, 4, 6, 0, 18, 9, -21, 5, 7, 0, -6, 4, 13, 7, -7, 0, -7, 0, 5, -4, 1, -9, 7, 10, -9, 17, -3, 10, 3, 21, 5, 3, 16, 29, 14, 5, -4, -8, 5, 0, 12, 9, 2, -1, -10, 18, 5, 12, -3, -1, -4, -8, 13, -14, 7, 4, 14, 2, -2, 19, 10, 0, 12, -3, 9, 12, 12, 4, 27, -18, 7, -5, -4, 13, -1, 11, 4, 6, 0, 12, -1, 6, 21, -5, 11, 0, 5, 1, 14, -7, 8, 3, -4, 0, -10, 6, -2, 18, 3, 7, 0, 12, 20, 6, 17, 0, -16, 3, -10, 11, 6, -7, 6, -1, 14, 6, 17, 0, 4, 28, 4, 6, -1, 10, 0, -4, 7, -6, -1, -1, -11, -24, 15, 1, 21, -6, 5, -1, 8, 16, -2, 0, 21, -21, 9, -1, 11, -8, 23, -1, 8, 13, 18, -4, 20, -11, 10, 23, 8, -1, 14, 0, 14, 7, 6, 24, 4, 6, 11, 14, 6, -7, 4, 2, 3, 23, -9, 6, 7, -8, 6, 8, 1, -12, -8, -7, -5, 7, 7, 5, -1, -1, -4, -7, 9, 12, 14, -3, -1, -2, 19, 7, 18, 0, -2, 7, 8, 20, -4, 10, -4, -6, 18, 0, 8, 9, 2, 0, -2, -4]
-2.72437dJ0L4l2Rl4K5j6K6j1kT%J1k0QmL%K1k2jj5K8kmlPj5J1qOJ9rMj8J5j8j0M1l4K2ro%J4j0J0
-2.74828A5k1K3nk0J7rJj6J2RLl2K3mK1l4K3j1J6j0J1qk4L7j8LjlOJ3pJ%j1Nj0K0k4KRJ3j6RJj4M
-2.77168aJ4lTJ1j5pJ6Pj4j2J0MmlKOJ4k2QNrJ3k8K2%mQj6J3j3LoJ8j4Rj4K5j6%TmLJ2k1mRj1J7j4
-2.79660iJ0J1Rj9kLPj0nK3j6Nj1K1k2J7nj4MjJ6Lj7j5J9J2qPnrK4l5K9j9J2mJ2j8RrJJ1k3PRJ6j0
-2.82051A1rjnN%J0Mj4J5j9J7j7J0j7K1pmTJ0k3J9JjpnLJ6k3MJ2Qj0JLQmLJj3J0rPJ4k3OkojK2j7
-2.84595@J4j5%L%QMk8J1K8k8J6nj1rK2j2Qk4K6qJJ3j0J3lj1RK0k9QKj3mJ7k3K7k0K3l0K5njj1Qj6
-2.86935a0L8l9K2mPpj8K0JqJ9Jpk0K6j1j5J1Nj1oJ9rJ0nj3RQKj3LJ5koK%k3OJ2LomP%rRqJK%j9K0
-2.89580ErjJ8rMk3J8QmLj4J0qJ4pk7L2kqK0k8J6okPLqoJ5qLj3J3J1pjMqKjoJ2j2K3k5J5nJ7l5K9
$$ y = [-4, 6, 40, 8, 17, -17, 8, -8, 18, 7, 5, 3, 3, 14, -6, 2, -2, 1, 1, 22, 0, -1, -16, 12, 10, 6, 3, 10, -5, 6, -2, 4, 23, 14, 18, 0, 15, -3, -13, 28, -6, 16, 7, 1, 1, 15, 5, 15, -6, 17, 12, -8, 9, 0, 1, -15, -3, 6, 9, -23, 0, -4, 17, -17, 6, -5, 11, 1, 12, 4, -20, 17, -1, 2, 1, -2, 4, 17, 10, 11, 11, 0, 5, -5, 15, -9, -7, 2, 15, -1, 8, 9, -5, -1, 13, 10, 7, 18, 3, -4, 12, 19, 5, -7, 3, 7, 3, 0, 2, 8, 22, 0, 8, 13, 4, 17, -11, 11, 11, 7, 15, -1, 12, -1, 2, -4, 14, 0, 9, -5, 20, 4, 4, 4, 0, 3, 15, -6, -10, -1, -12, 5, -9, 1, 12, 21, 2, 0, 3, 10, 0, -5, 18, 2, 7, -4, 17, -5, 12, 7, -7, -3, -4, 12, 15, -2, -17, 2, 14, 6, 13, 8, -1, 23, -12, 17, -2, 10, 6, 18, 0, 9, 0, 1, 12, -11, -4, 5, 21, 11, 2, 1, -4, 1, 1, 11, 15, 1, 16, -3, 14, -3, 7, -10, 11, 4, 0, -4, 6, -17, 2, 3, 2, -5, -10, -7, 9, -14, -10, 2, 10, 0, 1, 4, 12, 8, 11, 12, -1, 9, 0, 7, 21, -2, 4, 2, -4, -5, 17, 0, 14, -1, -1, 2, 2, 10, 14, -14, -3, 25, -3, 13, 8, -3, -12, 10, -2, 6, -18, 8, 0, 1, 14, 4, 17, 14, 3, 12, 32, 3, 11, 13, 0, -4, 13, -10, 17, -3, 20, -10, 15, 10, 9, -2, 6, -10, 28, -11, 11, 7, 14, 7, -11, 9, 10, 2, 21, 22, 15, -5, 21, 10, -5, 6, 11, 0, -6, 13, 4, 14, 9, -4, 5, 13, 15, 2, 5, 20, 18, 12, 14, 14, -9, -3, 9, 12, 6, 2, 9, 9, 0, 9, 1, 2, 4, 4, -15, 5, -4, -5, 13, 4, 8, -15, 3, 11, 7, 10, -4, 6, -2, 12, 5, -22, 10, 8, 0, 20, -8, 8, 2, 0, 7, 10, 2, -4, 11, 3, 6, -7, 6, 17, 10, 9, 13, 5, 7, 6, 0, 12, 0, 23, -2, 13, 8, 25, -10, 19]
-2.92124A9k3J2RoJ%j1Rj3J0K9nk7PqJ0n%J2j5j0J2Lj2RTj5KoQNj4PTkTJ9l0R%nJ0MkKjqK1pj0j9
-2.94718a1K2kk2M0l1J1k3L7j6j1lPJ4j4K0k6NQJ6qj6%PnJ2oKpJ6jj4mRJ0j7lJ5rK1nm0K9Nk1RMJ5
-2.97109A9k1J3k2L0j3JpqK4j4Rj1J8k1Jj7K4kQjnJ8qJjqKK1k0j2LOj3J2LkOo%rKpK7j2MlmlRj3K4
-2.99704B2j9JlJ3nKQj0K2k7J0Ljl%j8LRj7K6mj8KL6j4JqjJKQKj8%jj3K7j1MkJ0j5%TRj2kMnJ6Kn
-3.02349A1j0L0k2k1L4j0mj4Qj%RqJ9j7J9j7kpJ0NqLlNj%j1Oj0J3KOj4MRlTJ3kj9jJ7k5L1j6KUMl
-3.04943A2k9K6k5L0k8J6j4OLNJ2k5J8jQJ2k2JLqlLJ8lkJqJjJ%Jk%J3okTJj7J8LJ6k9QrkK4l2J9k0
-3.07538a1J5oK5k4J0rMTPq%jKRr%nMj0JJ7KJ2j2%oj9MOmKJRj3J6j2KNpJ4jmj6J2j1J8j2JJ1
$$ y = [19, -4, 8, 17, 11, 12, 12, 1, 10, -3, 7, 36, 31, 4, 11, 3, 13, 8, 8, 20, 5, -5, 7, 10, -2, 7, 16, 1, 3, -3, 5, 10, -4, 3, 10, 8, 6, 25, -5, 4, 4, -1, 9, 13, 11, 13, 12, 4, 25, 18, 8, -11, 11, 9, -13, 27, -4, 7, -16, 21, 5, -6, -9, -2, 12, -2, 18, -8, -3, 5, 21, 13, -3, -3, 4, -1, 11, 5, 7, 0, 16, 15, 1, -3, 6, 16, -1, -4, 11, 2, 23, 18, -22, 7, 12, -9, 0, 4, 19, -2, 11, -11, 19, 6, 7, 0, -8, 16, 2, 11, 0, 18, -3, -2, -19, 5, 3, 11, 10, 5, 23, 15, 16, 15, 7, 9, 30, 10, -2, 1, 7, -6, 6, 9, 7, 13, 7, 7, -2, 0, -7, 20, 8, 12, 9, 5, 2, 11, -2, 22, 3, 4, 1, 14, 9, 11, 19, 9, 31, 4, 14, 17, 16, 13, 13, -5, -2, 7, -10, 16, 12, -6, -4, 32, 18, 19, 11, 10, 11, 13, 21, 23, 5, 5, 4, -9, 18, 7, 11, 9, 19, 4, 4, 4, 13, 1, -1, 3, -2, 14, 16, 11, 1, 31, 9, -12, 22, 12, 8, -6, 2, 1, 1, 10, 2, 21, 4, 23, 6, 4, -3, 7, 12, 4, 7, 4, 9, 8, 8, -3, 3, -7, 6, 8, 14, 0, 4, 13, 10, 7, 20, 18, -1, -2, 15, -10, 21, 5, 7, 9, 11, 15, 12, -17, 9, -16, 14, -14, 2, -12, -6, -3, 2, 14, -11, 7, 6, 14, 26, 4, 5, 8, 0, -3, 0, 18, 15, 13, 14, 6, 7, 6, 7, 7, 8, 6, 6, 19, 13, 11, 9, 10, -7, 11, 14, 30, 1, 9, 0, -2, 22, -10, 9, -11, 4, -2, 23, -1, 9, 0, 4, 8, 15, 7, 7, 6, 8, 17, 8, 8, 3, 7, -3, -2, 15, 17, 29, 17, 17, 11, -8, -4, 2, -2, 0, 1, 10, -3, 13, 1, 3, 8, 1, 15, 14, 10, -6, 6, -5, 13, 1, 2, 13]
-3.10030A3    $$ checkpoint
##END=
