##TITLE= 2,6-Dihydro-2,5-dimethyl-1H-pyridazino[4,5-b]carbazol-1-one
##JCAMP-DX=   5.00   $$ Varian Associates, Inc., VNMR Software
$$ VNMR Version 5.1 Revision A, March 1, 1995
$$ Wed Jun  3 11:48:18 MET DST 1998
$$ svsj version 5.1, 97/1/14
##DATA TYPE=  NMR SPECTRUM
##DATA CLASS= XYDATA
##ORIGIN=     varian
##OWNER=      haider
##SPECTROMETER/DATA SYSTEM=   Varian UNITYplus-300
##.OBSERVE FREQUENCY= 299.9498529
##.OBSERVE NUCLEUS=   ^1H
##.SOLVENT REFERENCE= 2.490        $$ solvent=dmso
##.FIELD=             7.04         $$ Tesla
##.ACQUISITION TIME=  3.7376000    $$ seconds
##.AVERAGES=          32           $$ number of transients
##RESOLUTION=         0.153        $$ digital resolution in Hz
##.PHASE 0=           -36.6        $$ zero order phase correction (left edge)
##.PHASE 1=           0.011232     $$ first order phase correction, deg/Hz
##$REFERENCE_POINT=   929.936      $$ Referencing label
$$ Varian specific parameters
$$ --------------------------
##$acqstatus=    (0..1)  101 0
##$alfa=         19.9999923706     $$ usec
##$alock=        <n>
##$array=        <>
##$arraydim=     1
##$arrayelemts=  0
##$at=           3.7376
##$bs=           16
##$celem=        1
##$cp=           <y>
##$ct=           32
##$d1=           2                 $$ sec
##$d2=           0                 $$ sec
##$date=         <Oct 20 97>
##$dfrq=         299.9493529       $$ Hz
##$dm=           <nnn>
##$dmf=          200
##$dmm=          <c>
##$dn=           <H1>
##$dod=          0.00999999977648  $$ sec
##$dof=          0                 $$ Hz
##$dp=           <y>
##$dpwr=         30
##$exppath=      </export/home/varian/haider/vnmrsys/exp1/acqfil>
##$fb=           2800
##$file=         </export/home/varian/haider/jk6>
##$filter=       54.0999984741
##$fn1=          1024
##$gain=         48
##$homo=         <n>
##$hs=           <nn>
##$hst=          0.00800000037998  $$ sec
##$il=           <n>
##$in=           <n>
##$lb1=          0.318309992552
##$load=         <n>
##$loc=          0
##$math=         <f>
##$method=       <z1z2>
##$np=           37376
##$nt=           32
##$p1=           0                 $$ usec
##$pad=          0.5               $$ sec
##$parversion=   4.3
##$pmode=        <partial>
##$priority=     5
##$proc1=        <ft>
##$proc=         <ft>
##$pslabel=      <std1h>
##$pw90=         16.8              $$ usec
##$pw=           10                $$ usec
##$rfband=       <ch>
##$rof1=         10                $$ usec
##$rof2=         9.9999961853      $$ usec
##$seqfil=       <s2pul>
##$sfrq=         299.9498529
##$sn=           0
##$solvent=      <dmso>
##$ss=           0
##$sw=           5000
##$temp=         28
##$tin=          <n>
##$tn=           <H1>
##$tof=          500               $$ Hz
##$tpwr=         57
##$vtc=          25
##$vtwait=       300               $$ sec
##$wbs=          <>
##$werr=         <>
##$wexp=         <>
##$wnt=          <>
##$wshim=        <n>
##$wtfile1=      <>
##$wtfile=       <>
##$x1=           -103
##$x2y2=         327
##$x3=           123
##$xy=           335
##$xz2=          0
##$xz=           62
##$y1=           22
##$y3=           -133
##$yz2=          0
##$yz=           -40
##$z1=           -1904
##$z1c=          -85
##$z2=           -1250
##$z2c=          212
##$z2x2y2=       0
##$z2x3=         0
##$z2xy=         0
##$z2y3=         0
##$z3=           85
##$z3c=          0
##$z3x2y2=       0
##$z3x3=         0
##$z3x=          0
##$z3xy=         0
##$z3y3=         0
##$z3y=          0
##$z4=           -101
##$z4c=          0
##$z4x2y2=       0
##$z4x=          0
##$z4xy=         0
##$z4y=          0
##$z5=           0
##$z5x=          0
##$z5y=          0
##$z6=           0
##$z7=           0
##$z8=           0
##$zx2y2=        0
##$zx3=          0
##$zxy=          0
##$zy3=          0
##$rp=           19.5
##$lp=           -56.2
##$rfl=          1676.8
##$rfp=          746.9
##$axis=         <p>
##$sp=           -30.1
##$wp=           3779.3
##$cr=           1720.3
##$delta=        111.5
$$ End of Varian specific parameters
$$ ---------------------------------
$$ Y-values stored with standard (16-bit) integer precision
##DELTAX= -0.0005087113
##XUNITS=        PPM
##YUNITS=        ARBITRARY UNITS      $$ (mm on paper)
##XFACTOR= 1.0000000000
##YFACTOR=       0.004277384
##FIRSTX= 13.5686394668
##LASTX= -3.1003049043
##MAXY=          140.157041
##MINY=          -0.252366
##NPOINTS=       32768
##FIRSTY=        0.136876
##XYDATA=        (X++(Y..Y))
$$ [...]
11.88480B0J3mK5m7J7j2K7j8Jj2J5k1L8j9K9l9KJ1rLk1K4LPJ6k9lJ3JrLRk0J5MJ2j1j4j1KM0l7
11.86344A4K7k8LJ8NJ6l2L2l9Rj3K2OJk2k0K8j3K4%j1J8k3J2l1N6l1j0J6PjJ5k6TK2QTj7JQk0L7
11.84207E0Ok2J0J5rj0J3oj5K4j0%L4j0k8K3k7jNJ4Jj9J6K9pnj5K8j0j6j8O0j8k6J6LJ7k4L0j4
11.82172H4k6K6J6l1K6oj3%MJ0PrL4pn%j0M2l7L6j2k1L5Oj7KK4rJ7J8k3L3j4K1NPl2K6qJ4L6j5
11.80036B34K6kL8j3nK1K5J1pK6K0KM4J4j8L1O0j4L0J2M4M1L7K7N7JP5O2K0J10L3O9M9J05J14R1
11.78205A470J10J15J27J56J18J49J39J58J78J58J48J13J34J06M0J3Rk5q0r7j05j43j17j76j50
11.76933B548j37j86j32j62j00j57r3j35j16p7j00p4p9n4q3m3o6n7l6m5m8oo4Ro4k7Rnn5Ol6Kj6
11.75254C21Rn4j4jl2J5j2Rpj7J6l1Qm1MmK7m5J8k8K2k5J1nj5J6j9J2Ol7J2j8KkJqJ2n3K5L3rm2
$$ plain form
11.88480 20 33 29 54 7 24 12 39 21 22 10 25 4 42 23 52 13 15 26 17 20 -1 23 26 33 49 20 17 30 31 22 25 34 14 29 33 45 34 20 9 11 51 14
11.86344 14 41 13 16 34 39 55 23 55 16 25 12 34 40 41 19 -1 27 14 38 38 27 45 22 34 3 59 28 18 34 41 40 55 29 3 25 33 41 24 25 33 13 50
11.84207 50 56 34 44 59 50 40 53 47 32 56 46 46 80 70 42 65 38 37 42 56 57 38 54 83 76 71 56 84 74 58 40 100 82 56 72 75 92 68 98 84
11.82172 84 58 84 100 69 95 89 76 76 80 90 97 88 122 115 110 110 100 142 105 141 129 108 143 149 132 134 158 149 166 184 161 194 180 201 206 213 181 207 199 213 249 234
11.80036 234 260 258 296 283 278 299 324 335 328 354 374 376 420 434 416 447 507 493 523 535 579 620 657 684 741 742 817 879 899 1009 1042 1111 1160 1265 1379 1470
11.78205 1470 1580 1695 1822 1978 2096 2245 2384 2542 2720 2878 3026 3139 3273 3379 3419 3432 3441 3416 3336 3239 3134 2991 2874 2698 2548
11.76933 2548 2411 2225 2093 1931 1831 1674 1581 1446 1330 1253 1153 1079 1000 946 863 820 754 697 661 616 568 562 498 507 443 416 425 420 365 371 335 337 321
11.75254 321 330 276 262 261 229 244 232 241 234 217 233 202 210 169 173 169 196 151 169 141 163 138 149 144 129 145 126 138 144 107 119 101 103 101 102 94 106 53 78 111 102 60
11.73117F0J9K8k8j3RK1m5RmRM4l3pRjL1o1K8l4K0K9k7Mk3K4k9J9lJK8m1jK4KLm1K2%Jj8K4K0j2
11.70930F7orlj8N5n4J6jk3NK1k3K6Nj2J8j5mqPk0lN0k7mK4j5l7J1OJ1j4J4rJ3k4pL0roJ1j1J5O
11.68692D9k0J6j7J5K1l3K6j8npoJ2l3J7J6oJ9lNk2LK0k3J6k7jJ0Mj%J8qkl5L9j1NJ8k7%mJ9jl0
11.66453HK9l0L3l1M4l4J2j2lk3L3Jk3M2Nk8K2l7Pj4K3J1l0L7k4L0j3nrK6j9rQj9mJ9j7J2L0k5
11.64418B3j4j2N0l1L3m6K9k6J7K6m2L3j1K4k9j9K1OkKnk4K2k6L5Kk9L9j5kroL2nrk0JM0j4Kk7
11.62333A4J7mJ7l7NL4l1J8Rl2mPL0k4J3j2K9m1M0j9Rrk1J2j2K1j4j3K2mQoj4pMjL0l4L3Rm4J1Q
11.60145A7j2KLJ0RLl4K2l9K8j2rL3j0Nj3OJ3j9J6K6m5K8kl5L2Lk0j0J0mK9j6k1Pj0L6m0J6lK9
11.58060B9m1K5j5M2rk9k%J6KMkj8J7nPKk8L3ok5N2q1M8J5j1l4N9k6k3mL7k7J6Jj7mJ6j7J3K7k5
$$ plain form
11.73117 60 79 107 79 66 75 96 51 60 56 65 109 76 69 78 77 108 47 75 41 61 90 63 67 44 68 39 58 55 56 84 43 42 66 68 71 30 52 52 53 35 59 79 67
11.70930 67 61 52 49 31 86 32 48 47 24 29 50 27 53 58 46 64 49 45 37 44 24 21 71 44 40 64 49 12 23 29 40 26 40 31 44 20 13 43 34 28 39 28 43 49
11.68692 49 29 45 28 43 64 31 57 39 34 27 21 33 0 17 33 27 46 43 48 26 29 49 26 42 15 14 24 28 27 27 45 37 35 0 39 28 33 51 24 24 20 39 38 8
11.66453 8 37 7 40 9 53 19 31 19 16 -7 26 27 4 46 51 23 45 8 15 1 24 35 5 42 18 48 35 30 21 47 28 19 27 8 4 23 6 18 48 23
11.64418 23 9 -3 47 16 49 3 32 6 23 49 7 40 29 53 24 5 26 32 30 32 27 3 25 -1 34 36 7 46 31 29 20 14 46 41 32 12 13 53 39 41 14
11.62333 14 31 27 44 7 12 46 15 33 42 10 6 13 43 19 32 20 49 8 48 29 38 29 8 20 8 29 15 2 24 20 28 22 8 1 5 4 34 0 33 42 -2 9 17
11.60145 17 5 7 10 20 29 32 -2 20 -19 9 -3 -12 21 11 16 3 9 22 3 19 45 0 28 26 -9 23 26 6 -4 6 2 31 15 -6 1 -9 27 -13 3 0 29
11.58060 29 -12 13 -2 40 31 2 0 0 16 18 22 20 2 19 14 21 23 -5 28 22 -3 49 -32 16 31 20 -14 45 19 -4 -8 29 2 18 19 2 -2 14 -3 10 37 12
11.55923A2PorJJ6rJ8j9K1%k9K4qk2K0K1l8J%L7l2LK6k3j0J9k9J1K9j5OKl1J8mL4k6J1k4L6m6J2
11.53786Ek4K0PJ0lk0K4l9M0Qk2jPnJ0J3k7L6k7PLJ2m4J9Rj4nJ1J0oj4KJ2j8L7l8K6Pk4L4k4l7
11.51650b3J9J6Pk4J1Tnm1M4j1QpL1l4J6k2RMj1OJ4lnJ1nl1L7k9%J1MqkM3m7RK6l7L6ml7MJ8mJ1
11.49361A6Jl8K7k1L0Nk0%TPJ8mj8lJ7l1J7J0k3J9J0k8J1Rl3M0k5J1mj5J6j2J9j7K4Pj2j6J8J1n
11.47275A8rJ8%l1K4j2Rj7K2k9M0nJ2l7K9j8o%oJ0M2n4J2Jpl2K9jK2m0M5j5Lj3J5nJ7j1l5J9mO
11.45138Fj6J3K8m8M6l4PK3k4l0M8j7L2l0jkNJ6qRMqrj2J7kOk5J8j%j8K9k8K0jj3J0kk1LTJ2OK0
11.42849C1l7OJ0j1j3jJ0kK2j5J6j6M2o5L1j5K2j6Lj6K6j8J7j3L0j1pl8M8k1K0j7mMk5K1Tk6K4
11.40865A7j2lK3rl7J6M3k8j4JKnOnL5n4M5l0M2k8PNJKnk0L1k3J4mPk4J4l6J1L7j3OJj4NPMjmj
$$ plain form
11.55923 12 19 13 4 5 21 12 30 11 32 32 3 27 19 -3 17 38 0 1 1 38 6 9 35 12 2 21 -8 3 32 17 23 25 -6 12 8 42 16 27 3 39 -7 5
11.53786 5 -19 1 8 18 15 -5 19 -20 20 28 6 5 12 7 17 30 3 39 12 19 22 34 -10 9 18 4 -1 10 20 14 0 2 14 -4 33 -5 21 28 4 38 14 -23
11.51650 -23 -4 12 19 -5 6 17 12 -29 15 4 12 5 36 2 18 -4 5 9 -2 4 18 15 10 21 16 -15 22 -7 -7 4 8 0 -2 41 -6 3 29 -8 28 24 -13 -9 9 5 16
11.49361 16 17 -21 6 -15 15 20 0 0 0 7 25 21 3 0 17 -14 3 13 -10 9 19 -9 2 11 -22 18 -7 4 0 -15 1 -11 8 -9 15 22 10 -6 12 23 18
11.47275 18 9 27 27 -4 20 8 17 0 22 -7 33 28 40 3 32 14 8 8 2 12 54 0 12 13 6 -26 3 2 24 -16 29 14 17 4 19 14 31 20 -15 4 0 6
11.45138 6 -10 3 31 -17 29 -5 2 25 1 -29 19 2 34 4 3 1 6 22 14 23 27 19 10 -2 15 13 19 -6 12 11 11 -7 22 -6 14 13 0 10 8 -13 -10 -7 5 11 31
11.42849 31 -6 0 10 -1 -14 -15 -5 -7 15 0 16 0 42 -23 8 -7 15 -1 2 -14 12 -6 11 -2 28 17 10 -28 20 -1 19 2 -2 2 -23 -2 19 -7 17
11.40865 17 5 2 25 16 -21 -5 38 10 -4 -3 -1 -6 0 -5 30 -24 21 -9 33 5 12 17 18 20 15 -5 26 3 17 13 20 -4 10 -26 -15 22 9 15 16 2 7 14 18 17 13 12
11.38525A2m5Q2m4j0J9mOJk3nJ3QnK0Qk2j9J5jlJ8j3Rm1L2qOj7K8j2PK5m0J8l3L4k0NJ9l8J1K9
11.36388B2k3JJ9nLk1j2M1l3M0jo%k9J3oK4k2J3j8OlK6k4J4mm1M1j9J9pPrj8K9m5M5k7M2l8J7j8
11.34252gK0j3K6j7Qj2kK4lj7J4j8kJ5Pj6NQj0j1JpL7j7TJ5l3J5%J7pj7J7L1l7J7Mqj2J5J2k3OjT
11.31963Fj4J0J2K2l8rK3Kj8J5J2k3K4l2K4q%Pk0PkJ8rmj1j0M5j9J0J1Rm0J2J3l2J8k6L9l2K6j0
11.29877Hj3OK0j2J0j8RLj0lj3L0k7J6oJ6Lj8J2Oj4Jj6K3Lj4K4l6K4qoK3Mj5PKl1L0k5L2j8J2k1
11.27689@j8JM5j4Jj6K0%J4j9j4%MlOJ1nj6j5M2l8K5LoL0k9j7J5nK6k4K0j0pNJ2k4MJ6j4mj4QOJ
11.25400CRk%j4J8kLqRk0L8l1K9m3M7j8TJ0l0M2jj5K2j8j4K1m7M5Nk1Lj4M0n9M9l3M1j8J4Rm2L3
11.23264B2j5j8PK2k0rM2l3K8k5K7m0K8k1j3MJ7J1j3lJ7j5J7l8N7o2L3jLjJ3qj3j5K0Lj5K6k1N%
$$ plain form
11.38525 12 -33 49 5 -5 14 10 16 17 -6 -11 2 10 5 25 33 11 -8 7 6 3 21 8 17 -24 8 0 6 -11 17 5 12 37 -3 15 -18 16 -4 1 20 -18 -7 22
11.36388 22 -1 0 19 14 17 -4 -16 25 -8 32 31 25 25 -4 9 3 27 5 18 0 6 3 29 5 19 15 -26 15 -4 15 8 15 6 -12 17 -28 17 -10 32 -6 11 -7
11.34252 -7 13 0 26 9 17 5 3 27 24 7 21 3 1 16 23 7 12 20 10 -1 0 -7 30 13 -4 11 -22 -7 -7 10 3 -14 3 34 -3 14 18 10 -2 13 25 2 8 7 6
11.31963 6 -8 2 14 36 -2 -11 12 14 -4 11 23 0 24 -8 16 8 8 15 -5 2 0 18 9 5 -6 -16 29 10 20 31 40 0 12 25 -7 11 -15 24 -8 18 8
11.29877 8 -5 1 21 9 19 1 10 13 3 0 -13 17 -10 6 0 16 19 1 13 19 5 6 -10 13 16 2 26 -10 14 6 0 23 27 12 19 21 -10 20 -5 27 9 21 0
11.27689 0 -18 -17 28 14 15 -1 19 19 33 14 0 0 4 1 7 18 13 -3 -18 24 -14 11 14 8 38 9 -8 7 2 28 4 24 14 7 12 24 0 4 20 6 2 -12 -4 2 3
11.25400 3 12 10 10 -4 14 12 15 7 16 -4 34 3 32 -11 36 18 0 10 -20 22 21 6 28 10 -4 17 -30 15 20 -1 2 -12 28 -31 18 -15 26 8 22 31 -11 22
11.23264 22 7 -11 -4 18 -2 -11 31 -2 26 1 28 -12 16 -5 -18 -14 3 14 1 -2 15 0 17 -21 36 -26 7 6 9 8 21 13 0 -15 5 8 -7 19 -2 3 3
11.21178CJrL1k8Nj4KL3j2j1j3J9j6jJ8j1J7j4J7j4Rj9J5oPJ4l0QJ7j4j0K5j6J1rkJ1J3l2J9j2
11.19092BJ1pk4OK9k0K6qmj1Rj3Pk2M3k6moK3j5KmJ1j5K2k5K5k0M1n5M0lJ0Jk1QjJ3l2RjMJ7k5n
11.16803hK1nj8MJ6NJ1k0mLPK1l6J8roKJ6Nol5K8K4n1jJ8J5k1J2j4K8qJ1j7K0kj3j1J1k0OJ0K%
11.14565Ij7Mj1L2j8Nj2K1Lj5kJ2j4j0L1nJ0qnjl3O0m0J8j8J7l6M8k7J7qJ2J3l0K3k1J0mo%QJ5
11.12428B7l6PqK4m5L1J0j8K3j7J0NLlRl9pM1J9n5M8o5P4m9K6j1nJj8K0PQOl3J0OmkJ2l1N3m0N%
11.10190aNj5K8Nqk5OTj9J8OJ0nj0PpOJ7l3L3qk3L2mromj3K2jj2qJ3LJ1Tj4J7j3j9K0mK6k1k2MT
11.07799Fk0J1J7J1j6jK7j8j5K7ll8K4j2J4j0Jj7PJ3qKk3M3k6M0l6Mj2K1J5rj9j3rM5l9L7l8K1o
11.05713bL4k3k8M5j6J4m2K6j4LKJ9nj2LJ1njQoTk9N3j5Mj8KJ5j0j7J7kj2J2Kj7J0%RPl2L1nQj0
$$ plain form
11.21178 3 4 -5 26 -2 3 -11 -9 24 12 1 -12 7 -9 -10 8 -3 14 0 17 3 12 -7 8 2 9 23 -7 1 18 4 -6 19 3 14 5 3 14 27 -5 14 2
11.19092 2 13 6 -18 -12 17 -3 23 15 11 0 9 -4 3 -19 24 -2 -6 -12 11 -4 -2 -6 5 -10 12 -13 12 -8 33 -22 18 15 25 26 5 13 12 25 -7 2 1 5 22 -3 -8
11.16803 -8 13 8 -10 -6 10 15 26 6 2 5 12 33 -3 15 6 0 2 18 23 17 -18 10 34 -17 -18 0 15 -6 6 -8 20 12 23 6 26 24 11 0 11 -9 -3 7 9 9
11.14565 9 -8 -4 -15 17 -1 4 -8 13 16 1 -1 11 -3 -13 18 13 23 15 10 9 -24 36 -4 14 -4 13 -23 25 -2 15 7 19 32 2 25 4 14 10 4 4 12 27
11.12428 27 -9 -2 -10 14 -31 0 10 -8 15 -2 8 13 16 13 22 -17 -24 17 36 -19 29 -36 38 -11 15 4 -1 0 -18 2 9 17 23 -10 0 6 2 0 12 -19 34 -6 -1 -1
11.10190 -1 4 -11 17 22 14 -11 -5 1 -18 0 6 16 11 1 8 1 7 24 -9 24 16 -7 25 21 12 6 2 -11 11 10 -2 -10 3 6 17 28 14 31 18 -1 19 15 41 20 -2 2 6
11.07799 6 -14 -3 14 25 9 8 35 17 2 29 26 -12 12 0 14 4 5 -12 -5 8 0 2 -21 22 -4 36 0 4 -8 13 28 19 0 -13 -22 23 -16 21 -17 4 -2
11.05713 -2 32 9 -19 26 10 24 -18 8 -6 -3 -1 18 13 1 4 15 10 9 17 11 5 -24 29 14 18 0 2 17 7 -10 7 5 -7 5 7 -10 0 0 9 16 -16 15 10 18 8
11.03424Hkj7K4J2k6J0%TPlK7l6k7J5M2l5MTj2K2j7J2k5N3j6J3j1j0k3J1K7m1K1j4J9rMpJ0J3n1
11.01338b4L7j3K5jk9LJ9Jk4L2k4J8k0j%Jk2kK7j6K1qRJ6j9Pj8K3l9NTL3k0NPNk5RjLJ1j3J5j1Q
10.99049A5k3L0k9K8k9OJ4nlJPj2J9k2OrJ6qj0J3Oj8j0J6L5j9J1j3j2L7l2J6nk1QnJ3k4J4qmPR
10.96862Fj0OJ3k1K4Jj1K0j9Mk1L5k5RpJ4j0NJ7kl2j2J2J3m2M8l9M1j4qlPlmJ9J2qo5N5KJ5k2K
10.94674BJ9j6oJ5mMj4Mk0OK3l6N5l9M3l6J4k6QK2qk0PQj3K6k3K9k9J0MJ0k5K0l2L5m1K7j3MK3Q
10.92538B5j4j5L9m7N1m3pK0JJ2Ok8J4MJl0J6kK4j5j0K2l0J6j1MK2k5lNJ5koj2K1j2k9L6j9Q%N
10.90401Gk1J6knNKJ3JJ8j6j9J7j3MJMj1KMJ2k7K4m2O2n8M4m4N9o6K4KLJ3j3J8MqNk0J%K7l7L0
10.88163B0j2Kj6ORk8J2K5j6LJ0K2n6K9J6k1Qrl4M0qj2J0J3Mj5j4QOJ1jrK2j0j7KpkJK6l8L1j2o
$$ plain form
11.03424 8 6 -11 13 25 -1 9 9 9 16 13 40 4 -23 -8 34 -1 3 7 -5 17 0 12 -13 40 24 37 26 16 -7 4 31 -10 11 -3 16 7 11 4 14 27 -24
11.01338 -24 13 0 25 24 -5 -2 17 18 -6 26 2 20 0 -1 -1 0 -22 -24 3 -13 8 0 9 25 6 13 -5 18 -21 -16 -11 22 2 7 14 19 -6 3 2 5 16 3 18 7 15
10.99049 15 -8 22 -7 21 -8 -2 12 7 4 5 12 0 19 -3 3 -6 10 2 -8 5 11 -7 -17 -1 34 15 26 13 1 38 6 22 17 -4 4 -1 12 -12 2 -6 -10 -3 6
10.96862 6 -4 2 15 -6 18 19 8 28 9 13 -8 27 2 11 4 18 8 13 30 28 -4 -16 -4 9 -33 15 -24 17 3 -5 -8 -1 -4 -8 11 23 15 -50 5 7 22 0 2
10.94674 2 21 5 -1 14 10 14 0 4 -16 -10 13 -23 32 -7 36 0 14 -12 -4 18 10 -10 -3 5 -8 18 -5 24 -5 5 9 19 -6 14 -18 17 -24 3 -10 -6 17 25
10.92538 25 11 -4 35 -12 39 -4 -11 9 10 22 28 0 14 18 19 -11 5 3 27 12 2 24 -6 10 -1 3 25 0 -3 2 17 15 9 -3 18 6 -23 13 -6 2 2 7
10.90401 7 -14 2 0 -5 0 2 15 16 34 18 -1 16 3 7 8 12 1 3 7 19 -8 16 -26 36 -22 22 -22 37 -29 -5 -3 0 13 0 18 22 14 19 -1 0 0 27 -10 20
10.88163 20 8 10 -6 0 9 -19 -7 18 2 5 15 37 -19 10 26 5 13 4 -30 10 2 -10 0 13 17 2 -12 -4 2 13 12 3 25 15 -2 0 -7 -9 -8 18 -20 11 -1 -7
10.85924gJ%L9o4N1l4N3m2N1n2J4nj4QNQpJ6k5OkqL8n9QK1J2j9QLl8M6l6K7l5M0j1J6k2l4L9OJ6
10.83737A8k2Jj4J1RJ4Pk0mlJ8oJoj7J5J4j4j1L2m2N8l0Np%J3k6J5rK2k0lqK2Jj1OpJ2j4lkN%j1
10.81397a1RJ3j5nL0j6Jj6Oj0K2j0K6k0j3J1k0J0j8J4L4Ql2j5J3RkTj1LK6k2JKK0k1mjmK1rj2O
10.79209dj9K9jj4K5j3J1lJ3j6oJ9j6Nj0J2j9K7o2M1nL%k1J2NJ2j2J0J4k1MoL6l7K7j7j3L2j1P%
10.77073A8k5J4J1ql7M2l9N2l4J7j5nJ1j1K1k7L2k2mJ2j1N1k9K3m1K8qj6JomJ2J8k4J6K7j3Nq4
10.75089e2L1JK4mpmj9L9J5m2J1PNJ9mjl2J9k1L3l3K1KNj4Qk3K1pJ5j7OJ4pnLk6M2k3J8k9OK2q
10.72850Ik1J6k2J3J2j6J1k%K0j9Mj5K0j5J6l2L4j8KJ6k8K5rK1j3rK1j1pTK3j2JK2j4j0l3M2k6
10.70816a1K9l7L0lLl0J9NJ0k3J5o%K9qTk5K5j0rQJ4m3K7j5%K3MpknJrJ6kj4K2j6nK4j3JJ1j2k8
$$ plain form
10.85924 -7 -6 -6 33 -31 20 -14 39 -3 48 -4 10 5 -9 -1 4 12 5 21 -4 2 0 -8 30 -29 -21 0 12 -7 1 4 -34 12 -24 3 -32 8 -3 13 -9 -43 -4 2 18
10.83737 18 -4 -3 -17 -6 3 17 24 4 0 -3 15 9 10 4 -13 2 16 2 -9 23 -19 39 9 14 7 7 20 -6 9 0 22 2 -1 -9 13 14 3 9 2 14 0 -3 -5 0 0 -11
10.81397 -11 -2 11 -4 -9 21 5 6 -10 -4 -14 8 -2 24 4 -9 2 -18 -8 -26 -12 22 30 -2 -17 -4 5 3 1 -10 -7 19 -3 -2 0 20 -1 -5 -6 -10 11 2 -10 -4
10.79209 -4 -23 6 5 -9 16 3 14 11 24 8 2 21 5 10 0 12 -7 20 -42 -1 -6 -3 -3 -24 -12 -7 5 -7 3 17 -4 0 -6 30 -7 20 3 -10 22 11 18 18
10.77073 18 -7 7 18 10 -27 15 -24 28 -6 11 -4 -9 2 -9 12 -15 17 -5 -9 3 -8 43 14 37 -4 24 16 0 1 -5 -9 3 21 -3 13 40 27 32 -52
10.75089 -52 -21 -20 4 0 -7 -11 -30 9 24 -18 -7 0 5 24 20 19 -13 6 -15 18 -15 6 8 13 -1 7 -16 5 -2 13 -4 2 16 9 4 7 -19 23 0 18 -11 -5 17 9
10.72850 9 -12 4 -18 -5 7 -9 2 0 0 20 1 5 -10 10 -5 11 -21 13 -5 -3 13 -15 10 1 22 9 0 21 10 3 -4 19 7 8 30 16 6 -27 15 -11
10.70816 -11 18 -19 11 8 11 -19 0 5 15 -8 7 1 1 30 22 14 -11 14 4 -5 3 17 -26 1 -14 -14 9 13 6 4 -1 0 -9 7 5 -9 13 -3 -8 16 3 4 15 3 -25
10.68526b5O5j8j7k5K1j5M7j7j3Pj4%J8k0jJ2klLnK3j1J0k5K6j1qkl6M9j3K6l1J4kMJj5j7L0J9
10.66441B9m0K1j2Kj2K2%Rj7pJ0Tj8Lj1QqM3l2J5j4K3k4LMj2K1k2LK1mj0j1K0oRj2nj6J3JKj0P%
10.64151dK3l9K6j3NnNK2pk3L1j6qkK1k4J3JK0j8l5M5k1J2j3QmPNOl0K7j5rmM4m1L5l8K9nMj9j5
10.61913a9J0k1K0M5m6J8Jj9J1KkK8l0LrJ6J9j7l9N2k6K8m3L4J5j8L5k5M0q9L2k4L7j0j1l%L4n9
10.59929c0N1k2JMlQJpj9K6oj1J6k0J7k1J4Lmj2PTJ4j3J0k3J0Rj8J8Ljj3NKj0pK1j7OK0j9J1TO
10.57640B5k0Pl6K4j2J8J5k8J3j2J4Pj6lJ4nj6RjkKLj6K7JJ6l9L3l0K0k7J8nK0qk4jL5k7jQlTMK
10.55351@LqJ8k2j6L5k0PJ9j1M%pM2o7L5l4K0qJ1Lk4K6jk3K1j9M8j4lj3kJ0j9K%K5l0L4k8J5j2j
10.53163dJmqJ5j2L1l0J2lmTQRPqJ6l7J3J4K2k9MJOk1J8mnK7m6QMJ5k9K9Rl6L9l2L5j5k1J0Jk1
$$ plain form
10.68526 -25 40 22 5 -20 1 -14 33 16 3 10 -4 -4 14 -6 -7 5 3 0 3 -2 21 10 20 -5 21 10 2 0 -36 13 0 26 -5 9 7 11 12 -3 -20 10 29
10.66441 29 -11 10 -2 0 -12 10 10 19 2 -5 5 15 -3 0 -11 -3 -11 32 0 15 1 24 0 3 7 -5 16 -6 -3 18 14 4 -7 13 7 16 4 -1 -17 -4 -3 -1 -11 -4 -4
10.64151 -4 19 -20 6 -7 -2 -7 -2 20 13 -10 21 5 -3 -5 16 -8 5 6 26 8 -27 18 -3 9 -4 4 0 7 12 18 -12 15 0 -9 -13 31 -10 25 -13 16 11 15 -4 -19
10.61913 -19 -9 -30 -10 35 -11 7 8 -11 0 2 0 28 -2 1 -8 8 27 10 -29 23 -3 25 -18 16 31 13 48 23 63 -26 6 -18 19 9 -2 -5 -5 29 -30
10.59929 -30 21 -1 0 4 1 9 10 3 -16 10 4 -7 9 -11 6 -15 -1 2 -2 -14 -7 0 14 1 11 -12 -2 7 -11 7 10 9 -4 1 3 -7 -14 7 -10 -4 16 -3 8 19 25
10.57640 25 5 12 -24 0 -12 6 21 -7 6 -6 8 15 -1 -4 10 5 -11 -2 -3 -5 -3 0 -16 11 12 28 -11 22 -8 12 -15 3 -2 18 10 -14 -15 20 -7 -8 0 -3 -6 -2 0
10.55351 0 3 -5 13 -9 -25 10 -10 -3 16 5 9 9 2 44 -23 12 -22 -2 -10 1 4 -20 6 5 -18 3 -16 32 18 15 2 0 10 -9 -7 -7 18 -12 22 -6 9 -3 -4
10.53163 -4 -3 -7 -15 0 -12 19 -11 1 -2 -6 -10 -2 7 14 6 22 -15 -2 12 34 5 9 10 16 -5 13 9 4 31 -15 -7 -3 12 -17 12 21 -15 24 -8 27 12 -9 1 2 -19
10.50874a9J9Tk7OoRMQl7K6mJ9j2nLMj3J8nmm2M2K1Om0rK0j4kMrK4j3JNPTRk0J4qk2J2j6L0k1K5
10.48483A4k8K5l5M4k0j1K5oj5J8k5J8j9L3k7%K1jRk4L5l2jNJ0pJ6k2j1J2mLJ3njnLj2J4j9J5Np
10.46296Aj%j2J8lKnk0NJ0j1J6Jlj1J3J5k2K4l2M0k6Rk4L0lJ5j5J4k5J3J7m4K0nK4m7L7l3K3nM
10.44159Dk6M2j5Qj3K3k1K5o1M5J2j0j1k7L6j4NLTJ2qTk2L1rnJ2nj9klL4k1k0L0K3k8k6K5L2l2m
10.42023eLMJ0j7K8n9P1m2krL4l9K9l4K5l3L5j0J7mKNJj1M2o9N1qkj8j1M5j9k0J1k2J3kk2L2j4%
10.39886a4J2mL2j6%k2J3K4j0lj6K6k8k0J8kPj1L6m9K7KJ3jj3J0j1j3LJ9k5K2rj5K9j4Lpj3K0J8
10.37800A8j4JLrL2k6j6K4k3NL5n5L0qJ4m2L5J8k6J9k3RJ0j4TJ8J0j7Rj5J1l2O9m9K8j0J1nj4M
10.35765AK9l0J4qK2l5PR%Pk1RQk0J0K2k2j7K8%pNjk4K5k0L3l0PJ5Oj2Ok5j0QOTjk5J6Lj1J7J3
$$ plain form
10.50874 -19 0 19 -8 -2 -8 1 5 13 -24 2 -2 17 5 0 3 7 -6 12 7 3 -39 3 24 30 -10 -19 1 -13 -15 -11 -20 4 -9 -8 -3 4 11 20 0 14 6 -16 -4 -20 10 -11 14
10.48483 14 -14 11 -24 20 0 -11 14 8 -7 11 -14 4 -15 18 -9 -9 12 11 20 -4 31 -1 -2 3 13 6 22 0 -11 1 -3 0 13 8 7 2 5 -7 7 -12 3 8 1
10.46296 1 0 0 -12 6 3 5 0 -20 -15 -5 -16 0 1 -2 -13 0 15 -7 17 -15 25 -1 8 -16 14 11 26 11 25 0 13 30 -14 6 1 25 -22 15 -18 5 0 4
10.44159 4 -22 20 5 13 0 23 2 27 -34 11 23 13 2 -25 11 -3 2 5 8 20 12 4 -18 13 4 -1 11 6 -13 -15 -18 16 -5 -25 5 28 0 -26 -1 31 -1 -5
10.42023 -5 -2 2 12 -5 23 -36 35 -7 -9 -18 16 -23 6 -28 -3 -36 -1 -11 6 2 4 9 10 -1 41 -28 23 15 13 -5 -16 29 10 -10 1 -21 -8 -10 -32 0 -14 -14
10.39886 -14 -2 -6 26 10 10 -12 1 25 15 12 -4 22 -6 -26 -8 -10 -3 -14 22 -27 0 2 15 14 1 11 0 -13 -10 9 -16 6 -3 -18 11 -3 0 -7 -20 0 18
10.37800 18 4 5 8 -1 31 5 -11 13 -10 -5 30 -25 5 -3 11 -31 4 22 -4 15 -8 1 11 -3 -17 1 11 -6 3 -12 -1 -33 36 -13 15 5 16 11 -3 1
10.35765 1 30 0 14 6 28 -7 0 9 9 16 -5 4 12 -8 2 24 2 -15 13 13 6 11 10 -14 11 -9 24 -6 1 16 22 10 16 -9 -19 -11 -5 1 0 -25 -9 -6 -17 0 13
10.33476A3k6J8kTNMpJ2l6L8k7K1mJ9k3Kkj1OKM1n4J5PmRQm7L5k0L3qj3%TJnqK6k6K9pk0j4M4l2
10.31136a0K0l2L4K0l8J6nk4K1Kj0K2j8lJJ5j1J3j4j1JK6omj3J5j4L0k7K5k6pJ1jj9J8%L7o1M0
10.29101A3j6J2j7OpK7m3N0j9K5l7Qk3L1jMNl6K4j2L4k1oKPrTJlKJ1J4oj0J4j7l%J6k2J5j5K3j4
10.26863bK8j9KJ3k3Mmj3NL9m9N6n1K0JpJokKJ0j4L1j9Nmj2J2j6QoJ3Nk7LK5j0J2j3K0k0J1J0k5
10.24625fJ5k2LJ4k4K4j3L7k9qMK4k6M4m2L4lk6L6m0L1j5k7K7n3N4k7L3l3J0%QJ7m6K0j6K6j2J1
10.22641DJ0j8J5nK7l2kJk4K4j4M3k1K1j8J0k0j2nM4k2mk1L2k7K2MLn0L7K1k6Qj7J3mOJ0j1kj5
10.20555a5K2j0k2L6j1K3m9L9j6K2jpopK4Mm6J9j6K4k8L7%k0J7J2j6k4K0Ml5L7rJ8l7NJ9j1K4p
10.18520A3J1l1PTJ2%Lk5K2j6J6Km7N4j5%rj2N2j6l4jM2j6j4nk3N0m0K9mk3QjrM7k6rk2K2J3k4Q
$$ plain form
10.33476 13 -13 5 3 1 6 10 3 15 -21 17 -10 11 7 26 3 5 3 -8 -2 0 41 -13 2 9 5 14 22 -25 10 -10 23 15 2 2 2 3 -2 -10 16 -10 19 12 -8 -22 22 -10
10.31136 -10 10 -22 12 32 -6 10 5 -19 2 4 -6 16 -2 -5 -4 11 0 13 -1 -12 -11 15 9 5 -8 7 -7 23 -4 21 -5 -12 -1 -2 -21 -3 -3 34 -27 13
10.29101 13 -3 9 -8 -2 -9 18 -25 25 6 31 -6 2 -21 10 9 13 18 -18 6 -6 28 7 1 3 10 1 -8 -7 -10 -8 3 17 11 1 15 -2 -5 -5 11 -11 4 -11 12 -2
10.26863 -2 26 7 9 22 -1 3 -1 -14 -9 30 -19 37 -14 6 7 0 1 -5 -7 -5 5 -9 22 3 8 4 -8 4 -12 -4 -10 3 8 -19 -16 9 -1 11 -2 18 -2 9 19 -6
10.24625 -6 9 -13 -10 4 -20 4 -9 28 -1 -9 -5 19 -7 37 -5 29 26 0 36 -4 27 12 -15 12 -41 13 -14 19 -14 -4 -4 4 21 -25 -5 -21 5 -7 4
10.22641 4 14 -4 11 6 33 1 -1 0 -24 0 -14 29 8 29 11 21 1 -11 -16 28 6 2 -19 13 -14 8 12 15 -35 2 23 -3 5 -12 1 -3 3 13 2 0 -15
10.20555 -15 7 -3 -25 11 0 23 -26 13 -3 19 18 11 5 -2 22 26 -20 -1 -17 7 -21 16 16 -4 13 25 9 -15 5 9 -26 11 2 20 -17 -12 7 -4 20 13
10.18520 13 24 -7 0 7 19 19 22 -3 19 3 19 21 -26 28 13 13 4 -8 44 28 -6 -7 35 19 5 0 -23 27 -13 16 12 -11 -3 -4 -13 34 8 -1 -23 -1 12 -12 -4
10.16333dMjj1J3j0R%j3JK2j6K7J1l1J3j5j7L2j6NpPqj4J0K8j6kNomJ5k7K2j9K2J0Jm3K8j1J6k5
10.14145a5M7n1%L7n3L3OqKJ2lqL3k9J2l7L0l5L4k5L0Ln0M4m9L8KNOqoQK5k9J1k3jj8L4oJ1Ml6
10.11958b3L3m5L9J8m7L2k3K6j0j6QL2k9KM6n4LjJKNqL4m5JJ6J4k1K5l6K4j0PQrJ2j1OJ7Qj4Tp
10.09770dJ1j3K9j1J4j4j3L3l2J1Nmrl6O6l7jj0J2K4j8k9L1pRpRj6J0Lkj1K7rok5JTL4j8KJPlj5
10.07481a0L7j7k0J1oPRl1L5Kl2K4Kk1NJj1M6k3Mj2J3jk6J6JnPj4mLNj8K6j1L2PrNl9jJ5mJ5pJ0
10.05141A6k7K3j3K0k6NJ6j7PLJ8m8L3Lj5nK1j5j9J6PLJ3l5L7lj8LJmk5K9Ll1M3Pj2J6l0K2Ol7J
10.02953hJ3mTpJ7k2K2k4L0k1nJ3k5M0k8L2l7J6l4L9Kj2nJ2K2m3L9j9QPmnj0J1j4j8O3l1j2MJ5
10.00868A3m0K3J7m4N3k2J1j3K7k5J2Pl4J7Ok6nJ3%K0k5K0Jko%MJkJ6m6L3j0L7n2NOJ0%rJ6Kk6
$$ plain form
10.16333 -4 0 -1 -12 1 -9 0 0 -13 -12 10 -6 21 32 1 14 -1 -18 14 -2 3 -4 3 -5 -19 -9 19 3 1 6 0 -4 11 -16 6 -13 9 19 20 -23 5 -6 10 -15
10.14145 -15 32 -19 -19 18 -35 -2 4 -4 -2 10 7 -1 32 3 15 -22 8 -27 7 -18 12 15 -35 9 -40 -2 0 5 11 3 -3 5 30 1 12 -11 -12 -30 4 -2 9 13 -23
10.11958 -23 10 -35 4 22 -25 7 -16 10 0 -16 -8 24 -5 -3 43 -11 -8 -9 -8 -6 -1 -9 25 -20 -19 -3 11 -10 15 -21 3 -7 0 8 -1 11 0 6 23 31 17 3 -4
10.09770 -4 7 -6 23 12 26 12 -1 32 0 11 16 12 3 -33 33 -4 -5 -15 -3 21 3 -26 5 -2 7 0 9 -7 3 6 4 -7 20 11 5 -20 -19 -18 16 -2 0 1 8 5 -10
10.07481 -10 27 10 -10 1 -5 2 11 -20 15 17 -15 9 11 -10 -5 -4 -15 31 8 12 0 13 12 -14 2 3 -2 5 -9 -13 -10 -5 -23 3 -8 24 31 22 27 -12 -13 2 -2 13 6 16
10.05141 16 -11 12 -1 19 -7 -2 14 -3 4 7 25 -23 10 13 -2 -7 14 -1 -20 -4 3 6 19 -16 21 18 0 3 4 0 -25 4 7 -24 19 26 14 30 0 22 28 -9 -8
10.02953 -8 5 1 -3 -10 7 -15 7 -17 13 -8 -13 0 -25 15 -13 19 -18 -2 -36 3 5 -7 -12 0 22 -21 18 -1 7 14 10 5 -5 6 -8 -26 37 6 -6 -2 13
10.00868 13 -27 -4 13 -31 22 0 11 -2 25 0 12 19 -15 2 8 -18 -23 -10 -10 10 -15 5 6 4 -2 -2 2 3 1 17 -29 4 -6 31 -21 -16 -10 0 0 -9 7 9 -17
9.98680a7J0J7mNklNk4%J7K2l3Oj9J6RrOj5NQK8l6jOJ0k7J9jNK2l9J1j2J3nrJ4QmlUJ8k3pJ6JK
9.96188@jJ1l3J4J6k4K4Onj2KMjJ0j2J7k9RK2poK7n1J0MJ5k2L4j7qjQonNk6J9j1K8k8M1k0rJ1p
9.93898dOrJ8j3J7j7j4M3j7K5l3Jj0J1Jj2J7k0j2J2Rj4L4k6J6k0L1Nj3Mk0j7j8L6PJ1l6L6%k4n
9.91813a4NK8l4K6j8L8k6J0k2J7j8k2K2J3nj0KJ1OnqMj5k1M3J3l0OK5l3J7QJ0l4J3J0ONn1K5OL
9.89676Fk2M5oj0l0M2k0ml0L5j3j4J6lK2k2nJ0L2n2K3J2%k8K7jJ0m9N6j6l1K9j8okK3j1L9l4k
9.87641bj6J6j4k0N6k8J7j5RKK7m1J6j3kJ4Pk4JJ0Qk3L6j0K0o0PK4K8j7oMjLplnOJ2k5J9Jj2L9
9.85403C8l4J9j0J4l2Jj0L4Jj4kj3Lj1J5PrKoJ5jk0MmPJ3j0K0l4jJ3jJK9l0J0l9M8k4J3j4QNJ3
9.83165A4j9J5j0OJ1j6j2K9jk0rqN5l6Ql8L9KK4o1K8jNj0jOJ2%Rl7lK1Pk9J8Ol3L8%K5k0j2pJ
$$ plain form
9.98680 -17 -7 10 6 11 9 6 11 -13 -13 4 26 -7 -1 -20 -4 5 -4 2 -13 -8 0 28 -8 -9 -3 7 -20 -1 -2 3 25 -14 -3 -15 -2 -7 -16 -2 6 2 -1 -4 -7 11 -12 -19 -3 -2 0
9.96188 0 -1 10 -23 -9 7 -17 7 13 8 -4 -2 2 1 11 -1 16 -13 -4 18 11 5 32 -19 -9 -5 10 -12 22 5 -3 -4 4 -2 -7 -2 -28 -9 -20 8 -20 21 1 -8 3 -4
9.93898 -4 2 -7 11 -2 15 -2 -16 27 10 35 2 3 -7 4 5 -7 10 -10 -22 -10 -1 -15 19 -7 9 -11 20 25 12 16 -4 -21 -39 -3 4 15 -21 15 15 -9 -14
9.91813 -14 -9 19 -15 11 -7 31 5 15 -7 10 -8 -30 -8 5 0 -10 -8 3 9 4 -4 0 -15 -36 7 20 -10 -4 21 -12 5 13 23 -11 2 12 18 23 -28 -3 3 6
9.89676 6 -16 29 23 13 -17 25 5 1 -29 6 -7 -21 -5 -8 14 -8 -13 -3 29 -23 0 12 12 -16 11 10 20 -29 27 11 -20 9 -9 -15 -17 6 -5 34 0 -2
9.87641 -2 -18 -2 -16 -36 20 -8 9 -6 3 5 32 -9 7 -6 -8 6 13 -11 -10 0 8 -15 21 11 31 -29 -22 2 30 13 7 11 10 13 6 3 -2 4 16 -9 10 11 -1 38
9.85403 38 4 23 13 27 -5 -4 -14 20 21 7 5 -8 -5 -16 -1 6 -3 -1 -7 8 7 -13 -9 -13 -6 7 -3 17 -17 -18 -5 -6 -5 24 -6 4 -35 13 -11 2 -12 -4 1 14
9.83165 14 -5 10 0 6 17 1 -11 18 17 -3 -12 -20 35 -1 7 -31 8 10 34 -27 1 0 5 -5 -6 0 12 12 21 -16 -19 2 9 -20 -2 4 -29 9 9 34 14 2 -5 -4
9.80926dj4JJ6qLK2j2j0PKomQL2n4J1J0J2j8pL1k7J2JTj5J9k0J7m2K3%J2qNJ8pj8K1k0J6rj1J0T
9.78637FN%j4k5K1pK3Lnj8J3l2L2j7K5lj3nk3L4k3J1J4K9k5j3J7j0K0k9L3n0J7KK5k3LkJ5k0p
9.76551a6K4k5J5%j1L7j9Lj8J5k5K4k1J7OlJ2j9K3j8J0j0k6NJ1KJ1Ok5KJ3J7j2j5K0k2J9j0k9
9.74567c2K9L%J1Qm8L6pj0okJ4K2m2J1k1M2k3M1k9lJ2qk2K8nJ8qj4Kl7P6m5J9k7K4J0rk7L8l4
9.72482a5M0k9j3J9K8k2j1mj8M7k1m5K8K3j6K7k1J5m3M2Jk8K5k5J6jlQkQj5K3j8kMK2Ql2Lm4K9
9.70396a2J0J2NKlqJ3j1J6j9l2jM1nkj7L5k9%mpK4pL8m5mj3J1j1J%MK7pnkJ5j9J0LJ8m7M4k8J8
9.68107Ik2j7J8L4l6L2qrOj5jKj0k1N3j5K4l3J3mrJ0Qj4JJ8Rk6MPNk1J6j5J1l1L4l8N6k5mojk1
9.65868c2L2OJ0j3Lm6N2j3J9k5k0K3LJ5k0j0MK5qk2J4rK0l1M7l4J6j9J8nj5J5lKNj6K9Rk6J1K
$$ plain form
9.80926 -4 -18 -17 -1 -9 -6 16 4 -6 1 3 -3 -7 1 33 -21 -10 0 12 -6 -13 18 -9 3 4 5 -10 9 -11 6 -36 -13 -13 -1 -9 -4 14 7 -11 10 -10 6 -3 -14 -4 6
9.78637 6 11 11 -3 -28 -7 -14 9 12 7 -11 2 -30 2 -15 10 7 -6 -11 -34 0 -23 -12 2 31 6 -7 10 0 20 -9 24 -26 -9 -7 18 -5 -2 -4 11 -9 -16
9.76551 -16 8 -17 -2 -2 -13 24 5 8 -10 5 -20 4 -17 0 6 3 15 -4 19 1 11 1 -25 -20 -9 -7 4 10 -15 -13 0 17 5 -10 10 -12 7 -3 -32
9.74567 -32 -3 0 0 11 19 -29 7 0 -10 -16 -18 -4 18 -24 -13 -34 8 -15 26 -3 -6 6 -2 -24 4 -1 17 9 -5 -3 -40 36 -9 10 -17 7 17 8 -19 19 -15
9.72482 -15 25 -4 -17 2 30 8 -3 -7 -25 22 1 -44 -16 7 -9 18 -3 12 -31 11 12 -16 9 -16 0 -1 -4 4 2 10 -5 18 0 -2 2 24 32 0 3 -41 -12
9.70396 -12 -2 10 15 17 14 6 19 8 24 5 -27 -28 13 8 6 -11 24 -5 -5 -9 -16 8 1 39 -6 -10 -23 -12 -23 -22 -22 -18 9 2 -3 -5 10 -9 1 4 22 -25 19 -9 9
9.68107 9 -13 -30 -12 22 -14 18 10 1 7 -8 -9 -7 -17 -38 15 0 24 -9 4 0 -9 1 9 -5 -4 14 23 -3 1 8 13 -8 8 -7 4 -27 7 -31 25 0 -4 -10 -11 -32
9.65868 -32 0 6 16 3 6 -40 12 -1 18 -7 -27 -4 -1 14 -6 -16 -12 13 5 -17 -3 -12 8 -23 24 -10 6 -13 5 0 -15 0 -3 -1 4 -12 17 26 0 11 13
9.63783A3k0oK0j5J2lj3J4j6mJ9J4j4j7L6l6L7k9J3mRoTQj9K4j3J6j5Nj9K0J5l9K1J8m0J1K8l7
9.61748a8RJ6K3n2K3j1j4J0J7JNk6K3oJ5j4k2L2lqK3j8l7L2nNjPk3L0l0J5k9K9Mj2%kML8o8N7
9.59611A9k3LlNjk4L3j0k4K5%J6l4L7l7J8OJ6m7L8l4J3LK0k7j9M0j4L1j5k8K8j3%Nkj0K0j5J1
9.57576Gj6rK0J2k9K4j4J1k3K3k5J8J6j7KokK1k1L6m7J7Rk0KJ9Qj5J6rTJ7j5TK7j9pJ2Jjk4N2
9.55440B7k1oOk8J7j8J2nM4k8J0j7j6J6k2L0j8M3k6JPoML1k2k5J7j0Kj4RKNk0J8k0K6l0jK6Rk3
9.53303a4J0K3k3MlJ3l0L4rnLKj8J2j8K4j9L5l3RJ4k3J1oNnOJoK2j6pj7K5rLqK5j2JpJ8k3K0j6
9.51014gmOJ5K1k7oKk0J2%RmKRnjJ1nj6j4M2j3rJ7rqJ3k8K2nTJJ0j0j6K3Q%k1K7k2kNpJ4J3l5
9.48623a7J6oJ2j9J8j7J4OmoK0pqk7K0k5M1j5J5k0J4j9J2KMj7oJJ9qMoJ7j1OMkj0LqkK3k4J4j3
$$ plain form
9.63783 13 -7 -13 7 -8 4 1 -12 2 -14 -18 1 15 1 -16 20 -16 21 -8 5 1 10 4 -2 6 -13 11 -2 14 -1 4 -15 5 20 -19 2 20 -20 -9 19 -18
9.61748 -18 -9 7 30 -22 1 -10 -24 -14 3 4 9 -17 6 0 15 1 -21 11 8 0 23 5 -32 0 -5 0 -1 6 -17 13 -17 -2 -31 -2 2 -10 -10 -12 -8 30 -38 19
9.59611 19 -4 -1 -4 1 0 -24 9 -1 -25 0 0 16 -18 19 -18 0 6 22 -25 13 -21 -8 -5 15 -12 -31 9 -5 26 11 -17 11 -2 -2 3 1 -9 11 -4 7
9.57576 7 -9 -18 2 14 -15 9 -5 6 -17 6 -19 -1 15 -2 0 -6 -8 13 -8 28 -19 -2 7 -13 -11 8 16 1 17 8 -1 16 1 -14 13 -6 -13 -1 0 -1 -25 27
9.55440 27 6 0 6 -22 -5 -23 -11 -16 28 0 10 -7 -23 -7 -29 1 -17 26 0 1 8 2 6 37 15 -10 7 -3 -1 -15 -6 -4 1 -19 -1 -21 5 -25 -26 0 9 -14
9.53303 -14 -4 19 -4 0 -3 10 -20 14 5 0 3 5 -13 -1 -19 5 -14 21 -12 -3 11 -12 -1 -7 -2 -7 -1 0 -6 16 0 -7 -24 1 -8 -5 -13 12 0 1 -6 12 -11 9 -7
9.51014 -7 -11 -5 10 31 4 -2 0 -20 -8 -8 1 -3 -1 8 3 2 13 8 -8 -22 20 7 -2 15 6 -2 11 -17 5 0 -5 -4 6 -4 -20 3 11 11 -10 17 -5 -7 -2 -9 5 18 -17
9.48623 -17 -1 -7 5 -14 4 -13 1 7 3 -3 17 10 2 -25 -5 -30 11 -4 11 -9 5 -14 -2 0 4 -13 -19 -18 1 -7 -3 -9 8 -3 3 7 5 -5 -2 -10 -12 11 -13 1 -12
9.46334a2L7m5L3m3K4Mj5K3j1nJ5j3JJ0Kj5j8L1j2j1J6j6K1nMmL0l4J2j5RKj1K6roJ7l4K5j5J3
9.44248FKmoJ0qoJ6l1K0nK2ok5NlN2m0KK9ll5Kj1J9KNKk4K9k4K5rl1K7m3L4KJ0MKj1pj0JM0k7n
9.41857fj9J6PrJ1%p%K1j3j8J6rK1j2J1l8L1l2K5K1k5jkK0j0Rl5J6J9k0Qk8L6k8L4j3mj6L6j5
9.39772bJ8j1kl5L2Mjj9L0qj9rQj0K7j6K3oj4nL0j6j1L7k5Lj6QqJ3NQml0J2OJ7j3K9j4l9K2KJ1
9.37533A2j2J8j4TqK5KJk2j5L1J8k1J0lk0J1MJ9j8qrk4L4J1l4PrK7PjJ8l4J4nJ0nk6L0k4M1k3n
9.35346dRqJ3j0j4L9l0NnJ0j0mJ7l8O6k3Ok2j0NRmJ2k3J8j4J9mnqJ9j7qK6lNk6%K8j0k3L4l9J1
9.33107a1J0j4KmL8m7M0mj6PK6l4K2j5QJj3J4p%k%PLk5j3J4Lj2K4Qj5J2l2J5J9%oj9M7j3Pk6%
9.30869aj0M1k6Qk6knK3j7PQj2pMJ8PJNl1K3j5L9j6j1l2K5m%jL2m0JK2k5RJ2J3j2Jk6M0ll7L3n
$$ plain form
9.46334 -12 25 -20 13 -30 -6 -2 -17 6 -5 -10 5 -8 -7 3 5 -10 -28 3 -9 -20 -4 -20 1 -4 0 -4 26 -8 4 -11 -2 0 -11 15 6 0 17 -17 8 -7 6
9.44248 6 8 4 -2 8 0 -6 10 -21 -1 -6 16 10 -15 -10 -13 39 -1 1 30 27 -8 -6 -17 2 4 9 11 -13 16 -8 17 8 -23 4 -39 -5 -3 7 11 13 2 -5 -15 -14 26 -1 -6
9.41857 -6 -25 -9 -2 -11 0 0 -7 -7 14 1 -17 -1 -10 11 -1 10 -28 3 -29 -4 17 -8 -9 -11 9 -1 8 -27 -11 8 -12 -4 -32 4 -24 10 -3 -7 -23 13 -2
9.39772 -2 16 5 3 -32 0 4 3 -16 14 6 -13 -22 -14 -24 3 -13 10 4 -10 -15 15 -1 -12 25 0 3 -13 -5 -13 0 5 13 9 -21 -9 -3 14 1 30 16 -23 -1 1 12
9.37533 12 0 18 4 -10 -18 7 9 10 -12 -27 4 22 1 11 8 -12 -1 3 22 4 -4 -13 -37 -3 8 -26 -19 -28 -1 6 5 23 -11 3 -2 8 3 -23 7 -17 24 1 -4
9.35346 -4 5 -3 10 0 -14 25 -5 0 -5 5 -5 -9 8 -30 36 13 19 -3 -13 -8 1 -3 9 -14 4 -10 9 5 0 -8 11 -6 -14 12 9 14 -12 -12 16 6 -17 17 -22 -11
9.33107 -11 -1 -15 -13 -17 21 -26 14 10 -6 1 27 -7 15 0 8 9 -4 10 3 3 1 1 8 11 -14 -27 -13 -10 -22 2 10 -5 7 -25 -10 9 9 3 -16 31 18 25 -1 -1
9.30869 -1 -11 30 4 12 -14 -16 -21 2 -15 -8 0 -12 -19 -15 3 10 11 16 -15 8 -7 32 16 5 -27 -2 -6 -6 -7 25 -15 -14 8 -17 -8 4 17 5 6 -20 20 17 -20 13 8
9.28580HjJ8j3j6J8kj7lmJ9j2QjlQl3J8jnKM6n5J3J7Ok6L1rj3Pj2kJ1Nj0OK4m5K2k5K0J4m2N0
9.26342B1m6K7lJ3k2LL8k6j4NjKJK0k1kJ6J0n1N5l2L1k2Pjk6L4m1O6p1L2j4PL5k5r%k1K7j2K5
9.24256A5j5kmNRLj3J2j0J0nj7j1K8omKPk2J9j4J7OmJ3k2OmJ4k1%K1kk2L8k8Pl4M0rJ3MnJ1qj5
9.21916CqJjkM5l4M5j9Kk2M2k5K8m1L0j3Ok8K1qj9K6Pl9J4NojnOj6K0j4qL3j5K4l8K0l7K4j8J0
9.19728ePk0OJ5nTNj2Mj5L9Pj9l1QOJ2j5L8k0rJ1J5j3J5j5Qj6mL4m4K3k0M0n3L9j4kj7MK1j3L1
9.17541B1l5L4j1pPj6J1j0K7m1M0k6oK0j6rJ4J5j3L0l2JoJ1TLk5J3k0K2l2K4NJ9j7Mj4J4lj3J9
9.15455A3qK2j1Ojk6JOKmj0L2k7J7l3J3LK7j1qJ6k7J%j7L2qKrPJ0l0L3k8K5k5L6j5J1k4PJ0k5
9.13268a5L8n0K5Kj2J0pJ4pmkJ6nJ1Mk0kKj2N7m9NrJ8k4J6K4j3Mj9J5l5L0jj5MJ5j2J3j5QLnr
$$ plain form
9.28580 8 7 25 12 -4 14 12 -5 -8 -12 7 -5 3 2 -1 7 -26 -8 -9 -14 -12 34 -21 -8 9 15 -11 20 11 -2 5 -7 -9 2 7 -3 3 27 -18 4 -21 -1 13 -29 21
9.26342 21 -25 2 -1 12 -10 -7 31 5 -9 -4 -5 -3 -2 18 -3 -5 11 21 -30 25 -7 24 2 9 8 -18 16 -25 41 -30 2 -12 -5 30 5 -4 -4 -25 2 -10 15
9.24256 15 0 -2 -6 -1 8 11 -2 10 0 10 5 -12 -23 5 -1 -5 -3 4 -18 1 -13 4 10 6 19 -3 3 -1 13 -8 -8 13 11 -11 27 -1 6 -28 12 3 16 20 15 26 18 3
9.21916 3 -5 -4 -5 -7 38 4 49 30 32 10 52 27 55 14 44 31 37 9 30 22 3 29 36 -3 11 16 10 9 4 10 -6 14 0 -8 25 10 34 -4 16 -21 3 -15 -5
9.19728 -5 2 -18 -12 3 -2 -7 -2 -14 -10 -25 14 21 2 -29 -21 -15 -3 -18 20 0 -9 2 17 4 19 4 12 -4 -8 26 -18 5 -15 25 -28 11 -3 -5 -22 -18 3 -10 21
9.17541 21 -14 20 9 2 9 -7 4 -6 21 -20 20 -6 -12 8 -8 -17 -3 12 -1 29 -3 -2 -8 3 14 17 -8 5 -15 7 -25 -1 4 23 6 10 -4 10 7 -6 13
9.15455 13 5 27 16 22 21 -5 -4 2 4 0 -10 22 -5 12 -21 -8 -5 22 11 3 19 -8 -7 -7 -24 8 0 2 -7 0 10 -20 13 -15 10 -15 21 6 17 -7 0 10 -15
9.13268 -15 23 -27 -2 0 -12 -2 -9 5 -2 -6 -8 8 3 14 18 -2 -4 -2 -14 43 -6 -1 -10 8 -16 0 24 11 15 -4 11 -24 6 5 -10 -6 9 -3 10 -5 3 6 1 -8
9.11029hL4k8Jj1J5j1RJJ4m7J5kJ8pQj1J1j5j1L1j2K2j6L5p2M7k7K5k8J5MkrQLkJ3j7K5m2j0K7
9.08893gPjRqj1K4j0Qj6J9l1K2K0k8M0m5J5oj2J8j0nQOj5J9qk9K9%JlK5j8OpJ4k7J6%j2K2l3M3
9.06654B9m2K6mrQmk2J5J1j3nJ7j6NrJ5jl7O2l4k0J4KL4l1J4Joj4J9l4K5J8j1mj7L3k5%k6M7J4
9.04518B5l1J6MLj0l4J0J3J1Nk3K1k3RJ1k3L3k6K5k7jTJ3j4J4K2j7j4J5omkJ7k8mL6J0pnk4K3r
9.02381CMlj2J8Knk9K2K4m2L0op%j1J1LKmJ5j6p%nK8mJ4m9J3J5Tk7J4J3j0nJ6l1K7LJ3l9j3K6
9.00143FK5j7J1l6K6l3L8k8J6oj9K7j1j9M4pl0K1rJLj2%qL8l3J6k4K8j4J4l0K6mJ3l5L0PqJ2j3
8.98057Fj0J6qmj8M1l4M2k9kK5j4J6j4%Kl3M1j8pJ3j4%K6lKj2K4nPNK5k8L3K5l8LK9J2j6K3j9
8.95921I0L4j6oL4j4NTK1J2L3OJ7qM2l3N0J4PK6K4M6JK6N8L0N8J02J45J43K79L28M56O59P57
$$ plain form
9.11029 -8 26 -2 -1 -12 3 -8 1 2 16 -31 -16 -18 0 -7 1 -10 1 -14 -25 6 -6 16 0 35 -37 10 -17 8 -20 -5 -1 -3 -12 -4 -1 -3 10 -7 18 -24 -34 -7
9.08893 -7 0 -1 8 0 -11 13 3 11 -5 14 -17 5 25 -3 37 -8 7 1 -11 7 -3 -8 0 6 -9 10 2 -27 2 2 3 0 25 7 13 6 20 -7 9 9 -3 19 -14 29
9.06654 29 -13 13 9 0 8 4 -18 -3 8 -5 -10 7 -9 -4 -13 2 1 -36 26 -8 -28 -14 -12 22 -9 5 6 0 -14 5 -29 -4 14 3 -1 -18 15 -10 -10 -36 11 25
9.04518 25 -6 10 14 17 7 -27 -17 -4 7 12 -11 10 -13 -4 7 -16 17 -9 16 -11 -12 -13 0 -14 0 22 5 -9 6 0 -4 -6 11 -17 -21 15 25 18 13 -11 12 3
9.02381 3 7 4 -8 10 12 7 -22 0 24 -18 12 6 -1 -1 -12 -1 2 4 0 15 -1 -8 -8 -13 15 11 25 -24 -11 4 19 -8 6 19 9 4 20 -11 16 19 32 -7 -20 6
9.00143 6 31 14 25 -11 15 -18 20 -8 8 2 -17 10 -1 -20 24 17 -13 8 -1 0 3 -9 -9 -17 21 -12 4 -20 8 -6 8 -22 4 0 13 -22 8 15 7 19 6
8.98057 6 -4 12 4 0 -18 23 -11 31 2 0 25 11 27 13 13 15 -18 23 5 -2 11 -3 -3 23 20 22 10 34 29 36 41 66 38 71 96 58 61 90 102 86 109 90
8.95921 90 124 108 102 136 122 127 132 153 165 198 204 221 213 255 222 272 286 293 319 343 389 390 416 474 504 562 664 809 952 1231 1559 2015 2674 3431
8.94191C431P68O05R00R06O42K45K66K64j08n66o35m77n71p56q19o18n76m66m55l42l21k63k35
8.93021H19k00q6j51k6p0Lp5j6k5k3j0j1Rl6Mj0K9k8Qk7%j0j8L4j9oMK5l7roL9m1kJ6oj5j6J8r
8.90986B0K4l8J5k1J5J8k9Qj2K4j6qKLTL5k5k4ONK2j5k5K6k3J8M2m7JQTmNk9L8k1Rk1L0l2J4P
8.88850A6j5%nM7l3%nTjK1lj0MNlk1J4MM2l3j5J1K3J3k7NJ3K9m7N0j3j9j8K7pkj0k3J7mQj4TKJ
8.86560EnJ7m7K9J0J3j3Poj5J2J0qj7kK0Rk3J2qJ9k7L4m5L1K%j4J6j7NJ2lLk8K3J2mkjoj0J4kR
8.84271B1%l4M6k8MmQPl0J3MUj8JPnjK3j1Qj5j0L4lLl8J7%j1RTMkj2K0k8J5rpoJ4OnlJ5j3OoJ1
8.81728A4rj0M3l5pPrOL4k6nPl2L3pK4m7M8l2K3J0k8Mnjl3N3pj5%j1K4OL1n5J5j8M1o7L0JTpK2
8.79489A1Ql6J7LK0k8N3n6QPJ6j9K4k9J7j8K0oJ4j2nkj8PJ1jJ2j8NqQj8J3qJJ2j1K4j2K8n3M4
$$ plain form
8.94191 3431 4199 4804 5704 6610 7252 7497 7763 8027 7919 7353 6718 6241 5670 4914 4095 3477 2901 2435 1980 1638 1317 1054 819
8.93021 819 619 533 382 356 286 289 214 198 173 150 140 129 138 102 106 96 125 97 105 78 78 68 50 84 65 59 63 88 51 42 36 75 34 32 48 42 27 11 29 20
8.90986 20 44 6 21 0 15 33 4 12 0 24 8 0 2 5 8 43 18 -6 0 5 27 12 -13 13 -10 8 50 3 4 12 20 16 21 -8 30 9 18 -3 27 -5 9 16
8.88850 16 1 1 -4 43 10 10 5 0 -1 20 17 7 11 16 13 -8 6 10 52 19 4 15 38 51 24 29 42 71 24 74 61 42 24 51 44 42 32 9 26 22 30 16 2 4 5
8.86560 5 0 17 -30 -1 9 22 9 16 10 -5 7 17 9 -8 -10 10 19 -4 8 0 19 -8 26 -19 12 14 14 0 16 -1 4 16 13 16 -12 11 23 19 17 16 10 0 14 12 21
8.84271 21 21 -13 33 5 9 5 13 20 -10 3 7 11 15 -3 -2 5 0 -1 22 11 19 4 -6 28 25 28 -10 7 7 -4 5 14 18 16 4 24 -4 11 2 -5 -11 3 9 4 1 16 3 9 3 14
8.81728 14 5 -5 38 3 -4 3 -6 0 34 8 3 10 -22 11 4 28 -19 29 -3 20 30 2 6 1 0 -33 20 13 -2 -2 -13 11 17 48 -7 8 -10 31 -36 -6 -5 -4 -11 11
8.79489 11 19 -17 0 3 23 -5 48 -8 0 7 23 4 28 -1 16 -2 18 12 26 14 9 7 -11 -4 7 6 18 0 5 -3 5 -13 0 -8 -7 5 -6 18 6 34 -19 25
8.77353B5k7J5j1MmklkL5k5K2o3M3l1J2qJ0Rj0lJ1j9RNJ0j5j4kK3k3pJ1J3J5k0J7Poj8K0rK6l0
8.75165a0L7n3N8k5Pl0K5%jQj2Pj3OJ5j9j0Rk1M4k5j0K4l6M7kl2K4j8Lj1M9n8N3j2k1K7Nnm3O6
8.73079D7o3L5l0L5k3j2J3j7L3k6J4j0j5K4j5j3K1J2j7MK3PQl4J3pnk%oLlJ7pK7l7Rj9K8k6N6
8.70994D2l3J0k4K8k4J1KLk3Oj8L7j4lj5J8Knj0J1nTPJJ5k2Qj6L4l1K6pRj7JPrl1L9J2m0L1J4
8.68806B2l6JJ9lKpoK2omqL3j0qLlJ2j2J7ok6k4M8J5k9j6L4l0K0k2M4j3J8k4rJJ0J1k6K0mJ7k7
8.66619A0M2jJ3m1M4j8TK6lJ1pJ4k1nJ3j3MpK5k9oOJ0k3%mMpMQj8pL3oMj6rJ7Lj5QoK0J1J3l5k
8.64228B6M0JK3j1J2L4j6J9pL8nlj3L0j3j0N0k4K7Lj2J6J2MK5J4L9l4O0oN6OLpP3j2K5K4J9P8
8.62193E84L3J18TJ45K44L99P43J468K396J207M46J373J114K52m98p26K33m54k171j691j021
$$ plain form
8.77353 25 -2 13 2 6 2 0 -3 -5 30 5 27 -36 7 -24 -12 -20 -10 -1 -11 -14 -3 -22 -13 -8 2 -13 -27 -29 -6 -29 -36 -25 -12 3 -17 0 7 1 -17 3 -6 20 -10
8.75165 -10 27 -26 32 7 14 -16 9 9 8 16 4 11 -2 4 19 0 -10 -1 -22 22 -3 -13 11 -25 22 20 -12 12 -6 -3 -14 35 -23 30 18 -3 24 29 24 -19 47
8.73079 47 -16 19 -11 24 1 -11 2 -15 18 -8 6 -4 -19 5 -10 -23 -2 10 -7 -3 20 27 35 1 14 7 2 0 0 -6 -3 -6 11 4 31 -6 3 -16 12 -14 42
8.70994 42 9 19 -5 23 -1 10 12 15 -8 -2 -20 17 3 0 -15 3 5 0 -10 1 -4 -9 -2 -1 14 -8 0 -16 18 -13 13 6 15 -2 -1 6 -3 -34 5 17 -23 8 22
8.68806 22 -14 -13 6 3 5 -2 -8 14 8 4 -4 29 19 11 14 11 23 11 28 22 -4 -28 20 35 6 -10 24 -6 14 -8 36 23 41 17 8 9 19 30 4 24 20 37 10
8.66619 10 52 51 64 23 67 49 31 57 54 65 58 72 51 46 59 46 50 43 68 39 33 39 49 26 26 22 26 19 23 31 13 6 39 33 37 21 12 29 32 17 25 19 39 50 63 28 26
8.64228 26 66 67 90 79 91 125 109 128 121 159 154 151 138 168 155 145 195 171 198 201 189 205 217 221 246 260 299 265 325 319 375 381 384 377 450 438 463 487 506 584
8.62193 584 617 735 853 998 1242 1641 2384 3852 6248 7455 7901 9274 10388 10640 10142 9416 9649 9195 7024 5333 4312
8.61125D312o03n39m73m67m38l98l86k79k03j06p4m2k5ol5mk3jl0M5o5K6n2j1Jl7mkK2m9j2J8L
8.59446F3j1K6k3j4K7j5K1j2lJ5k6PK4nl8J2k8L8l0oJ8LNj9JmK4k0k4MNpK0j3j6K3j2K4j0oj1p
8.57309@PpOJ5J1m3M0m2J1PnK3lJ1k4J7k2J6knK0l6%K3j9Nj1K9rJ3k6K8k3nJ0NOPMpK4LOprK8q
8.54918F2k7J8k5J6qj5kj8K7k9L3l7J0j0J3Tj2Ok7L9k7JRj4qJNK9k7J1J7m0K5j1J8j8J2kj1J0o
8.52833AmkLJ0LRJ3j1jj5K9JkLpOl5J6qpJ6j8J9nrJJ3j8Lj1J9RqNJ1k2K7n5M5rJ2l2ORMKk0K9
8.50391B5j4j2MmL6l5J1noPj7K0qj7K6mk2J2RpJ1j7K1k1J0J6l4JJ2Lk6M7qk9RMQL7m1JL0j3Tj2
8.48153eJ8l5K4jJj4QNTk0%K9j0j5K6k0qOJ4OlK6k3k8M9l7OL3j5K4o5L3j1J8k1L2J0l2J5k7K6K
8.46016B6j4LJmJ8k9K8Pk3J7j0J4k9K6qLk6J0TJj8J3j9K3nl1K1K5k6mM%J0nJ3k8QJ6qnK6k8qL6
$$ plain form
8.61125 4312 3709 3170 2697 2230 1792 1394 1008 729 526 420 346 304 279 273 238 234 211 210 180 225 160 186 134 123 124 87 83 81 103 54 42 60 63
8.59446 63 52 78 55 41 68 53 74 62 59 74 48 55 79 74 36 48 20 58 28 22 40 43 48 29 30 26 50 30 6 10 15 8 28 15 -1 22 10 34 24 18 7 0
8.57309 0 7 0 6 21 32 -11 29 -13 -2 5 0 23 20 31 7 24 2 18 16 11 31 -5 -5 18 -1 4 -7 22 13 26 0 28 5 0 10 15 21 28 32 25 49 52 58 51 42 70 62
8.54918 62 35 53 28 44 36 21 19 1 28 -1 32 -5 5 -5 8 21 9 15 -12 27 0 1 10 -4 -12 -11 -6 23 -4 7 24 -16 9 -2 16 -2 10 8 -3 7 1
8.52833 1 -3 -5 -2 8 11 20 33 22 21 6 35 36 34 37 30 36 1 17 9 2 18 0 19 14 5 6 19 1 4 -7 12 21 13 18 29 7 34 -21 24 15 27 -5 1 10 14 16 -4 25
8.50391 25 11 -1 3 -1 35 0 11 6 0 7 -10 10 2 -15 11 7 -15 -3 6 -1 10 -7 14 -7 3 19 -15 -14 -2 1 -25 22 14 -15 -6 -2 6 43 2 3 33 20 7 -5
8.48153 -5 13 -22 2 1 2 -12 -4 1 6 -14 -14 15 5 -10 16 -4 -12 -6 8 14 11 37 14 -14 35 -2 4 37 22 46 -19 14 3 21 0 32 42 10 25 -2 24 26
8.46016 26 12 15 16 12 30 1 29 36 13 30 20 34 5 31 23 26 0 10 20 21 3 16 -3 20 15 -16 5 30 4 0 4 4 14 9 22 -6 2 18 10 5 31 3 -5 31
8.43778C1l1L8l7L5k7Pj9J3pkjPK6m3K3k3L1Mml3M2j6PqJ7nJ0Tj4j1J7J6MJ6m0K3J8Mj1KK8k5o
8.41590F6K8NJ2ROJ3ML2j9L8j6L8l3K5k0J1J0M7lQ0J7N1P0J23J75L03L61M10K15L05K80K74K91T
8.39861C499L69L12o8j82j18j38j86Tj98k05m20m99l99k95j73j48j36j58j33l7r2l9n1k2J2j4K
8.38487B97j7jTLkK2PK2M6m0M9M2TP9J59K48M09M35L34K52L92L03L17K14L05L96P9k43k01j30
8.36961C817r6k46k01k05l21n09m76l25k72j61j64j72j22j08r8p7n0l4Tk1Rmk2k3%K9m3j1nJ4
8.35435F9K0l1j5K0l3J6%k0MPJrK4j9l4L8jJ6k8k3K9j4J4npLpJ3k4J6LJ3j8j4K0j0J5jk7L5oJ2
8.33298D2k2J0q%MmnLJ3j6L1k3j8J2k9K8k9J0JL4l0qJ7Qk2JMK3k8K2Rj2j1J9k2J8k2L4pj3j2k
8.31162@J7nK9qnK1%M6m8J6J2POj1j4m4L8k3K4mQj9l8lL5l6J5k2J3j3mK1Rk6j2M1j8J6j3J8j2
$$ plain form
8.43778 31 0 38 1 36 9 16 -3 10 3 1 0 7 33 -10 13 -10 21 25 21 -12 30 14 21 13 30 25 35 45 31 20 37 53 57 73 33 56 74 78 67 69 97 72 66
8.41590 66 94 99 111 120 126 139 143 175 156 194 178 216 183 208 188 199 209 256 253 333 350 401 471 594 769 1072 1433 1843 2058 2363 2643 2917 3208 3499
8.39861 3499 3868 4180 4112 3930 3812 3674 3488 3302 3104 2899 2479 1980 1581 1286 1113 965 829 671 538 501 409 370 319 297 309 295 297
8.38487 297 280 279 278 281 279 301 308 330 376 336 385 427 469 548 707 955 1364 1799 2133 2385 2777 3080 3397 3611 3916 4312 4391 4148 3947 3817
8.36961 3817 3721 3475 3274 3069 2748 2239 1763 1438 1166 1005 841 669 547 439 341 264 214 180 146 125 134 130 108 85 85 114 71 60 55 69
8.35435 69 89 58 43 63 30 46 46 26 30 37 38 29 53 34 0 38 37 53 25 2 31 17 31 26 19 22 15 28 4 20 23 36 18 4 24 14 29 28 1 36 30 42
8.33298 42 20 30 22 22 26 22 17 20 33 17 48 25 7 19 -10 18 -11 -1 0 34 4 -4 13 21 -1 0 4 27 -1 21 30 18 7 26 4 22 0 34 27 14 2 0
8.31162 0 17 12 41 33 28 49 49 95 47 63 75 82 88 77 63 19 57 34 58 54 62 43 5 2 37 1 16 -6 7 -6 -10 11 20 -6 -18 23 5 21 8 26 14
8.29076A4j5MJ2J5jj3jj8OJ7j5QJ2n2M4j7k5K5Oj8J5QJ1J9k8J4k0K0qJ1k5%Lj2TL3Kqj5PJ7QL
8.26888C1k6lj9M2j4J3k4J8k6K5j4kRk3J9J7k3%K0j4Ok5N0m3Qk2K6mpRnjl0K6J2LqQJ6j3J3k1
8.24752DK8mk8PorMJ6Rj5Pj4J2Mp%K9Kl7klPlJ7Jj2NMkj2NJ8n6L7MTk4J3pqJ2j0J8j2Nj3L2k1
8.22310aK6k8L9j1J1n4L1m0M1j3J1J7k8Kj2K2k6L7l2J7j2Oj6J4J1j5JQPj4j1L6j4j3K0k8K5k8
8.20377a4M1m7N2n8M1j5NTmJRl2Rj5K0MKPk6K7l9L1Ql0j1J4K3KloJ5k1kLk0L2lJ2m3L4j3L3k8
8.18190@K2n5N2k7K3oPj3KJ3j7J6qoMoRNlJ2j2nj2PK%J2j3npL%OTMPk2L4l0OnK3m8J9j3L0nk4
8.15748a8J9Mj6Oj8L1j2j0J9K0k6L9n7J6oRL0n2K1K0k0j3K7jj2J6j5T%JK5lkk7J3PMKj5jJ4j4
8.13611a0K9j8jJ1k0L2pm2N0j2j0Kj7J5PnJ1Rkk1J3k6J7qK1k5K0k0K2k5OJ0nj2J2LK3j5qpL3m0
$$ plain form
8.29076 14 -1 3 15 30 29 16 15 -3 3 20 5 13 25 -27 17 0 -25 0 6 -12 3 11 22 41 13 27 7 27 19 30 5 5 8 -4 -16 17 19 11 -4 3 20 28 31
8.26888 31 5 2 -17 25 11 24 0 18 -8 17 3 1 10 -13 6 23 0 0 20 6 12 -13 37 -6 2 -20 6 2 -5 4 -1 -2 -32 -6 6 9 1 9 25 12 25 4
8.24752 4 32 28 0 7 1 -8 -4 12 21 6 13 -1 11 15 8 8 37 39 2 0 -3 4 1 18 19 7 12 16 14 2 7 25 -31 6 10 14 -10 3 -4 -12 0 -10 8 -4 1 -12 20 -1
8.22310 -1 25 -3 36 25 36 -18 13 -27 14 1 12 29 1 3 -9 13 -13 24 -8 9 -3 3 -13 1 12 -3 -2 6 13 -1 -12 24 10 -3 17 -11 14 -14
8.20377 -14 27 -20 32 -26 15 0 5 10 6 7 16 -16 -7 -22 -2 2 4 11 -15 12 -27 4 12 -18 -29 -15 8 10 7 1 16 -5 -7 -4 -24 8 5 17 -26 8 -5 28 0
8.18190 0 22 -33 19 -8 15 9 16 3 5 18 1 17 9 3 7 1 10 15 12 24 12 7 -5 2 4 4 16 3 -2 -9 -6 -6 0 6 10 17 -5 29 -1 5 0 23 -25 -6 -19 11 6 -18
8.15748 -18 1 5 -11 -5 -23 8 -4 -14 5 25 -1 38 -19 -3 -9 0 30 -22 -1 19 -1 -14 13 12 0 16 1 -14 -14 -13 12 9 7 -20 -7 0 4 6 -9 -10 4 -10
8.13611 -10 19 1 0 11 -9 23 16 -26 24 12 2 4 -13 2 9 4 15 24 22 1 14 -12 5 -3 18 -7 13 -7 15 -10 -4 6 1 -11 1 4 27 12 4 -3 30 -10
8.11475a0qJ2L2l6jLTK3l6Rk6M3jpQlJqL9j7lKj6j1NL2j3lj0j6J3J2J5j4J6Kk0l3K0J4J1k3J7
8.09287A7k1MmJ3ljj4J9k8j4L5j3NjpL8qj9mlRrL1j8j9JK3Kj7Pl%qJ3oJPQlQm6L2l5K4jmJ6Jj3
8.06794hJ7Oj5k6M7j8J5m7K4j3OJ6%Jk3L5oj3J7l3K5pK1k6KLJ0pNj2k5M0k4J4kJ6j6j3jK3qj6
8.04658a6J9jK1k2mQRj5JplK9k7J0J9j2j0J8j2j1J7Pl8L0l0K4qPj1J6ljoRK8m3MJ0j0qL9j9j8P
8.02419cOLj4nL1k9J0j8L4j2J3rJoj6L0l6K0J1j1oNk7J1J8%qRJ7k8j7M1n9M9j6K0J0k5NMlj5J4T
8.00181A3J8j3j8kJ8l1JK2mj7Kj7N1k7Olj2%K4j6T%L7m3L0Lnj1OKRk2MK0k0jJ4J7j7J1Pk3Qj2
7.97943gk0K8J5j6k8K0KJj3K7LJMl4J9j%jNpNJ2m1L1nqj1J4k3J6MnK0oj4J1j3K1k5J3j8L2%oTO
7.95603BljkMj3Pj9L6j1J0l2M1n3N1j8NJqj5J2RO%j0PL8m0mj6K4qOmPl7L6j3lLJ8Oj7rj1J5l4
$$ plain form
8.11475 -10 -18 -6 26 -10 -11 -8 -5 18 -18 -9 -35 8 7 0 8 5 6 -2 37 20 17 19 3 -8 -3 29 16 13 3 -13 0 12 27 13 29 31 11 -22 -2 12 23 0 17
8.09287 17 -4 0 -4 9 6 5 -9 10 -18 -32 3 -10 -5 -6 -13 25 17 -2 -6 -9 0 -9 22 4 -15 -14 9 11 -6 1 -2 -2 -10 3 -3 -2 5 13 10 18 -28 4 -31 -7 -8 -12 4 5 -8
8.06794 -8 9 15 0 -26 21 3 18 -29 -5 -18 -12 4 4 5 -18 17 11 -2 15 -18 7 0 21 -5 -3 0 10 3 8 -4 -29 11 -13 1 -1 15 -1 -14 -15 8 0 -16
8.04658 -16 3 2 23 1 -3 5 14 -1 0 -7 -10 19 -8 2 21 9 -1 17 5 -6 11 18 -20 10 -20 4 -4 3 -8 8 5 4 -2 7 35 -8 -4 6 -4 -12 27 8 -10 -3
8.02419 -3 3 6 -8 -13 18 -11 -1 -19 15 3 16 7 8 2 -14 16 -20 0 11 0 -6 -1 -28 -17 1 1 -7 2 19 -9 -26 15 -44 5 -11 9 19 -6 -1 3 0 -15 -1 13
8.00181 13 31 18 0 -2 16 -15 -14 8 4 -13 -11 -28 23 -4 2 -1 -13 -13 11 -5 -21 -21 16 -27 3 6 1 -10 -4 -2 7 -15 -11 9 -11 -12 2 19 2 13 20 -3 5 -7
7.97943 -7 -27 1 16 0 -28 -8 -6 -5 -18 9 12 13 17 -17 2 1 1 0 5 -2 3 15 -26 5 0 -8 -19 -5 -28 -12 -8 -13 7 1 -13 -2 -15 6 -19 -6 -24 8 8 2 -4 2
7.95603 2 -1 -2 -4 0 -13 -6 -25 11 0 10 -22 19 -34 17 -1 4 5 -3 -18 -6 3 9 9 -1 6 44 4 0 -16 8 0 6 2 9 -28 8 -5 -8 -5 13 19 2 -7 -18 -3 -37
7.93263c7K9Pj7K9pj5j1K9rk8K6L6l1nJ4j6Nj9K5%k0L3j5KnJ0j0K0l8K9j8k3K2J5Tj1j0K6k1TK
7.91177a3MJ0K0k2Njj9OJ3%K4l4J9l8K3Tn1J2K2l%J3k7J8k3K3mk5K7j2MK3k4L4l6Kj7J8J3k4J5
7.89091bKJ4k6J2J0j2rL1l5K2qQPj4JjJ3k0RnL7j4oKj6L7l3J3j9K4nJTj0J6m3L6j8j0j1nJ5JqM
7.86802a4J9j0nkNJ8j7K2k4J2oJJ1l2L2jOl6L1j4K6%J0k0J5q%J2k9L2j1k0qM6j6T%qJ8j7Kj7L7
7.84615B4l3j1J7JJ8j8K4rRk2K0k0L0l4J7j1l0L2j5LQ%Ll2O2l3K8l0J4j3k0K0rK6J3l8K4j1K2
7.82631B6k4J3j8J3k4J1J4j6J4j4K4k8%Ql4J7N4k5jLk1lJ1K4%ll2M5l5J2qK5j2Nj8K1J1j5qKm
7.80545A0J7j2J8k2K9m4M4l0j6J5kl0L3j7j6K1KQj6QlNTk0J2nPjK0l1K5j1J0j0Lk0L5l9L0K5m0
7.78459cK6j5LKnOLj9J5k2K5rjj0kJ3jJ3l0J8k4L1j6J1j1jJ7KJj0J7j1k0K2j5oj2PJ4MLnj8rm
$$ plain form
7.93263 -37 -8 -1 -18 11 4 -11 -22 7 -2 -30 -4 32 1 -4 10 -6 -1 -20 5 5 -15 18 3 5 0 10 0 20 -18 11 -7 -30 -8 7 22 11 1 27 6 -15 -13
7.91177 -13 -9 1 21 -1 4 3 -16 -10 3 3 27 -7 12 -26 -3 20 -31 -19 3 0 0 13 -14 4 -19 4 0 -25 2 -10 -6 17 -7 27 -9 -7 -24 -6 7 -17 -2
7.89091 -2 0 14 -12 0 10 -2 -11 20 -15 7 -1 7 14 0 1 0 13 -7 2 -3 34 20 14 16 0 37 4 17 -2 22 17 18 19 9 25 -18 18 0 -10 -21 -26 -11 -10 -18 -14
7.86802 -14 5 -5 -10 -12 -7 11 -6 16 -8 4 -2 -1 10 -22 10 9 15 -21 10 -4 22 22 32 12 27 19 19 31 2 34 23 3 -5 41 25 9 9 1 19 2 4 -13 24
7.84615 24 -9 -20 -3 -2 16 -2 22 13 22 0 20 0 30 -4 13 2 -28 4 -11 -8 0 0 3 -29 33 0 28 -2 12 -1 -21 -1 -10 16 29 -9 15 4 26
7.82631 26 2 15 -3 10 -14 -3 11 -5 9 -5 19 -9 -9 -1 -35 -18 36 11 10 13 -8 -11 0 24 24 21 -11 34 -1 11 3 28 16 21 3 24 35 20 12 14 10
7.80545 10 27 15 33 11 40 -4 40 10 -6 9 7 -23 10 -7 -23 -2 0 8 -8 0 -3 2 7 -13 -1 -6 1 0 20 -11 14 3 13 3 6 -14 21 -18 12 37 -3
7.78459 -3 23 8 11 13 8 14 17 -2 13 -9 16 7 6 -4 -6 7 6 19 -11 7 -17 14 -2 9 -2 -3 14 16 17 7 24 13 -7 15 0 -6 -18 -11 3 7 10 5 -13 -22 -26
7.76170b6K8OPj1j0K1Moj8K4j9klJ8m3M6m1K5j6lK2lJ6j6K9k1Jk6K5j0nJ1l0J5J1pJ8j2J1nK1
7.74084B6j0Jj2oMj9M9l3K0l8L6j7PKjMk6K4J3ml7OR%j4JK5j2j5J1K2Jj5kLmJ0k0M8ok6oNj3kj
7.71744a2K6n3N0kRKj2K6k9J1qJ7l4L8nk4J9j5j7J4KK3k1k0NTkL6rk6mK7l5J8J0k1PMK3j7qNLR
7.69506A5k4J0JpmJ6qL3k7J4k5K4lnk5J5K0k0Rl0K1OkMj5K0mQl2J0J9rj4J6j4LqK3k6J4J5k9P
7.67318hJ5%L4j4m8M4k0J5j3klj3QK1k3J1J9j2Lk0K8jj6LRk8J9qj7J5J3J1j1k9L8%J3j2j3%PJ6
7.65182C1ljk7K8j7LmMJ1Qk1OQk2J2oJ0kL4m0K2M%j5OK5k8%J8J7k7Q%jk7L2J2K3j0k4L7k9K4j6
7.62943F3M2l7L5l9M6JnJ2J1J9j3O0k5M4j5J30N2J87K69J64J03J49J61J29J27J26L34L07j75k0T
7.61366B222jp3j25j34n4k05l54k42j98j17o7j11j8p5j04k3k8l4kj5oRJ4MM2p0L6LM9j9L1L0J8
$$ plain form
7.76170 -26 2 8 15 4 -6 15 19 13 -5 19 0 -2 -5 13 -30 16 -25 0 -16 -19 3 0 16 0 29 8 9 -17 8 -2 -7 4 -26 -11 0 -7 11 -1 10 5 26
7.74084 26 16 17 5 -1 3 -16 33 0 20 -18 18 1 8 10 9 13 -13 11 24 20 -17 -11 -2 -2 -16 -15 10 -2 -17 -6 16 17 2 0 3 -1 9 -11 37 31 5 -1 4 -9 -11 -12
7.71744 -12 14 -39 11 9 18 20 8 34 5 16 8 25 -9 29 24 0 19 4 -13 1 3 26 5 -15 -10 -5 -7 29 20 -6 -10 17 -18 0 10 -11 -4 0 23 6 -2 3 6 15
7.69506 15 -9 1 2 -5 -9 7 -1 32 5 19 -6 18 15 10 -15 0 20 0 9 -21 0 6 4 8 -7 13 9 17 -15 -5 14 5 -9 7 -7 -4 -12 11 -15 -1 14 -15 -8
7.67318 -8 7 7 41 27 -21 23 3 18 5 3 0 -13 -5 16 -7 4 23 11 14 -6 22 21 5 8 17 -11 8 0 -17 -2 11 22 11 -18 20 20 33 21 8 8 15 31
7.65182 31 28 27 0 28 11 14 10 14 25 33 12 18 26 4 16 10 20 18 52 12 34 38 38 23 29 54 26 26 44 61 34 42 42 41 14 46 58 81 71 47 84 55 79 63
7.62943 63 105 68 103 64 110 111 106 118 129 148 135 195 170 214 199 329 381 568 837 1001 1104 1253 1414 1543 1670 1796 2130 2437 2262 2242 2222
7.61366 2222 2221 2148 2023 1889 1835 1630 1276 1034 836 719 652 541 523 448 344 321 293 259 257 242 236 245 259 263 305 235 271 274 323 304 335 365 383
7.59688C83K7O0L4R4J08K49M12P51O54L08L79M55L52M65J79M04Q18N2n79k06j16j47j89l90k33
7.58416D324l57o47p40n17l38k24k28j85j43j52j53r7q8m6o0j8Jk8ok0NoK0J9K9J4O2J16J80
7.56941G17K66N19P04L55J31J49p6l33q1L44N46J11pOm54p07n27k99j42j21j12j02j52j05j27
7.55669E03j08j7n8k1j4K5j7K9k2K2lK1qJN6J7M1O4J02J76L54O13P54L51J68K33j73l74q6M41
7.54143C070O59L60j1om32o74o11l11M0j8j41r6j77l43l50k25j16r7j8r2m0n8j1p9K8%m3l3K2L
7.52617B00Rl2NK0jkRJ9l0O9MQN9R9K02L71K86O6J01K6j91j97O0K61K31l2N7j30k96l80j92j21
7.50989E58m6n6p5n0n5p8n3j6j9l5pK9k6K2j2J6l8K1j6j0J2Mj0J4k0lOqJ0nJ4j8j1J9m2L7l2K7
7.49056D8j5TRKj6PjJ6k2jnL7k8Jj7J0oL0qk2M3j8K3l1OJ0oj8L0pJ8mOj7Pmpnj4mlJ4L6k9j4J2
$$ plain form
7.59688 383 410 470 504 598 706 955 1367 2118 2772 3080 3459 3914 4266 4731 4910 5314 6132 6184 5605 5399 5283 5136 4947 4557 4324
7.58416 4324 3967 3320 2580 2063 1725 1501 1273 1088 945 793 640 543 455 409 349 331 332 304 298 278 283 277 297 316 345 359 421 537 717
7.56941 717 983 1502 2206 2561 2692 2841 2765 2432 2351 2695 3241 3352 3345 3351 2897 2190 1663 1364 1222 1101 989 887 735 630 503
7.55669 503 395 378 320 299 285 310 293 322 300 322 319 340 332 333 389 406 447 511 613 789 1143 1756 2510 2861 3029 3262 3089 2715 2629 3070
7.54143 3070 3729 4089 4078 4072 3640 2966 2355 2044 2084 2066 1925 1829 1652 1309 959 734 618 521 503 411 371 313 302 223 251 251 208 175 197 200
7.52617 200 209 177 182 202 201 199 208 227 197 266 270 278 337 436 638 1009 1295 1361 1462 1488 1297 1100 1160 1421 1652 1620 1677 1547 1251 871 679 558
7.50989 558 512 456 381 331 276 198 145 129 110 75 68 97 71 93 81 97 59 80 64 54 66 70 60 74 54 51 57 49 59 54 68 50 39 58 16 53 21 48
7.49056 48 33 18 27 29 13 20 19 35 13 12 7 44 16 17 0 10 4 34 26 4 47 29 52 21 27 37 31 13 43 36 54 50 56 39 46 42 35 30 16 12 9 23 59 30 16 28
7.46716B8j9QL2j5J4l0rTLjJ7Tk0J5j6L4l1lj0K0lJ2%j6J2k3J9j7L4pk0K8lk5KrQKNkMpPJl2M9
7.44375D4l5K7l4J5j5L2J5l3lkrJ3J9Tj2j7k1M8k7k3J6j7L6l4M8l7J9Jj3nL1j0l6NJ9Pk0J2k3
7.42392@K3j7K2j9J8lLj9OjOMj1%TJ2l5OoK3l9K7NJPj2J5j5L0m6M9j3J4J8l6OnJJ7j2k6K7k1L7
7.40153D1j6mj5QJ4k7L6l2jJ0Tl6K8NJk3JOjJ1j9Nk1K4KrJ3J2k2jK6k8L2j4J3j9kTJ7j4J1%mJ1
7.37915B7%JOj3j2J1oj6kK3k1L3j8PLjk3KPMjj6L5k4%Ml5M6j9K0j8J4j6jj6M2j9J2Kj1JpJ8l3
7.35677a0J0kMK5j7Nj1PL2j5l2J8j2KQJ4j4J0k5J6%PQl1J8J7j6oL3RJ4m7K0lMl0K8j5Qj7K4k4k
7.33489A2K3j7J2j7J8lrj1LlK0j4mRqL6n2K8Ok2K2n1N1MTjj7KJ3k0j0L1J3Mj9K8jk6K2jl2K4L4
7.31302H1j9J9qjLKJ3pK9l0K1rJ2j8L3Qk7J1TNJ8%k4L6j4K1LK7N9M7O7R0K23L61N77L27R5J61
$$ plain form
7.46716 28 9 17 49 34 48 18 9 0 3 2 19 36 16 31 15 49 18 15 5 25 22 34 34 18 30 7 26 9 43 36 16 44 41 16 18 9 17 19 24 22 26 19 26 27 -5 44
7.44375 44 9 36 2 17 2 34 49 16 13 11 2 15 34 53 41 24 3 51 24 1 17 0 36 2 50 13 32 33 20 15 46 36 0 5 24 31 11 23 0
7.42392 0 23 6 28 9 27 24 27 8 14 13 19 23 12 12 12 24 -11 -5 -11 12 -27 0 5 6 13 1 16 1 31 -15 34 21 35 53 17 23 18 19 36 24 -2 25 4 41
7.40153 41 25 21 6 14 28 1 37 5 4 14 24 -12 16 21 22 -1 0 6 5 16 -3 2 -19 5 7 -2 11 23 1 0 26 -2 30 16 29 10 8 6 23 9 20 20 16 27
7.37915 27 27 28 34 21 9 20 14 -2 -4 19 -2 31 13 20 23 22 -1 1 8 12 11 -5 30 6 6 10 -25 21 2 22 4 18 2 1 -15 27 8 20 22 11 12 5 23 -10
7.35677 -10 0 -2 2 27 10 15 4 11 43 28 -4 14 2 4 12 26 12 22 -3 13 13 20 28 -3 15 32 16 10 43 52 66 19 39 36 40 10 38 23 31 14 38 14 12
7.33489 12 35 18 30 13 31 28 19 8 11 8 28 14 10 19 11 47 -5 23 29 7 29 -22 29 33 37 36 19 21 34 14 4 35 48 52 33 61 60 34 56 55 23 47 81
7.31302 81 62 81 73 72 75 77 90 83 112 82 103 94 106 88 121 129 102 113 124 129 147 147 123 159 145 166 169 196 255 302 369 459 682 1043 1620 1947 2042 2203
7.29369B203j3l11k66L3M15N02kj8J5l79n56m18j68j07o0r6r0q5r7p5o5o3l0J2Qqk7L1K0l4M3
7.27792C14k2J2J3J9L3N3M0J14J55L84N22L19J24K29J27l3K45M83M48M42J34j75l58l94k00K69
7.26469C297j4j65Jk52o93n44l59j57Tr5j25r7q4j29o1m8m4k6Nk5LJ3rk2k0K4l0J4N1j3M4J1Q1
7.24790C75Q3K31M33M57J18R3J09k02k97o8J59M32J78n4L0j44n03l98k04j01p6p0j05o1r8o1r1
7.23417A65k4l8mk1J8l2J5j9K2l1q%L5k8J7k4J5rJ9l0j9LOK0l1J9Pj5LK0j3J1j8j1O%j2K2k8J3
7.21382B1k2K2j6J9kjk9O5l8lqM2k6JlK4l9K5Oj8PL0k2qMoj9J2oK2jOJ2m8JMK4j4%oJ4k1lOj6
7.19093hK8%k1OJ1j0j9K2k6L6j7K0m2M3ok1J2QK0k3k9K9PMKk6L0l5L6%j7J3l3N6m0nJ6lkqJ3J4
7.16956C5l6mK5j5nMK2n6M0j3qJ0J1j2L9l3kTL7m2L2m0J0J1TjmOj0Jj7%KJ4pOrjK7jkl0K0j3P%
$$ plain form
7.29369 2203 2190 1879 1613 1646 2061 2563 2561 2543 2558 2179 1623 1205 1037 930 870 774 684 599 502 427 362 299 269 281 289 281 254 285 305 271 314
7.27792 314 292 304 317 336 369 422 462 576 731 1115 1637 1956 2080 2309 2436 2403 2648 3131 3579 4021 4155 3980 3622 3228 3028 3297
7.26469 3297 3283 3118 3119 2867 2174 1630 1271 1114 957 862 737 640 556 427 366 318 274 248 253 228 231 244 235 213 193 217 187 201 252 239 283 294 375
7.24790 375 458 689 1122 1579 1697 1790 1899 1697 1400 1332 1491 1923 2101 2047 2077 1933 1430 1032 828 727 651 581 476 415 317 256 165
7.23417 165 141 103 99 78 96 64 79 60 82 51 43 43 78 50 67 43 58 49 68 38 19 22 28 48 17 36 43 28 31 51 38 49 31 20 26 26 14 36 8 21
7.21382 21 -1 21 5 24 22 21 -8 57 19 16 8 50 24 25 22 46 7 32 38 20 27 57 35 27 31 25 6 18 12 34 33 39 51 3 4 8 32 18 18 12 26 5 2 8 -8
7.19093 -8 20 20 -1 5 16 6 -13 9 -17 19 2 22 -20 23 17 -4 8 16 36 13 -16 13 20 24 26 0 30 -5 31 31 14 27 -6 50 10 5 21 18 16 8 21 35
7.16956 35 -1 -5 20 5 0 4 26 -30 10 -3 -11 -1 10 -2 37 4 2 0 37 -5 27 -13 -3 8 19 18 14 20 10 11 -6 -6 -4 10 3 9 0 -1 26 25 23 -7 13 0 7 7
7.14616GmPJ9oj3jJJ7mqk3QOJ0l0J8Pj1J4k1J7K2m4L2lTMj0rL6l3LJ6j6nK4k0PQl2j2J1TJ7J3m
7.12276B3l3J2lL0Lnk4j3L5nk1KLK0j0Rk4JoONL8m8rM5rj8KJ3j4J0l7N1j6j2J7j1J3k3qML7rl0
7.10037iK0k5K9Mj5Pj2J0j3J6l1M1Jl2RNKLnT%J5j3OJ0j6J8k8QTj8K0J2qPJ6n9K6J7j0mJ5l4J0
7.07799bJ8nj7J6QRm5j4M3J3j3onj3K8kJ2j8k8J9lJ2pj7J2jNpK0Kpj4JJ7j2Pj6J0J9rjj3J1kJp
7.05459ajJ4J5m9L0%Kk1j9J7QmJ1j0J9j1%j0PRj2J7k9Rj2J8jJ1lMrQj5j4K2j5J0J8mLj1K9l8J9T
7.03170C0k6%KrJ3j9NLJ3jlrlL0k6K1J0J4l8lNLK7j6Kk4NrK8l3lJ1K5j7Oj2j0K7j2J5k7K5l5P
7.00932hJ2nNpLj9KmK3JPTRj0nj2K1rJ3j9J8Mk9J5K5k6Rj8K7k1Oj9QrmL4m5L4k3J3jrRK0j0lJ3
6.98541B3j5k7J7JJ9rj1LMk3QJ8k1K7k6O9o2QjOk7K4K5jk9J8j0J8j6k3L0j5MqMk7L6k0J2Pk2q
$$ plain form
7.14616 7 3 10 29 23 10 9 10 27 23 15 -8 0 6 16 -14 4 11 0 14 -7 10 32 -12 20 17 14 18 8 -1 35 2 5 21 5 0 24 4 11 19 -13 -25 -14 -3 14 27 23
7.12276 23 -10 2 -1 29 32 27 3 -10 25 20 -1 1 4 24 14 23 -1 0 -6 0 5 43 -5 -14 31 22 4 6 19 5 15 -22 29 13 1 18 7 20 -3 -11 -7 30 21 -9
7.10037 -9 11 -14 15 19 4 11 -1 9 -4 12 -19 22 23 -9 0 5 7 10 5 0 0 15 2 8 18 2 20 -8 0 8 -10 10 22 14 21 37 -22 4 21 11 7 22 -12 -2
7.07799 -2 16 11 -6 10 18 27 -18 -32 11 24 11 5 0 -13 15 13 25 7 -21 -2 -5 7 0 -17 -5 -6 -1 -8 12 14 7 -7 -6 11 -1 6 -10 0 19 10 9 -4 7 5 6 -1
7.05459 -1 -2 12 27 -22 8 8 10 -11 -30 -13 -5 -9 2 -8 11 0 0 -10 -3 6 -6 11 -18 -9 -21 -3 -4 7 4 8 -1 7 -8 -22 0 -15 -5 13 9 12 1 30 -8 11 30
7.03170 30 4 4 6 -3 10 -9 -4 -1 12 11 8 -1 -4 26 0 21 31 45 7 4 9 12 39 23 25 1 6 -3 25 -8 -11 0 25 8 14 2 -8 19 7 22 -5 20 -15 -8
7.00932 -8 4 -1 4 -3 0 -19 -17 -21 2 3 10 17 26 16 11 -1 20 11 24 5 23 27 -2 13 38 12 21 3 30 9 15 -4 4 -5 -9 25 -20 14 -9 4 3 -6 3 23 13 10 23
6.98541 23 8 -19 -2 -1 18 9 -2 1 5 -18 -10 8 -13 14 -12 57 -5 3 2 8 -19 5 30 29 0 18 8 26 10 -13 17 2 6 -2 2 -25 11 -9 3 10 -12 -20
6.96404b0L1k5j3J9K7l8M0k8PJj1J6K2l5j9L1JJ0j1K6k9Rj2Lj0m5O8j6J%k8L4j1lj5L3j5lJ2K
6.94369Fj7NJ6k0K1j1oj9M1k3rK1Mj7MmJ0k2K2j0jqJ0oj2K9Mj2Pj0kJK2Qk0lJ4%rm2K1QTj8J8
6.92080aJ5j4j9J9pJ5m1K4QPnLmJ4m5L7j9J7kTQk4K6j1Rj1j0L2l2J6j5K5m7M8rlm4K2K0j3KJM9
6.89893C9p0M7k5J5%j0OqMj9K9k9K2qPKj2J0nK7m1K3Pk3L5pl5K3k7J2PK4m1OnJ3%kJ7k3J7pJ5
6.87705A0j9J2kl0L4K0j2Kj4Q%j9KQ%jOKpkJNj9qlQmOPTK%Ql2L6j2K0k2J4rJ2k5QqJ3j4K2j0q
6.85212gJ0j0K1j1k2K3j1LJ1pK5k5%Tk8K4j6QJ2Pk1J2nQKj0J4j1j6%PRK2k3K2l2moL2j6%K4j5
6.83025@k4M2j8K8l2k3L0k1k2L8J1K7o1K2lJ0Tk3OTmj8OJ2j9L2j2oK3j7lJ5omj5J6j1L5k9K2l6
6.80939a6oJ5mRj1K3j7QqQkjKjJJ2j8Ol0K1pK3k5j0K3j3J4Pk1L3j3J6k7JJ0J3k4Rl4N1l9OmK1
$$ plain form
6.96404 -20 11 -14 -27 -8 19 -19 21 -7 0 1 -10 6 28 -7 -26 5 6 16 5 31 2 11 -1 2 -8 -53 15 -1 0 0 -28 6 -5 -8 -23 10 -5 -8 4 6
6.94369 6 -11 -6 10 -10 11 0 -6 -25 16 -7 -16 5 9 -8 -4 -8 2 -20 2 -8 -9 -17 -7 -13 -25 4 8 -4 3 -7 -9 -8 14 22 2 -1 13 13 4 -38 -17 -9 -1 -19 -1
6.92080 -1 14 0 -19 0 -7 8 -33 -9 -1 6 1 4 0 14 -31 6 -13 4 2 0 8 -16 10 -1 8 -3 -13 19 -13 3 -12 13 -34 14 5 2 -42 -20 0 -13 -11 -10 39
6.89893 39 -31 16 -9 6 6 -4 2 -6 -2 -21 8 -21 1 -7 0 2 -10 0 -5 22 -19 4 11 -12 23 16 -19 4 -23 -11 -4 20 -21 -15 -20 -7 -7 -9 8 -15 2 -5 10
6.87705 10 -9 3 1 -29 5 25 13 15 1 9 9 -10 -8 0 0 -1 5 7 0 -2 -1 4 -15 -23 -26 -18 -22 -16 -9 -2 0 0 8 -24 12 0 20 -2 12 3 15 -10 -2 -10 3 -11 11 1 -7
6.85212 -7 3 -7 14 3 -19 4 -7 -4 7 0 25 0 0 0 -28 -4 -20 -12 0 7 -14 -2 -7 1 3 -7 7 -4 -20 -20 -13 -4 18 -5 17 -15 -19 -25 7 -9 -9 15 0
6.83025 0 -24 18 0 28 -4 -27 3 -18 -40 -2 9 36 -25 -3 -6 4 14 -9 -3 3 -1 -19 -13 -1 -20 12 0 -6 17 0 -3 12 6 2 -13 3 -8 27 -2 20 -16
6.80939 -16 -22 -7 -11 -2 -13 10 -7 1 -7 1 -1 -2 0 -1 0 12 -6 0 -30 -9 -16 7 -18 -28 -5 -18 -4 3 -18 15 2 18 -9 -8 2 15 -9 0 -34 17 -22 -16 -20 1
6.78701Ak3K9Kpj0J6Oj5pRk6LJ3K8k4kqMJ9pL5m6K9j8J4k9L4m5L0j4rK5j8Oj5K3j4j0L4lj0nj1
6.76513a6Rk3K0mK2Omrj8mK4rj1J4K1k1pK7rj4KJ4k7K6JqlJ6k4jJ5j8%K7j3Mpk1O1l8%J2l2K0
6.74275@J9l5K2Rl1K2Kk4L2j3j1K9l4%K7k4J2L2j4k2J1%j1kk0J7K2j3Ok8J2j6ML9j9j2MJ1l0K8
6.72240Aj2L6j4J8j9k1J4j3J6j6jTj2J5J3oJ6l9K5RNqk5J2KK8j3j7qPk5M4j2lJ2kk2J8pJ6k9%
6.70104a8K6j6NQl1L5Rl5K1qK4j2k3OPj9J8QNpLK0n7J3mK2j1L3l0oL2k3RrTkK0Kj9KK3k0pNJ5
6.67814Ej1J5k0j2oO4n1J3j4oL7pk0kL9k9Ol1N3j4rPl9K4nJ3JJ5k3l2L4K8j3j7L4k7lRj4Rj1p
6.65678a7K3k2L3m7J3KJ1rj2K9mQOk6PqPk0L3q%L0m2M1j5k2NJ0j8%j7K5J2K3j4k0jj5N4n4L0j9
6.63541hj5M1Lj0k5kK6m3K2KK2k6J8k1J9m2L0QnJ5k0K0k0J3oQj2jJ2Nk9J4P%j0J6j3K3j2J6n0
$$ plain form
6.78701 1 -22 7 9 2 -8 8 14 -1 -8 1 -25 -22 -9 19 -5 -7 -15 -11 8 1 36 -10 19 1 15 -14 20 -25 5 -9 -18 7 -11 -5 -20 3 -11 -21 13 10 0 -5 -16
6.76513 -16 -7 -30 -10 -14 8 14 10 1 -17 -21 3 -6 -17 -3 18 -3 -10 17 8 -6 -4 10 -17 9 10 2 -1 15 -9 -10 5 -13 -13 14 1 5 -2 -23 38 0 0 12 -20 0
6.74275 0 19 -16 6 15 -16 6 8 -16 16 3 -8 21 -13 -13 14 -10 2 34 20 -2 9 9 -2 -4 -24 -7 15 2 8 -20 -8 -24 -20 19 0 -12 -8 3 -27 1
6.72240 1 -11 25 11 29 10 -11 3 -10 6 -10 -11 -12 -24 -9 4 -2 14 -25 0 9 14 6 -19 -7 -5 23 10 -7 -15 -8 -33 11 -1 -4 8 6 -16 2 -5 11 -18 -18
6.70104 -18 8 -8 -3 5 -26 9 18 -17 4 -4 20 8 -15 -9 -2 -21 -3 5 10 3 6 26 -31 -18 -22 0 -11 22 -8 -14 18 -5 4 -5 -14 -16 4 6 -13 -11 12 -8 -15 -10 5
6.67814 5 -6 9 -11 -23 -29 35 -16 -3 -17 -23 14 7 -13 -15 24 -5 1 -30 23 9 0 7 -32 -8 -13 0 1 16 -7 -39 -5 23 10 -7 27 0 -3 6 -8 1 -10 -17
6.65678 -17 6 -16 17 -30 -17 -15 -4 -13 -25 4 0 8 14 -12 -5 -13 -6 -26 7 -1 -1 29 -13 28 13 -9 -4 6 -12 -12 -29 -4 8 31 17 -3 -4 -19 35 -19 11 -8
6.63541 -8 -23 18 21 11 -14 -16 10 -33 -11 -9 13 -13 5 -16 3 -39 -9 -1 -6 9 -11 9 -11 2 -4 4 -8 -9 3 8 -21 -7 0 0 -10 6 -7 16 4 20 -30
6.61456c0K4Nj1kJ0j4mPL6ll2Rjk3J0M2qj5rK2j9j1QK5j0j1J2Mj3Pj9QK2k9K1k6LPOnj4PJJ2lP
6.59115ClRrpJ4m9M5k2K7j0Lj1MK2j2J8k7LJ7%l6J0K5l2J7nNQj6Jj6L9m4N6j6TQ%J6j1%q%rJ0p
6.56775f%mJ1KrJ1j7%KRKJLj0j2PL5l7K1Mk6Pj0K7k1Oj6nK3k5K0nL3j7kJ5mj3j6J6PTj6J6l4K0
6.54435@j4J0Oj7J1jJ1j9KljOL9l0K3l9LP%J6j2J8j3J0j7oL0l8J7j4nK6k0K5l0K6j6NRJ1pMj0j
6.52197BmkMk4K9j0J0l9J8K7kk0J0j9M5l9JnRqJ7J4j3kOj5J3nNl7N5j5k7OJKJ5j6K2k5J6k1J4j
6.49959hKOj0k2L3k5M0j8j5J7k1RJ4j0K2k7J0J9j8k5J1JkK4J0l8OK2Ml5NM5l2K3l1K5j5kJ1mL
6.47873Dj0J0K0k6k2M0j3j7j4J6MKk2L3j3QqNj9K7LqomJ3Pl5L4k4L1j6K5m9J6pM8l5k7J0j3K0
6.45787a2J2qJ5pnkOlNj9M5m6K9jk1K1J9m1%J3Tl8ML9j0j5j2J6J7k0mJ1l1K8kOj6L4%k8JMplJ3
$$ plain form
6.61456 -30 -6 -1 -12 -14 -4 -18 -22 -15 21 18 -14 -5 -6 -29 -19 23 15 0 -9 13 -6 -17 -9 16 6 -5 7 11 -2 5 -14 -6 16 -13 8 -18 -15 -8 -2 -7 -21 -14 -13 -1 -4 3
6.59115 3 0 9 0 -7 7 -42 3 -19 8 -2 1 -10 -6 16 4 22 -5 -2 15 15 -21 -11 14 -18 -1 -6 -1 7 -9 -8 -24 15 -29 27 11 -5 3 3 19 8 8 0 0 -9 1 -6
6.56775 -6 -6 -10 1 3 -6 5 -12 -12 -10 -1 1 2 5 -5 -17 -10 25 -12 9 13 -13 -6 -16 11 -10 -4 -20 -25 -2 -27 -7 -12 21 4 2 17 13 0 -16 0 7 14 -2 14 -20 0
6.54435 0 -14 -4 2 -15 -4 -5 6 -13 -11 -14 -15 -9 30 0 23 -16 -13 -6 -6 10 -2 16 3 13 -4 -10 20 -18 -1 -15 -20 6 -14 11 -19 7 -9 -4 5 16 9 13 3 2
6.52197 2 -2 -4 0 -24 5 -5 5 -34 -16 11 9 -11 -1 -20 25 -14 -13 -18 -9 -17 0 14 1 -1 5 -10 3 -2 3 -34 21 6 -21 -15 -14 -12 3 -13 9 -16 0 -21 -7 -8
6.49959 -8 -6 0 -10 -32 1 -24 16 -2 -17 0 -21 -12 2 -8 14 -13 -3 16 -2 -27 -16 -15 -17 7 17 -21 -15 7 11 -24 -19 26 -6 17 -14 11 -4 -6 5 1 4
6.47873 4 -6 4 24 -2 -24 16 3 -14 -28 -12 -8 -6 -28 5 -8 0 -8 -3 -22 5 8 0 -6 -10 3 10 -25 9 -15 16 0 25 -24 -8 -15 33 -2 -29 -19 -32 -12
6.45787 -12 0 -8 7 0 -5 -7 -1 -4 1 -18 27 -19 10 9 -12 9 28 -13 -13 0 13 -25 -21 18 8 -7 -19 -3 14 -6 -10 1 -30 -2 -4 2 -14 20 20 -8 -7 -3 -10 -13 0
6.43498@Lk5K9j1j2Lk4L6j1LK4j8%Lpk6K7P%Qj0J3j7QlPm6L8j3j0J7NjRj8L3m3NqL4J0n0L9lj1
6.41209fmj3J3K5k5j0QpQJ4K3nk2mJ4j4J1kmm2N0m5J3K6k5J4rK0kqJ3j2kL%k1K6Npj7J4mK0Rk9
6.38920a0k7M0mNk1M1oj3Ol2J7J6j2k3L5m6L4j3K5l0j1J3M4m2K1kj6J1k6J0J3J0k2K3Rj4rjj1
6.36936a8K3qNQj1QmOk0TL8k1J0j6L2qoj4L6j2K1l5mK2j6J0j0%j0k1J9K3oKRj9MjoJj7J8Qj%k4
6.34596b5J3Tl9N5n0O6n2L1k3J2k6K0j1L4nm0K3j2KJ4j5J9M%k0J6rkK3pLqlj0pJ5k2J9J4k4K1p
6.32459@k6K4J0l4MlK1jj0K0j5LQTj7J9j0j7TK1J9lJ1j0l1K2oKQL1m8K6QJl2l1N5nrOklL3m7n
6.30170b2K0J8n5K7J0j2J1jK0opj4J9j6J4oJ0J1m5J4qL0j8rOmJ0Onk2K4k3J7qL6l3j3K4J2k1K0
6.28084A1j3nlNK9l3Ql2L0K1j2k2J5JJ1j2j4J9lj4M%J2Nk1Pj2K3l0K5k4OKjJ2k2K4j3K2k4JpN
$$ plain form
6.43498 0 3 -22 7 -4 -16 -13 -37 -1 -12 -9 15 -3 -3 0 -7 -33 -6 1 1 9 -1 12 -5 3 0 7 -39 -1 -14 -24 -7 -2 -3 6 -12 21 -22 -17 -25 9 19 -31 8 5 -6
6.41209 -6 -10 -23 -10 15 -10 -20 -12 -19 -11 3 26 21 -1 -5 9 -5 6 4 0 -42 8 -37 -24 2 -23 -9 -18 2 0 -8 5 -7 -9 -6 -6 -27 -1 4 -3 -20 -6 -10 10 19 -10
6.38920 -10 -37 3 -1 4 -17 24 18 5 11 -21 -4 12 0 -23 12 -34 0 -13 12 -18 -29 -16 28 -14 7 5 -11 0 -26 -16 -3 7 -15 8 17 3 -6 -7 -18
6.36936 -18 5 -3 2 10 -1 7 3 9 -11 -31 7 -14 -4 -20 12 4 -2 -16 20 8 29 -6 -10 12 -4 6 -4 -4 -14 -35 -16 7 1 3 12 -7 -3 -4 -10 -9 -26 -8 0 -1 -1 -25
6.34596 -25 -12 1 -38 17 -33 33 -19 12 -11 1 -25 -5 -16 18 13 -27 -4 -16 -14 0 -15 4 8 8 -12 4 -5 -7 16 9 12 4 1 -9 -16 -1 -23 -4 10 -14 7 0
6.32459 0 -26 -2 8 -26 -22 -25 -4 -5 -15 5 -10 -7 1 9 -8 11 1 -16 -33 -12 7 4 15 5 -26 -4 -10 -8 0 31 -17 9 17 18 -14 -45 10 5 -4 2 0 -3 30 -17 -22
6.30170 -22 -2 16 -39 -12 -2 -14 -3 -4 16 10 3 -11 8 -8 6 0 10 21 -24 -10 -18 12 -6 -15 -9 -13 -3 3 -2 -24 0 -23 -6 -14 22 -11 -24 0 12 -9 11
6.28084 11 -2 -7 -10 -5 24 -9 -1 -33 -3 18 6 -16 -1 0 11 -1 -15 4 1 -13 -9 -9 3 8 -13 -6 -18 5 -25 0 -24 -18 -16 -17 -5 -27 -3 -16 6 -18 -17 -24 -19
6.25897a9J2J6l8K9k3J4POK1k7MkJ4qj7lpJ6k4J3JL4j7kk3L6k3oK6j3j1J1MKrnmKNJ1j3PKj4J6
6.23607Aj9J8k2L6j1jk2J3qj0K4Nk7%L4kjl8N9m4jj0J5NnJ7l3M%M4m8K2Lk8L6Qnl9M6l6K3kLj4
6.21369a0nJ2qJ0JlJ0k9K1mJ3Pk8L1l6J7k4K4%Oj5NJK5k8MJ2l2L5j0Lj7K8k4J3m5N5k0K6m4OL1
6.19233A4j8qJ3l0L3j0k0K9j7j6J5Tj0kK2k8pL9j1%oj5QK2j6k3jJ8Kj2L2mj6j7K2%L2o6M2k2N0
6.17147C3l3J1ml%Mk1pK8qPk0L6k2oj9L4j5jpJ0Rj0QrJ7k4J0L2m7PJ5Qj9lOLJ3Nj8pnk2K5KLKR
6.14705GMk7K5k5J0LokJ4mMlrmJ5oJORkk6kQj0J4MJ9j8KJk3PRJ4j0k0J5Oj8j1MJ4QLPj4J3k6K2
6.12212Bk%mJ3Klkj6k1K1MkOTpTPj5J8J6rmj5JpK9k3mnJ8j4K6kqJ3j9J5k4J6j7K2rj8K0qJ8j8
6.09821a0L1m2L6nk3kK7j2Rj5j6M1l7J4JJ0JQk1j2j0PML0nj3k1J3jJJ2j2OoJ2Tl9J7j0MJ7Jkk2
$$ plain form
6.25897 -19 -7 9 -29 0 -23 -9 -2 4 25 -2 2 0 14 6 -11 -14 -21 -5 -29 -16 -15 19 2 0 -23 13 -10 -16 10 -3 -14 -3 1 3 -6 -11 -15 -13 -8 3 -10 -3 -1 -15 1
6.23607 1 -18 0 -22 14 3 2 -20 -7 -15 -25 -1 4 -23 -23 11 9 8 -30 29 -15 -16 -26 -11 -6 -11 6 -27 -23 -23 21 -27 -5 -2 -30 6 14 9 -30 16 -20 3 1 4 -10
6.21369 -10 -15 -3 -11 -1 0 -3 7 -22 -1 -5 8 15 -13 18 -18 -1 -25 -1 -1 5 -10 -5 -4 21 -7 -3 9 -23 12 2 5 -12 16 -8 5 -40 15 -5 21 -23 -17 14
6.19233 14 -4 -12 1 -29 4 -6 -26 3 -14 -30 -15 0 -10 -12 10 -18 -25 14 3 3 -3 -18 -10 12 -4 -27 -28 -10 -8 -20 12 8 -8 -25 -3 -3 29 -37 5 -17 33
6.17147 33 0 11 7 4 4 8 -13 -20 8 0 7 -13 23 1 -5 -24 10 -5 -6 -13 -3 6 -4 4 -5 12 -12 -2 30 -17 -10 5 13 -6 -9 -3 0 13 18 0 -7 -12 -34 -9 -7 -4 -2 7
6.14705 7 11 -16 9 -16 -6 -3 -9 -11 3 -1 3 0 -9 -13 2 -4 -3 3 12 10 -16 -18 -10 -20 -6 -2 17 -1 1 2 -21 -14 -5 9 -1 -21 -6 0 -18 -29 -25 -11 -3 0 7 -7 6 -20 2
6.12212 2 0 0 -4 9 11 8 6 -10 -31 -10 -6 -8 -2 4 -3 -10 -3 -18 0 16 7 3 -12 -11 -18 11 -12 -16 -21 -3 -17 9 7 -1 12 -7 8 -16 0 -17 5 -4 -22 -2 -10 8 -10
6.09821 -10 21 -21 15 10 -13 -15 12 0 9 -6 -22 19 -18 -4 -3 7 8 16 -5 -17 -27 -20 -16 14 9 -4 -25 -12 -13 -12 0 -12 -6 -12 0 12 -27 -10 -20 -16 1 2 0 -22
6.07583b2J4lK1pTKlJ5poJ2l4M1l5K7k1%Qj8J7J5j6QONj2j9JJ1Mk5K1Noj9L3rKk2L9j6qJk8N5
6.05294B0l7K9m6J4kJ8j1RK4k6Nj9J6m7N5rqJ1qJ3j4RQk4L5Kk3nJ4mj2K3jJMk3J2Pj8mJ0Tk7K6
6.03055Gj7kj6L4k9mNK2j0pJ0qK8qkj9J6Kk4J2MOolLJ0k4M0l2J9j6J1mTOk1%J9j9K0kJ7m2J8o
6.00766a6J3j8L0k0J1pj1J6pJ2k8L4j2J2k4K6j4Mk8K7Oj4TJ5K8n5L6k9J2JNpJ5rK1nmPn0L7j4R
5.98630imJ6j9LK6l8K8%TnkNpKK0j2nTJ1j8RjrnK6j6j3M6kj3j4k7PK5qJ2J4k0KqJ4k4J7mRrmq
5.96188a7K3j2J8k7J9k2J1OpJ0j1JJ6lj7NpM0m1K4j5Ml0L1Rk3qOJ4oRJ0lok1ORKj0K7k4J3jJ1
5.93950A3n7N9j8rlM5m0nrjK5j6L0k9KJ6l0K2JjrK4k5Ql5M9k3L0k3Ml7J2TL2k4NJ7j3%nj2OK5k
5.91711A1j8J2lNo%rKlj2L1k1oJ6J4l1L6j8M%k4K5j1mJ1J2n4N7l4L4l4K7rpk8J4LKK0%j4j2KJ5
$$ plain form
6.07583 -22 -8 -11 10 3 -4 -2 -5 10 3 -3 9 -25 16 -19 8 -13 -13 -5 -23 -6 9 -7 1 7 12 0 -19 -18 -7 -3 -28 -7 -2 -8 -27 6 -3 -1 -23 16 0 -8 -7 -35 20
6.05294 20 -17 12 -34 -20 -22 -4 -15 -6 18 -8 -3 -22 -6 -53 2 -7 -15 -4 -12 1 -13 -4 4 -20 15 17 -6 -11 3 -1 -13 10 9 10 14 -9 3 10 -8 -12 -2 8 -19 7
6.03055 7 -10 -12 -28 6 -23 -27 -22 0 -10 -17 -7 -15 13 5 3 -16 0 2 -22 -10 -6 0 -6 -9 -6 4 -20 20 -12 7 -9 2 -2 -6 0 -21 -21 -2 -21 -1 -3 14 -28 -10 -16
6.00766 -16 -3 -21 9 -11 0 -7 -18 -2 -9 3 -25 9 -3 9 -15 11 -3 1 -27 0 6 -8 -22 -7 21 -34 2 -27 -15 -14 -9 -16 -1 -10 11 6 2 9 -41 -4 -18 -9
5.98630 -9 -13 3 -16 -13 13 -25 3 3 3 -2 -4 1 -6 -4 16 4 -1 -6 5 -13 -4 -5 -14 -19 7 -9 -22 24 22 9 -5 -32 -25 0 -8 4 18 -2 0 -8 6 -18 -1 -5 4 -5 -9 -17
5.96188 -17 6 -6 12 -15 4 -18 -7 -1 -8 2 -9 -8 8 5 -12 -7 -14 26 -15 9 -6 -2 -32 -1 8 -15 -23 -17 -3 -9 0 10 7 1 -20 -14 -5 -3 -13 14 -10 3 2 13
5.93950 13 -44 15 -3 -12 -15 30 -10 -15 -24 -25 0 -16 14 -15 -13 3 -27 -5 -4 -5 -14 10 -15 -7 -42 7 -16 14 -9 -5 -42 -30 -18 14 -10 -5 12 -1 -1 -6 -18 -12 13 11
5.91711 11 -7 5 2 7 1 1 -8 -6 -9 -21 10 -11 -17 -1 13 -18 18 0 4 4 -20 5 -6 -10 1 13 -41 16 -18 16 -18 9 0 -7 -35 -21 -18 -16 4 4 -10 -22 -20 -5
5.89473ejj2K2k7J7kNl0J9kK3j3l5M1k2K1j3Nj5J8Jmj6M0j9TRNJ8l0L5k0J9k0Nj0Nj2J4Rj8K1K
5.87285Ij4pnkJ5J1K1m6K0k9L2j8J2j2mNToPJ4k8K0Jj9TM1j4K1j6NJ5j9K2o2L6PjKj8M0j6j1j0
5.85098a5J5j2MPj8J4mRJTj4k2QK0KRrOj4Rj7K6l0K3j0jJ4JPk4K2k5J2JJ3j1TJ3lLj4lJ1NJ2j7
5.82758fMj8ML0j6Kl8K7pK3l7M6k4K3l3K1j0KOl7K8rQ%OnJ1k9K1mLk1M6j3j5oL2mJ3m2K7rLl2
5.80520b9L8j0j6L0l7L6k3j4L1k5K7j9jJ2Nnj9K0j7rKL7k4Jj1K0l0KK8J3j3pjlJ4Ok7KMpNj5N8
5.78332B9k8j2K3j3k7K7kQj8J2k3K4KQj5K3j8J1j1MkoMlJ1k7L8k7J6PJ2k1%Mpj6nJ7lJ1mJ2kk3
5.76094a0Qj8K6mJ0Mlk3k2K4jj5J3K7j0l0K1kk2K3Qj1nL1k3O%Ok1M1l4K6j1L8J6klk4l5Nk5M8
5.73957B7k7K2k4R%qK1m5L2k5lJ3J1j3LmJ7qnK6l7J7K8j2J9m7J6j4j1K9j4oK1k0rJ0OJ5j2J9j0
$$ plain form
5.89473 -5 -6 -18 4 -23 -6 -8 -3 -33 -14 -16 7 -6 -41 0 -22 -1 -14 -9 -24 -6 -5 -9 -25 15 -4 -23 -14 -9 9 -21 14 -6 13 -7 -2 -12 -7 -19 -5 4 -14 7 9
5.87285 9 -5 -12 -17 -19 -4 7 28 -18 2 -27 5 -13 -1 -13 -17 -12 -7 -13 -6 8 -20 0 1 -18 -37 4 -10 11 -5 0 15 -4 18 -44 -8 -1 -2 0 -18 22 6 -5 -15
5.85098 -15 0 -12 -8 -1 -19 -5 -9 0 1 2 -12 -34 -26 -6 -4 5 -4 2 -12 -3 -20 6 -24 -1 -11 -12 2 3 10 -14 8 -17 -5 -4 9 -2 -13 0 -3 0 -14 -17 -6 -1 11 -6
5.82758 -6 -2 -20 -16 14 -2 0 -38 -11 -18 5 -32 14 -10 13 -20 1 -9 -7 -1 -38 -10 -19 -11 -11 -5 -10 1 -28 -7 -11 -8 -29 17 4 -11 -17 15 11 24 -18 9 0 3 -29
5.80520 -29 9 -1 -17 13 -24 12 -11 -25 6 -19 8 -11 -12 0 5 0 -19 1 -16 -25 -23 14 -10 -9 -20 0 -30 -28 0 13 0 -7 -8 -11 3 9 -18 -16 -12 -19 -14 -29 29
5.78332 29 1 -11 12 -1 -28 -1 -3 5 -13 -1 -24 0 2 10 -5 18 0 11 0 4 2 -4 0 -3 8 -19 19 -8 8 15 27 6 6 10 3 -13 -18 -1 -4 7 3 15 13 -10
5.76094 -10 -2 -20 6 2 12 16 13 -10 -32 -8 -9 -24 -11 16 6 -24 -3 -5 -27 -4 4 -7 -12 19 -4 2 2 8 -13 28 -6 20 9 47 63 61 58 34 -1 4 -21 27
5.73957 27 0 22 -2 7 7 -1 20 -25 7 -18 -21 -8 3 -10 -7 -11 6 -2 -7 19 -18 -1 27 15 34 -13 3 -11 -22 7 -7 -13 8 -12 -21 -11 -5 10 -2 17 7
5.71871GmlTj2qKJ8Lj2J0kRkMQoJ6k4rJ4j8K0k3J0k8L0k2L4k9K6j5kj0J2NQK4l6KjNJ3m7QK2J2
5.69531Fk1K7l1J1Oj2K0l2L3j7J3m2N9m9L3oPl6K2mJPrj7M5j8JLoNo%j4J0kNTMK0j8nrJ3j5J0m
5.67191gLqK6j6J8k1T%K5Oj9jK3Kk0J0qQmNJj1k1RJ4rO%j1mJ0Nj8NJ0oML2k2%Oj1oJ6%lj2nJ4
5.64699fJ8m9L9kj1Pk9L3j6K5rj3MJ7lpqjj7K0j2kJ4mjRjJ4j9J2k0J1oK4m2L1l2L0J1j9kRprJ1
5.62409hj1K5Lj8Nqj7mK2J9rPj1j9K7kNj1l1L5RNJ1m0l0M2Nk2MJ4Kj6K4j2k0M%QK1k4NJ%Pl%N%
5.59968aKj1Pj4K4j3oMoMTk2L7j2Lk0nK4j7PJ8k1K2l0J1qK3k8K3Rj9K1%j0k6M3k8Pk2J9k8K2LP
5.57729ck7J5J9mLj8RoJK0pk4K2oj5K4j5okK1j2MJ8k7K4j9%kMjJ0KMNlj5PJ%pJ1nK9n3L1pK3m0
5.55287a7L2l9J9kJ0kk8ML0oj5OJ2j8L4Jk2lnKjMkj1K4k9JL6k9RrK2k8OjJ6k2K6l0M8j9k3K4k4
$$ plain form
5.71871 7 3 0 -3 -15 -23 -21 -3 0 -12 -2 -4 5 3 7 15 9 25 1 -8 6 -12 8 -15 -5 -33 -3 -25 9 -20 6 -9 -11 -21 -9 -4 4 28 -8 -6 -7 -2 11 -36 -28 -6 6
5.69531 6 -15 12 -19 -8 -2 -14 6 -26 7 -10 3 -39 20 -29 4 -2 5 -31 -9 -13 -12 -5 -14 -31 14 -4 -3 0 -6 -1 -7 -7 -21 -11 -13 -8 -3 1 21 3 -2 -11 2 -13 -3 -7
5.67191 -7 -4 -12 14 -2 16 -5 -26 -26 -1 5 -14 -15 8 10 -10 0 -8 0 -4 1 2 -9 -30 -21 -7 -16 -10 -10 -21 -25 -15 -10 -28 -23 -13 -19 -15 17 -5 -5 1 -10 -16 0 0 -3 -15 -20 -6
5.64699 -6 12 -37 2 0 -11 -4 -33 0 -16 9 0 -13 -9 8 5 -2 -10 -11 -28 -8 -20 -22 -8 -12 -13 -4 -5 9 -10 2 -18 -7 -13 11 -31 0 -32 -2 9 -10 -12 -3 -10 -19 -8
5.62409 -8 -19 6 9 -9 -4 -12 -29 -33 -11 8 -1 6 -5 -24 3 1 6 -5 -36 -1 8 13 24 -16 -46 -4 1 -21 -17 -3 -1 -17 7 -5 -25 -21 -21 -13 8 -16 -11 -10 -10 -3 -6 -6 -1 -1
5.59968 -1 1 -10 -3 -17 7 -6 -12 -8 -14 -10 -6 -28 9 -3 0 -20 -25 -1 -18 -11 7 -14 8 -22 -11 -19 4 -24 -1 8 -11 10 10 0 -26 17 -11 -4 -26 -7 -35 -13 -10 -3
5.57729 -3 -30 -15 4 0 3 -15 -6 -12 -11 9 2 -22 0 -6 -21 3 -12 -18 -20 1 -11 -7 11 -16 8 -11 -11 -13 -9 -10 0 2 6 11 8 -7 0 1 1 -6 5 0 29 -24 7 0 23 -17
5.55287 -17 15 -24 -5 -7 3 1 -27 -23 7 1 -14 -8 4 -14 20 21 -1 -4 -9 -7 -8 -4 -6 -17 7 -22 -21 15 -14 -5 -14 8 -20 -14 -15 1 -21 5 -25 23 4 -19 5 -19
5.53049a9J6j8J1J4j6J4l2J7K5j3Oj8k1K4K5m0M1j7j2NJ8j6kJ1qj4QNmOMj4K1j7J7j4kLl1M0ql
5.50913hqJJ0Tjpk5K0k9L0j5jnJ3K8m5J8j5RJJ4NLk7NK5k5K8j5nJJ0nJ3k0Nj4LJ0K5n3N4j7TM
5.48623a2k5J7Mj7K0lJ1PqKj9J6JQnOlJ0k4JMoJ2j7K2j4J6ql%LTjJ2jj0Lk1J4Mj0mK6j9Mk4K8
5.46232@k2NKlK1j9L8n0%NJ3nL0l0j2J0j0L2j9nNPOrJ3qlj0K4lJ8m2M0m6L4NjrPj4j2lL0oj9K1
5.43892Fj6K6k4KJJ0k5K8k1Q%NJ6j1k7K1l3K9OTJ0j7Rpjj2lJJ7mk2K5Nkj0K2m2K7j0qJPNk5L9
5.41603A2j6l0RL5Pl1L5m6L4qoRl0QL5k1k9ML4qj8K1j4K8j1TJ4m1L9mrOJ3m2K4k6M6k3MQk5LL6
5.39416A5k5%J6Qn5M7j1j3K0J3j6K%j5L0k0MjOj4j5J8pK1qok3KRL6k0lj2kK4NRm4J4j1J5j6M6
5.37228B3j7k4lK6j1Pk0L6k3K8l8M2m0K2k6K3Joj6qLnRK6J3l2MOjrJ2k4J9j1L5l7RoOmOj0%k3R
$$ plain form
5.53049 -19 -3 -21 -10 4 -12 2 -30 -13 12 -1 5 -13 -34 -10 15 -25 16 -1 -13 -8 10 -6 -8 3 -5 -19 -11 -6 -10 -4 0 -14 7 -10 7 -7 -9 -6 -37 3 -5 -8
5.50913 -8 -16 -15 -5 5 4 -3 -28 -8 -37 -7 -22 -23 -28 -15 13 -32 -14 -29 -20 -19 -5 0 3 -24 -19 6 -19 9 -6 -11 -10 0 -5 8 -12 -7 -21 -18 -8 17 -36 18 1 -16 -12
5.48623 -12 -37 -20 -16 -33 -13 -16 -5 2 -6 -4 -23 -7 -6 2 -3 3 0 10 -14 -13 -9 -15 -3 -20 2 -12 4 -4 -7 -7 -4 -1 -2 10 9 -1 2 -19 -5 -1 -11 -15 11 -8 -4 -28 0
5.46232 0 -22 -17 -15 -18 3 -16 22 -28 -28 -23 -10 -15 15 -15 -27 -17 -27 5 -14 -19 -14 -7 -1 -10 3 -5 -8 -18 6 3 21 -21 19 -27 7 12 11 2 9 -5 -17 -20 10 4 -15 6
5.43892 6 -10 16 -8 -6 -5 5 -20 8 -13 -5 -5 0 16 5 -22 -1 -34 -5 1 7 17 0 9 2 1 -11 -14 -13 4 0 -22 3 8 6 -4 18 -24 3 -7 -15 -14 -7 -2 -27 12
5.41603 12 -4 -34 -25 10 17 -14 21 -25 9 1 -5 4 -26 -18 17 -4 -33 -29 5 -3 -21 0 -14 14 3 -8 6 -35 4 0 -9 -3 10 -32 -8 -34 12 -11 -7 1 -24 -21 15
5.39416 15 -10 -10 6 14 -41 6 -5 -18 2 15 -1 1 1 -14 16 -4 0 -1 5 -9 -24 -6 -13 8 0 -6 -29 -27 -18 18 -2 -5 -17 -19 5 10 19 -25 -11 -22 -7 -23 23
5.37228 23 6 -18 -21 5 -6 1 -19 17 -6 22 -16 26 -14 8 -18 5 6 0 -16 -24 -21 -26 -17 9 22 -10 -6 0 -1 -10 2 -22 -3 -14 21 -16 -7 -13 -7 -11 -5 -15 -15 -38 -29
5.34939b9J8J0j7L4j5J9j9l8L4jTj4K6oj3L5m2RJTNQk6M5k9j6K9rj5kj2L0Oj6J2ll2M1k7M2n6
5.32853c3J7NK6j6J7k0Kj1qjLK2j1J0j7J4%J2k0k3K8J3l4ROQj1lPJ1j1nlK6Jk2K3k3Nr%j6L6n4
5.30615e0N3j2Ml6L5KkK4l9J9j6J4j1J8k5K2%m7L7j2kL3k2TM1qj5K9ok4J0J9l1J4QrJ3JrKJ6k0
5.28478dj1oj3K2qNPJ5j5j6kL2jm9J9TnORj3J2kmLJj9K2l5O2k8oKPJ1l2Ok6K9kOKj2Pj4oJ5Rj9
5.26037b0J8lj2NoK0Kk4K3j0j5J0oMKk0K5MTRk7RkJ1pJ2j6QJj2J1Kk7K8jj0oK5m5L1j0J8l2J5
5.23798a4J0nj9J3j1L1m7M1JTK3%l1RJ5k3JN%Tk1J3Qj0Oj0K1j9J1l0N5l6Mk5K2rJ0j8J2j4M9m3
5.21662b4L5k6RlRj5LRk0L1m7M7l5j7L4kJ5nLj9Q%K8j3j0oRPj0Qk4J5J6l0J7lJ0k1K0j5JJ4Mj7
5.19423a0kL7m8K5pNlJ2k5ORK9m6J7n8O1J3m5J1QK7n4O3m8J6j7K1J6k2rL2k6j6K2ROk6j5K6k2
$$ plain form
5.34939 -29 -11 -1 -18 16 1 20 1 -37 -3 -4 -5 -19 7 1 -12 23 -19 -10 -9 -8 -3 5 -21 24 -5 -21 8 -1 -16 -18 -30 0 6 -10 2 -1 -33 8 -19 23 -33
5.32853 -33 -16 -11 15 -1 16 -4 -2 -13 -21 -22 -19 3 -8 2 -15 -1 -1 11 -9 -32 -4 9 -25 -16 -10 -2 -13 -16 -9 2 -9 -14 -17 9 10 -12 11 -12 -7 -16 -16 -32 4 -50
5.30615 -50 3 -9 -5 -41 -6 -4 -6 18 -21 -2 -18 -4 -15 3 -22 0 0 -47 -10 -22 -24 9 -13 -35 6 -2 -17 12 6 -18 -8 11 -20 -6 2 -7 6 7 -2 0 16 -4
5.28478 -4 -15 -21 -34 -12 -20 -15 -8 7 -8 -24 -26 6 5 -44 -25 -6 -11 -5 4 -9 3 1 -3 0 1 -18 4 -31 31 3 -3 -1 6 17 -15 -9 -35 -6 -8 -2 0 -12 -5 -19 -25 -10 -1 -20
5.26037 -20 -2 -5 -17 -12 -18 2 4 -20 3 -7 -22 -12 -18 -14 -12 -32 -7 -3 1 10 -17 -8 -10 1 -6 6 -10 -2 -1 -13 -2 0 -27 1 0 -10 -16 9 -36 -5 -15 3 -29 -14
5.23798 -14 -4 -9 -28 -15 -26 5 -42 -1 0 1 24 24 -7 2 17 -6 -5 0 0 0 -21 -8 0 -10 -4 -14 7 -12 -1 -31 24 -12 -8 -33 -11 -20 -10 -28 -16 -30 19 -24
5.21662 -24 11 -15 -6 -9 0 -15 -12 -3 -23 8 -39 8 -27 -44 -10 -12 3 -2 1 -18 -10 -10 18 5 -5 -11 -2 5 -5 3 -21 -6 10 -20 -3 -6 4 -17 3 -12 -11 3 7 -10
5.19423 -10 -12 25 -23 2 -5 0 -3 9 -16 -10 -1 28 -18 -1 -59 2 15 -30 -19 -11 16 -38 25 -23 -7 -24 -3 13 -9 -18 14 -12 -28 -6 3 9 -17 -32 -6 -28
5.17388b8J7RJ6J7m2J1OJ8m5L5j2J3kk4j4J5OkNj3J1j6PJ2Nj6j8kL4knNl8J0K1J2k4K7l6K2rK5
5.15252A1j6J7m1M4nl6RJ5jj6MJ2K%Jj9K7j2KLNMj1J2Mj2J0j3J1Lrn2O4n4J3J7J1l6M5l0J4k4
5.13115b7K9pK1j2pl0L0k3K2j6J9Oj6l6K0K3K9n8P%RkK0%qJ0Qj1NrJ4k3J6k8J6J8j2pJj4K0J2
5.10979Ik1MN%nKj1L9k1J2nkl0J4j9K4NLj4oK0mk3K1K0j5j4PNj4K1k8J1k4L3pMj2L3k2lj0J0J8
5.08740A0j0%jJ1omrk0K9j7PNj1J6k7K7j2TK3Ll2J0RJ8lqj0K3m0L1k6L6j1Jk3L2MkmKJTpj0Rn5
5.06400e2N5k8J7j9L0lpK2n5M0k2%K5kj4J0k1L4roNj2QTj0jJ1j4%kK4k4JMJ2k8%J1RpmJ4qK1j3
5.04111@J0lJjNk6OJ4j2J2rJ9k1pJ1Ql3K7Oj4LTk5L5k2j5L1qj8J7MJ5k9J1l2M8j9J2k9J7jNJ1
5.01924Gj0j6pK1M%rL1m7K6j6K3j9J8k7L1J8m3KPoQJ1qoJ0pJ1pj1P%qPlqROMNk8J3j0J1J9mPj6
$$ plain form
5.17388 -28 -11 -2 14 31 -11 0 6 24 -21 14 2 15 13 -11 -25 -10 -4 -6 -1 -14 -3 -19 -12 0 5 -11 -29 -31 3 1 -4 1 -37 -27 -6 6 -18 9 -27 -5 -14 11
5.15252 11 -5 12 -29 15 10 -26 -17 -2 -3 -19 -15 -3 -1 -1 0 -19 8 -4 -2 1 6 10 -1 11 15 3 13 0 11 14 5 -47 17 -37 -24 -7 4 -32 13 -17 -3 -27
5.13115 -27 2 -5 16 4 -3 -33 -3 -26 -4 -20 -1 5 -11 -47 -27 -4 25 -33 -26 -26 -17 -19 1 1 -7 3 11 0 5 -4 10 -13 3 -25 -9 9 -3 -10 -9 -23 -3 9
5.10979 9 -12 -8 -3 -3 -8 -6 -17 22 1 13 8 6 -24 -10 -29 -5 0 3 -11 -17 3 -1 -24 -3 17 2 -12 -5 0 -14 7 -21 -10 -34 -1 -8 -4 -16 17 -5 -8 -18 -8 10
5.08740 10 0 0 -1 10 4 0 -9 -29 0 -17 -10 -5 -16 0 -27 0 -12 -24 -1 2 -30 -20 -11 7 4 -4 -14 9 -31 0 -26 10 -1 0 -23 9 13 11 7 9 10 11 4 -6 3 -52
5.06400 -52 3 -25 -8 -27 3 0 -7 15 -40 0 -22 -22 3 1 -13 -3 -24 10 1 -5 0 -12 -4 4 -6 -7 4 -10 -10 -12 12 -12 -11 -7 5 -23 -23 -12 -3 -10 -14 0 -8 13 0
5.04111 0 10 7 8 7 12 -14 -8 6 -6 6 -3 16 -5 -12 -1 7 -26 1 7 -7 -4 -1 -26 9 -13 -28 3 -5 -23 -6 -2 13 -16 -5 -37 11 -8 4 -25 -8 -9 -4 7
5.01924 7 -3 -19 -26 -5 -1 -1 -10 21 -26 0 -16 7 -12 6 -21 10 28 -15 -13 -6 -12 -4 7 -1 -7 3 -4 7 0 -11 -4 -4 -12 -5 -8 -16 -7 -1 3 8 -20 -7 -17 -6 13 9 16 0
4.99482@j7J2ok9J2K0kK2j6PJ8o4M2lj6NpLrK3pTJ7j3K0j1jpJ4l8K9J6k4J8j5j2J3OkJ8m1K6J
4.97294eJ2k0J3J8j8j0K0j7L9l7Qk6K3kqj4N%K7%l6O9o9K8oJ4qj2nJ5Qk6L2j9K1j4Oqk9M6m5P
4.95158b3K3jJj6J5J1j0J6m9L8l2K4j0J2k3J9lK4j4TMk2J3rK3j9K%J7KTk2L3l3J9jJ2l0L3k4MT
4.93021dj8L1j5j1JMK2l0J8Pl2K2MJj4J7k4K2k9J0oNPnJ7nj0J4j5K2j1%lJk4JL4qJ5m5N1k0moL
4.90732a0koNjJ6QjpLk6QJ4J2k9K4k2Oj2K0nj3J7Mk7J1J4Oj5mjMlRJ1j1kLjoJ9j3kmJ0j0LJ1k6
4.88290b1L8m3L0oml3L5LJ4lj0j9K8j8j3M5n4K3JM1m1J%j0L3l7lK0jNJ1k7RMj7pN0m3L1k1J6j8
4.86154a1K6k1rK5j2J7k3K4k8KROmJOql8M0l6K3jPk6J5J4KpPK4m0K6k1QpkJ1j3JJ2j6K0pL7n8
4.83915b5O4m6J9j9J4l7L3nOL6n2K9n6M6k1krK1Ok2L7l0L3j1k1j8RK6K1n3K7j8Mj0L5l2J3Ql2
$$ plain form
4.99482 0 -17 -5 -11 -40 -28 -8 -10 12 -4 3 21 -43 -1 -4 -20 -15 -22 -19 -28 -5 -12 -19 -2 -15 5 -6 -7 -14 0 -38 -9 7 -17 1 -14 -26 -13 -7 -9 9 -32 -6 -5
4.97294 -5 7 -13 0 18 0 -10 10 -7 32 -5 3 -23 0 -2 -10 -24 -19 -19 8 8 -28 41 -28 0 -6 8 0 -12 -17 -2 6 -20 12 -7 14 0 6 -2 -31 15 -30 -23
4.95158 -23 0 -1 0 -16 -1 10 0 16 -33 5 -27 -3 -13 -1 -24 -5 -8 16 2 -12 -8 -30 -17 -26 -3 -22 -20 -20 -3 -1 1 -21 12 -21 -2 -3 9 -21 12 -12 -8 -4
4.93021 -4 -22 9 -6 -17 -16 -12 10 -20 -2 5 -27 -5 -1 0 -14 3 -21 1 -28 -18 -24 -19 -12 -17 0 -5 -15 -1 -16 6 -5 -5 -8 -7 -31 -30 4 -4 11 -34 17 -3 -7 -13 -10
4.90732 -10 -12 -18 -13 -14 2 10 9 2 5 -21 -13 1 13 -16 8 -14 -8 -20 0 -5 -18 -1 3 -24 -13 1 7 -8 -12 -13 -9 -12 -3 8 -3 -5 -2 -3 -9 10 -3 -5 -9 1 -9 -6 5 -21
4.88290 -21 17 -26 4 -2 -6 -39 -4 -1 13 10 0 -19 9 -9 -22 23 -31 -8 -7 34 -7 -6 -6 -16 17 -20 -23 -3 -4 1 12 -15 -6 -2 -19 -26 24 -19 12 -9 7 -11
4.86154 -11 15 -6 -15 10 -2 15 -8 16 -12 -10 -1 5 1 2 8 0 -38 2 -34 -11 -12 -5 -31 -16 -2 0 -7 0 24 -16 10 -11 -3 -10 -12 -1 -14 -13 -1 -17 3 -4 33 -25
4.83915 -25 39 -7 12 -7 7 -30 3 -2 4 40 -12 17 -39 7 -14 -16 -25 -4 2 -20 17 -13 20 9 -12 -30 -21 5 26 -27 0 -18 -14 -24 11 -21 -8 0 -32
4.81931c2L8k8K2pJJ3j2k5L5qkj0KJ2%Pk2%JJ8rj1QnJ1LOj5J4nJ6m3L0jj6J7njkJ2Oj8%J9l1J6
4.79591ak0J2K3k8J3j1oqL7m4L4k3J3KJ9k7lM3l8oj8L3J1qPo%oj4K8Mk1KK1m6L7J5j2TKj2L2l3
4.77404a5MK1j6J3l6K3kk4K8K4k4ojrK5j0J3l3lLKM3k1pj3lL4k0j0J3k1K9roJ6mTJ7rjqMrJ3qO
4.75064aNj2J4k0K0k4oJ3Om%oJ3k7L4j4Kj0J1kJ5k8RlJ5j1J1nPj8NJ4k0Pj1K5okNkj6J7pJ6rNm
4.72673Akk8J9nJ8k8J9mLk3qN3k3j8OM2k3J0l8M6k0Mm1M3pk7N3j1k3J4j1J6j7JJ7m5L5KoqMj2O
4.70485a6L8l4L2m6K8k0M4m8L5j3Rroj2J2Pk9L1j4J1l0QJ9j7J3QTl6J5K6J5j4j0j8lJ6jrJ5j6l
4.68400a4J3j1L4l4Qk0K4nL7m1Rk1K9J3n8M2nmjj4mJ9p%mJ9j8KRmMk8L3j1J5j6k4K4j3RK1mj0K
4.66161eMJRrj2%O%nk0kK0OMOj3nJ1kK1j5k4K9nqJ0Nj6K8j1k3K9l5L5j7kO%Rl1K5jj2k5K1Tl1
$$ plain form
4.81931 -32 6 -22 0 -7 -6 7 -5 -30 5 -3 -5 -15 -13 -1 -1 6 -16 -16 -15 3 -6 -17 -9 -14 -3 0 6 -9 5 0 16 -27 3 2 -14 3 -2 -3 -5 7 13 -5 -5 14 -17 -1
4.79591 -1 -21 -9 14 -14 -1 -12 -18 -26 11 -33 1 -22 -9 -7 12 -15 -18 25 -13 -19 -37 -4 7 -1 6 0 0 -6 -20 8 12 -9 -7 14 -32 5 20 8 -4 -2 -14 18 -15
4.77404 -15 -11 10 -6 7 -29 -6 -8 -32 -4 20 -4 -10 -11 -20 5 -5 8 -25 -28 -25 -23 20 -1 -8 -21 -24 10 -10 -20 -7 -28 1 -8 -14 2 -2 -6 11 2 1 -7 -3 -12 1 -7 -1
4.75064 -1 4 -8 6 -14 6 -18 -24 -11 -5 -9 -9 -15 -2 -29 5 -9 -7 -17 -6 -8 7 -21 -12 -15 0 -11 0 -5 2 -16 -11 3 -17 -10 -21 4 -2 -4 1 -1 -17 0 -7 9 0 5 1
4.72673 1 -1 -29 -10 -15 3 -25 -6 -10 -7 -30 -38 15 -8 -26 -20 22 -1 9 -29 17 -3 1 -40 3 -4 -31 22 11 -12 2 -9 7 -10 -9 8 -37 -2 0 -6 -14 -10 -22 -16
4.70485 -16 22 -12 20 -26 2 -18 26 -22 13 0 9 0 -6 -18 -6 1 -28 3 -11 0 -30 -22 -3 -20 -7 1 9 -27 -12 14 29 15 5 -13 -16 0 -1 -10 5 -11 -14
4.68400 -14 -1 -12 22 -12 -4 -24 0 -5 32 -9 0 -21 8 21 -37 5 0 -4 -5 -19 -23 -4 -11 -11 -15 4 -14 -12 -3 -7 -3 -31 2 -9 6 -10 -34 -10 -23 -14 7 3 -7 -5
4.66161 -5 -1 0 9 0 -12 -12 -6 -6 -11 -31 -33 -13 -7 -3 3 -10 -15 -4 -6 15 0 -24 5 0 -8 2 7 -9 19 8 -15 14 -21 14 -3 -5 1 1 10 -21 4 3 -9 -34 -13 8 -23
4.63770b3J5J1j5L%j5L3l7J0j9J9MRj7NL2m8L7mkj1K1l6K5J4j9Oj9N3m4J2qJ1n1M8l0L7k2Rk4
4.61735c0K0mqK8j7jTJLjJ0mRMol6L8j0Oj3J0pL2l4%jJ2l9M7k1K4l1K0pjK7m5J5NJ4qMpj5L2k1
4.59395gJ8ql1K5jj4J2Pkk3J5jj1jPQjJ2k7K4j2kJ0L%oK8k4rJ0j4J9mj7jJ4JOj5kj%OROk0mJ8
4.56954@j9kJ8k9M7n9N2k3K3j2JK3k2KMj6j1J9j3J3j4j7L1J2Kl1K7j1Ll0M5l5M0k8Nj5J9Rm0J6
4.54919a6j1L3k2K8k4J1j0J5Oj1NlJ0roK1m7L7l1J2TrJ2Nk5RNj8K2j2RjJ3%j0k2J0j3M1l0lJ9L
4.52731Ej6J2Roj6pK2l4M9l8Mj5K8j6J3j1J1K1j0njNj7J3Pj5Rrmj2J3j5K0Pj7J9oq%Tj0L4j6j3
4.50493a6J5JJ4oj0K%j5JL4jj9rk6K2JRk7L2onjlLoNJ1jqRJ8l2K3J1k0k9K4j8K6oNk5J3LJ2k7
4.48153b2J8lO%J6k4K2m1K8j1Nj7J2K4k5K9j2j5Oj2kK2k5J2J6p%J6j9LqJ1j4ljTJ2j8MK9pl9O
$$ plain form
4.63770 -23 -8 3 -12 -9 -9 -24 9 -28 -18 -37 -18 -14 -5 -22 -17 15 -33 4 0 -2 -13 8 -28 -3 11 -8 -2 -21 32 -12 0 -8 3 -48 0 -30 7 -15 -6 -30
4.61735 -30 -10 -14 -22 6 -11 -12 -13 -12 -9 -10 0 -4 5 9 3 -33 5 -5 1 -12 -2 -9 23 -11 -11 -12 0 -39 8 -13 11 -20 0 -7 -8 19 -26 -11 -6 8 0 4 -3 -18 14 -7
4.59395 -7 11 3 -28 -3 -4 -18 -6 1 -1 -24 -9 -10 -21 -22 -15 -7 -8 4 -23 1 -11 -13 -3 0 0 -6 22 -2 -11 -1 -15 4 0 -17 -18 -4 -3 3 -12 -14 -15 -15 -9 0 6 -14 -18 0
4.56954 0 -19 -21 -3 -32 15 -44 8 -15 8 -4 -3 20 -2 0 4 -12 -23 -4 -17 -4 -18 -35 -4 8 10 -21 6 -5 -2 -32 13 -22 18 -10 -5 -20 -1 8 -32 -16
4.54919 -16 -27 6 -16 12 -12 -1 -11 4 10 -1 4 1 11 2 -4 17 -30 7 -24 -12 0 -9 3 8 -17 -8 -3 -21 1 -11 -2 -3 10 10 0 -22 -12 -25 16 -14 -17 2 5
4.52731 5 -11 1 10 4 -12 -19 3 -31 18 -20 -16 -31 -3 -19 -6 -17 -6 15 5 0 -1 4 -13 0 7 -8 1 -8 -12 -24 -11 -26 -6 1 -16 3 -3 -11 -11 -11 -21 13 -3 -16
4.50493 -16 -1 0 14 8 -2 0 0 -15 -14 20 19 0 -9 -35 -13 -12 -3 -30 2 -4 -9 -10 -13 -10 -16 -11 0 -1 -9 0 18 -14 9 20 0 -29 -5 -23 3 -3 2 -23 -10 -7 5 -22
4.48153 -22 -4 -7 -1 -1 15 -9 13 -28 0 -11 -6 -23 -11 13 -12 17 5 -10 -4 -16 -18 4 -21 -9 7 0 0 16 -3 0 -8 3 -11 -14 -15 -16 -4 -22 -18 11 4 -35 -29
4.45965b9J1Lj9J4J2k1rK0J7K0k4rP%Mj0K3k0K1k6J4oK8pj1j5qK3k0K7k1qJ6Lj0pK2j3j2L0l1R
4.43829a2J5k4K9j5TL2%qk0OlJ6jrPl4L2j2J5l4L4l1K9j1K7j7k3L9l3K2k1jPlOK5j7k2K9j7K6
4.41743A3j9K3k0pJ8j6J3l7K7k3L8l4MK7l8L7l6M3jj2Noj7J8rlK2k9K3K5k4mOmj7L6n2K3jJ5j3
4.39657fK0j9J4k0k5K4K9l6j6L9mk6J7KJ%J0mJ1k4J4K1j5lj2kJj6%L2pj0oQKrJ1jLJl7L6qJ0R
4.37368Ij2J8l2OpRj0K5Nj3pRm2M1J1k7RlK4k3j0J7lk8L2j3j4MK0K1pj9%nK0kl3J6K6l0QNj2J4
4.35130ckk5L6k8J3J2oj5K2LlLj3ok5J4j7M2j0mQoj7MLKJ3Lj3j7K7Rlkl1M5k9K6m4L4j4JJ9j7L
4.32841hJ0k0K2pK1k7nKK1k8lPT%mlK0j0J3m0M1l4M9m2OK0j8J6j9K8jj5lOJ5j9nJ5l8J8J6jLj1
4.30602emJ8j9%L2qJ6l7J3mJ0j5LNl4L3Qj5j4RK1jk6J0%j1Qj3QNL%NJ2oqk0L8l6K2l2M9m0K3j4
$$ plain form
4.45965 -29 -18 -15 -34 -20 -8 -29 -38 -18 -1 19 -5 -14 -7 -7 -3 -13 10 -10 11 -15 -1 -7 21 14 3 -12 -20 3 -17 10 -11 -19 -3 0 -10 -17 5 -8 -20 10 -21 -12
4.43829 -12 3 -21 8 -7 -22 10 10 2 -18 -12 -15 1 0 -9 -2 -36 -4 -16 -1 -35 -1 -32 -3 -14 13 -4 -27 12 -21 1 -20 -21 -14 -17 -11 14 -3 -25 4 -13 13
4.41743 13 -6 17 -3 -10 8 -8 5 -32 -5 -28 10 -24 -20 7 -31 6 -30 13 12 0 5 -1 -18 0 -9 -12 10 -19 4 29 5 1 7 3 -14 22 -30 -7 -8 7 -6
4.39657 -6 14 -5 9 -11 -36 -12 17 -19 -35 4 0 -26 -9 -7 -6 -6 4 0 11 -13 1 22 7 4 -8 -10 -9 -25 -25 7 0 -10 -16 -8 -6 -15 -4 -5 -2 -1 -38 -2 -10 0 9
4.37368 9 -3 15 -17 -11 -18 -9 -19 6 11 -2 -9 0 -42 -1 10 -17 -8 -11 13 -10 -20 -3 -6 -34 -2 -15 -29 -25 -5 16 9 -10 -10 -15 5 3 -30 -14 12 -18 -10 -5 -17 -3
4.35130 -3 -5 -30 6 -22 -9 3 -3 -18 4 7 4 7 -6 -12 -37 -23 -40 2 -8 -12 -4 -10 -27 -23 -20 -18 -5 -2 -15 -32 -5 4 1 -1 -32 13 -16 10 -34 0 -14 -13 6 -11 -8
4.32841 -8 2 -18 4 -3 18 -9 -14 -12 9 -19 -22 -15 -8 -8 -12 -15 5 -5 8 -32 9 -25 24 -18 -12 8 -10 6 -13 15 14 -1 -4 2 17 -2 -7 8 -30 -12 4 3 6 -5
4.30602 -5 -9 9 -10 -10 22 14 30 -7 6 2 12 -3 0 5 -29 4 12 -3 -17 -8 13 12 -14 -4 -4 -15 -7 -20 -12 -7 -4 -4 1 13 7 -1 -21 17 -19 3 -29 20 -20 3 -11
4.28313a1J4jKj0QkmlJ9m3J3j0K4k5K2j5K2k5MJ6K3k0j5K0m2J3L8j4Qj2K6k2k6K1Nj8LJ3J6j4
4.26278bk5NRK%j2K9l1L3Kk3L5ok2j3K8K2n1J1RJ2qj6KJ7jmoOJ0l4kL5j9oJ9kk7L0ql1K2RTNlr
4.23887@Pj0LNj1rKK2j7lklROJMl4K3j0K3j3j2K6k5L4k1m2M5Mj3QJ0Jm0K6MpoOj1L1k9K0Koj4K
4.21496a4j8N4k6jpJ1lPOj6j2RK1j2k4K5pj5J4J0j8PJOL3m3J3j3lJ1J3k4NPj9oK8J3pk8J7mPLR
4.19207A0nTKTPm0J3KK3k9K6%j9lL7l6J6JJ3j6K2k6P%l4L2pjk3J7J8oOQPj3mMj0JTmlkJ1j6J1m
4.16765iJ3k4K5Jnrk8O4m2KNPKn5O1k0RkJ5ok6J1LpMPJ4k5RJ8rjJ9m3L2Mm0L5j3%PKj8lJ9J4k0
4.14374cmK2kk0J7j2K1l5K3k3K1nQrJ0Lk4K4k7J9k1MJ3j2K0k5N9o6QK1j0TJ8k3JK1Mj5Kl7M3Q
4.12238Gj5lJ6rlj5L2l8K8roK6k7K6k0Jj0ORK2j3j8L1l3KJ3J2lk9M4j4QJl8J7j1K1k8J9j4K9k7
$$ plain form
4.28313 -11 3 2 4 -6 2 0 -4 -7 12 -31 -18 -28 -4 -29 -7 -22 0 -25 -21 -5 18 -2 -17 3 -39 -26 12 -2 6 -6 20 -2 -28 -7 -2 -20 -17 -4 12 -2
4.26278 -2 -27 -22 -13 -11 -11 -23 6 -25 8 10 -13 22 16 -6 -19 9 31 -20 -9 0 12 4 -12 -10 7 6 2 -4 2 12 -22 -24 11 -8 -14 5 3 -24 6 -2 -33 -11 -2 7 12 9 0
4.23887 0 7 -3 0 5 -6 -15 -13 9 -8 -11 -13 -16 -7 -1 0 4 -30 -7 -17 6 -7 -19 7 -18 16 -5 -47 -2 2 -11 -3 7 8 -32 -6 -2 -9 -15 -9 -20 11 -18 2 4 -2 -16 -14
4.21496 -14 -32 22 -4 -5 -12 -1 -4 3 9 -7 -19 -10 11 -1 -25 0 -7 -22 -8 2 -16 -9 -8 -2 31 -12 1 -12 -15 -4 9 -15 -10 -3 -22 -28 0 13 6 -22 -5 -9 -2 1 10
4.19207 10 5 0 2 4 11 -29 -16 -14 9 -20 6 6 -13 -16 21 -15 1 2 15 -1 21 -5 2 2 -32 0 -7 -8 -31 -14 4 -2 4 12 19 6 2 6 -4 -3 -2 -6 -9 -11 0 -16 -5 -9
4.16765 -9 4 -20 5 6 1 -8 -36 28 -14 -12 -7 0 2 -53 8 -12 -3 -5 10 4 -22 -11 -8 -15 -11 -4 10 -15 -6 12 3 2 21 -22 10 14 -26 9 -4 -4 3 5 -13 -16 3 17 -3
4.14374 -3 -7 15 13 -7 10 -2 19 -16 7 -16 5 0 8 -1 9 12 -12 12 -15 4 -17 -13 0 -12 8 -17 42 -24 -16 5 -5 -15 3 -20 -19 2 6 -9 -7 -44 -1 7
4.12238 7 -8 -11 5 -4 -7 -22 10 -28 0 -9 -15 11 -16 10 -10 -9 -19 -13 -4 18 5 -13 18 -15 -13 0 12 9 -20 24 10 18 19 -19 -2 -13 8 -20 -1 -15 14 -13
4.10101a3J0M1l9Qj0J4j3K0k0pRTj8LJJ5nj0nK2l3jK2Ok8KTML2k0kKQkk6J5pK0k1J5K7m9L0rpR
4.07761AMnl1M1qpJ7m7O6m1j3MK7lMl3K5omRKk5L6j5lJ0j8J3k0M9j9Jj4K4k4J2J5j1MJ4m0K0K3
4.05574C4pM6L2J5j2m1Rl6lJj2Jj3M0n6J5rRk8J8lL8m1L6j1rk4K3jPj9QKkj1J5pPkORJ6j3lTM1
4.03234F2J8N5J17N4pK5k3o5j25K4m1j1K4k8Kk4j9rJk4Rj1moPL1m8K1j5J4jj1L4l6J1mJ0j6L8
4.01250B9j9nK6k0J8kj2M4TQ3J02RK5mo7q0l5k1j8Ql4K0l4Ro1J1j1K0qj2Om2J7J2jpK6Lj0lpK
3.99113AK5k2L5m3Rlpj8M7RMk1J0K7L8K5nJ9rk7l0Lj8K5l8M1j7L3j5L4M6pJ0j9J5l3Ko2K2k7po
3.96977D6JPl8K5j9j0Qj6kK9l2nLJ3rK8j7J5j1mk6K7l6L4j1J4jOj9mpK6k8RJ2nj6J6Qj2J9j8n
3.94789eK0k2Mj0LJ3Joj7K9j5K3k4L1k6mOJ1jk1K6j2Rj6J1k8J7K7j4joK0k5K4k2J2j6J5j5NK2m
$$ plain form
4.10101 -13 -3 38 -1 7 -3 11 -2 18 -2 -9 0 9 -9 -6 -5 10 5 -5 -10 12 -21 -22 0 6 -22 -20 -18 -14 18 -2 -4 -2 6 4 -22 -7 -14 6 -15 0 27 -22 8 -1 -8 1
4.07761 1 5 0 -31 10 2 -5 12 -35 31 -10 -23 -19 8 5 9 -24 1 -5 -9 0 2 -23 13 -2 -5 5 -13 0 -20 29 10 11 -3 21 -3 9 24 13 17 31 -9 11 34
4.05574 34 27 73 105 120 108 67 76 40 37 38 26 27 14 54 -2 13 4 13 -15 3 0 38 -3 33 22 13 -11 12 11 18 -1 7 9 7 -4 11 4 11 9 15 24 40 27 24 21 62
4.03234 62 80 135 252 306 299 324 301 236 111 135 94 83 107 79 81 57 38 29 30 6 15 4 0 -6 1 32 -16 5 -10 4 3 -8 26 -10 1 -3 7 -9 29
4.01250 29 10 5 31 11 29 27 15 59 103 186 288 297 322 318 251 171 136 115 97 105 71 91 57 66 5 16 5 25 17 5 11 -31 -14 -2 -3 -10 16 19 9 6 -1 1
3.99113 1 26 4 39 -4 5 2 -5 -23 24 33 37 16 26 53 91 116 111 130 121 94 64 67 49 74 36 77 60 93 78 112 158 151 161 142 157 124 126 64 86 59 52 46
3.96977 46 47 54 16 41 22 12 20 4 2 31 -1 -6 -3 10 1 29 12 27 16 12 -14 13 -23 11 0 14 13 19 0 -4 -11 15 -13 -4 8 3 -13 3 11 -1 18 0 -5
3.94789 -5 15 -7 -3 -13 -10 3 4 -2 -19 10 -5 18 -6 25 -1 -5 1 12 11 -10 16 4 13 -3 8 -20 -3 24 10 9 3 23 -2 22 0 12 -4 11 -4 1 23 19
3.92652A9j1JMj0j2L1jk1J1Lj8pL6Jl1Nj3K0JmNj8K6j2K0k7J2J6j5Rk0J6l2kJ1Oj6QJ5l1PjpL0
3.90414Dk7K3j6J6Lj5K6k3j1J6J5l9L1k5LJ6mJ6%J1k8PTRj1oPj2Ql8L7Pj2kj5K2LJ1Lk2J8nj9Q
3.88176cK5lj0j4j1J1kNj3L5l2M2l8K0j9OK0j3K2l3K6J9j4m2jK5J8j3k4J1j3J7L3o2J6J3K8k8
3.86243DJ9k2K4k0J8j0j1nJ1j6K6j2Ok3LK1J3k3J4Jk9K4Jj0L0n1J8jJ5J4k5J1lOj0J6k9K1mk1
3.84208iJ5KJ5j7Rm5K1K7kj7pL5j4JNj6pKK0k1%K1J8k7L0m9L4k5J2j6J6J3j5J6j6j5K1QP%k0%
3.82071A0J7k7K8j9nL1qJj2qOJ5l5M9m8M4l8M2k4K0O%K5l1K9k8j9M3Lj8lmj9J2Jj0Jj0J7Mkk0
3.79935A6L1rJ2l4KK7qJ2j6J1k2K7pj9ORLJ8j7J6l0J4L2m0LL0j9RJ9l1N1k0K6nK2j2mRj5L1n7
3.77849G1L5j7J7Pk0K3J1Oj7J1J9%K2nL0RJ7J1J2J3K6M3j2M7j8M0K2kM2L2O1OQML6K5J9K9K7M8
$$ plain form
3.92652 19 8 9 13 3 -9 22 21 0 11 14 -4 -11 25 26 -5 0 -13 7 8 4 9 -9 17 5 25 -2 10 26 11 20 0 16 -16 -18 -7 -1 -17 -9 6 -25 -18 -19 -26 4
3.90414 4 -23 0 -16 0 3 -12 14 -9 -20 -4 11 -28 3 -22 -19 -3 -7 9 9 20 -8 -1 6 15 4 -2 5 -7 1 -37 0 7 -5 -7 -22 0 3 14 17 -5 13 8 -11 -3
3.88176 -3 22 19 9 -5 -16 -5 -7 -2 -15 20 -12 30 -8 12 -7 -1 19 6 28 -5 21 40 26 -16 -17 8 26 13 -11 0 -13 4 37 -25 -9 4 32 4
3.86243 4 23 1 25 5 23 13 2 -3 8 -8 18 6 12 -11 -8 13 26 3 17 18 -11 13 14 4 34 -17 1 0 15 29 4 15 12 18 8 24 -5 16 12 -9
3.84208 -9 6 8 23 6 15 -30 -9 18 16 -1 -8 27 13 14 19 3 -4 -2 18 -3 -3 18 36 9 39 -10 24 -1 11 -5 11 24 9 25 9 -6 15 23 30 30 10 10
3.82071 10 27 0 28 9 4 35 27 28 16 8 14 29 -6 43 -5 39 1 43 19 39 45 45 70 39 68 40 21 64 67 49 46 42 23 35 36 26 27 17 34 38 36 16
3.79935 16 47 38 50 16 18 45 37 49 33 44 22 49 42 23 29 38 41 59 42 58 28 42 74 34 37 67 48 57 76 45 96 76 102 97 119 107 103 112 97 128 71
3.77849 71 106 89 106 113 93 116 127 133 116 127 146 146 168 163 193 202 219 230 242 255 281 324 312 359 341 381 403 401 443 475 536 542 550 554 590 615 634 663 690 738
3.75814G38M7K6M0L7M7O9M0N2R7O7J22R4J85J39K28J88L03L46M61O36P63J116J420K269L251
3.74542A2781M776O680O242J099J189m41m579n475l754k388j639j320j587j659j750j665j495
3.73678E015j173q19o52m08l23k67j48j52j34j14q1o1n9o4p4Qo6k3j8m6n2Jk5Qj7j4ll4lK3k2m
3.72050A99j9K5j2j5%j3K0k2K6m3l3mMK8k1%KrJ2ml7J3Qj4j9J3klj6j4K4Rqj8rJ1J3rk1jK0j8
3.69913D3K4j9oNJ1J4j5Lj2LOj8K9n3L5o%KjJlj4oK2j1J5j4J2j2J9j0j2M4k7L1J5OJ1L0TJ4J0
3.67776A96l5j3k1qk0rj0mkj4Qk0k4L0m4K4j7J1j3Nj3J7nk9Qk9K4J2OK4j0k7K5LJl2M9rnK6n2
3.65691DJ5JrM0k4L0k0RJ9K7mm2K7j9QJj7pm2J2j0jJ5j5K3l4M2l6J6pQk4K2J2k8K7%Qj4K8l7j2
3.63554hJK9j7J5k2J6qJ1pPj1QpK6j9OnK5l9j2K1rK1Kj2J8kk9qKJ0Nok6M5%J7j5l4M4oJ1k0k3%
$$ plain form
3.75814 738 785 811 851 888 935 1004 1044 1096 1193 1260 1382 1476 1661 1800 2028 2216 2519 2865 3326 3962 4725 5841 7261 9530 12781
3.74542 12781 17557 24237 30479 31578 32767 32326 27747 22272 18518 16130 14491 13171 11584 9925 8175 6510 5015
3.73678 5015 3842 3023 2371 1963 1640 1373 1225 1073 939 825 744 683 624 560 486 494 428 405 387 341 289 290 265 273 256 242 239 205 202 225 203 199
3.72050 199 180 205 193 178 178 165 185 163 189 146 113 109 113 141 120 120 122 113 125 121 84 97 105 91 72 85 83 80 64 50 74 83 75 57 48 59 72 63 42 41 61 43
3.69913 43 67 48 42 47 58 72 57 60 48 51 57 39 68 15 50 44 44 46 45 46 43 29 23 45 34 49 35 47 35 54 44 32 76 49 80 95 101 112 142 172 186 196
3.67776 196 161 148 127 119 99 90 80 76 74 60 68 48 24 54 10 34 17 28 15 20 7 24 19 -10 -2 -31 -7 5 11 35 25 -2 23 26 27 -5 44 35 30 56 4
3.65691 4 19 20 11 51 27 57 37 46 65 92 88 46 73 54 62 63 46 39 -3 9 -1 -2 13 -2 21 -13 29 -7 9 2 10 -14 8 20 -8 19 19 27 13 41 4 -8
3.63554 -8 -7 22 5 20 -2 14 6 17 10 17 6 14 7 33 14 20 15 40 1 -11 10 1 22 24 12 30 28 -1 -9 -7 3 8 2 -24 21 21 38 23 -11 33 27 38 18 -5 -5
3.61265eQPJ1j1kOJ2k7J8k8Mj1N5k7nojJ1j2RoL5k6RoJ5l4L8k3OK3k5J2lRj2Kl0OJ7L1pqTLJ0l
3.58874C1qJJ4qjPJ5m3M1k0J2jQl0J8m1M7m2K2J1j2kj4OQk5K9k0k1J0Jj8K0pOrK3j3lj6PrK6o
3.56636fj3J6j5J5j9K3Mj8J3nN%K0l6J4mOJ0l4qM5nj6j1J8J7mj1J7l4J0jK4k2nJ7J0j3J8m9K1j
3.54499gJ4lrj1J9kK2m2NjLK7mpmOoPrK1%k1oLMJ0MnmJ3l3K4J7l4nL7j4l0M0J0k6MK5l8J8j9K5
3.52108A8lK1k1Nk0NK1k2J1j6J7mK5k6NmJ0MLJJ5L5K7jO2k4K8j9j3k7m1K4l2J4j1K9m8K2k5j2O
3.50022C9mpRn2K3NJ2j1j4NpJ4k2PTJ8j9MmJ8j6J0ol2L0j6J8j8J1J6j3mj9J8j3%QqJ3rJ0l0L5
3.47835Fj3K0qj0pK5p%kj4J3Tj7j4L1k7K4j8Nj0K8m8M3Jj6j9K3k4J1J4lj5OK3k6K7l0N9o7K8k0
3.45749a5jK2jOj4K1l9O1p1L1k2K1J3k4L8n7L5Qj3j7MpnK7j0kK5k7K3l0J7Oj3J8Mk4lL1pj3K7
$$ plain form
3.61265 -5 3 10 21 10 8 14 26 -1 17 -11 -7 -18 37 10 5 -1 -2 9 -3 6 0 35 9 18 12 27 -7 31 8 14 37 12 24 21 30 18 20 -10 -4 13 44 37 29 21 24 34 31
3.58874 31 23 24 38 30 29 36 51 8 49 29 41 40 48 18 36 -5 42 0 22 33 21 19 5 11 19 -6 23 3 -18 -8 -7 -25 -5 -12 -6 -15 8 -5 -8 -24 -17 -26 0 -6
3.56636 -6 -19 -3 -18 -3 -22 1 5 -13 0 -5 0 0 20 -16 -2 -6 0 10 -24 -32 13 8 -8 -19 -1 16 12 1 18 -16 -6 -7 17 -5 -10 7 17 4 22 -27 -6 -7
3.54499 -7 7 4 -5 -16 3 1 23 -19 -14 -15 -12 15 11 4 0 6 0 7 -2 19 19 -2 -8 -5 -1 9 13 8 4 17 -16 8 25 -9 -14 23 9 -21 19 29 3 7 32 -6 12 -7 18
3.52108 18 15 36 15 20 0 5 26 4 15 -1 16 12 37 11 16 12 22 26 29 30 45 80 107 106 168 144 172 153 140 113 72 96 64 78 67 96 48 70 45 33 39
3.50022 39 35 28 37 -15 8 13 25 14 0 5 -2 12 -10 -3 4 22 3 7 3 21 5 15 9 -23 7 -9 9 -9 2 18 5 1 -18 0 -13 -13 -5 -13 0 -9 1 -29 6
3.47835 6 -7 13 5 -5 -12 13 6 6 4 -10 3 16 -1 -15 16 -11 13 -5 0 -10 18 -30 13 14 -2 -21 2 -22 -11 3 0 -15 -9 14 -12 15 -15 44 -23 5 -15
3.45749 -15 -16 6 5 11 -3 18 -21 40 -31 0 -22 -1 12 -12 26 -31 4 12 -1 -18 -14 -21 -26 1 -9 -11 14 -13 10 -20 -3 3 -10 8 12 -12 -15 16 9 -4 23
3.43664B3J6k5k6Pj0PLQqJ5pj7K4qmj1L0l6K7mPj0poqL7j6KTj3RMKj7K1Nk0Mj0K8Qj4rTL0k4%
3.41273@j7L2qmqj3joL5k7j0NQPQKK7m2M2l0OPk6K8l1J6KqJ0Ok3LJ5J3j5j2QmJ5nk5J4NK5k3j6
3.38933a5K2moK2k3Qk3M5l7L0k5JKJPj6J7k7K1mMJJ1j3j7J3J4LnTRj3J6j4K6j1Jk4K9j3K1j0k
3.36745A7j3nJk0M4Km2K2j4J9LTk0%J9kKk6kK3Nk5lJ7NLk5J4K3jPj4%k1J6j0J2j6K9k5J6lJ2j6
3.34507A1j3J1K0oj1K0j0J7k0Oj0mjJ4mqJ4lL5m3K4k4J3J9k8M7j7MpK5k0K4j4K9mK4k0L6k8L3o
3.32421A25PJ8lLoL6l1J8J0L3j5J9L2k4K4J2MK8RJ2K4N0nL4M0O6L3O7O2P8J39J45K00K81L81
3.30641A906O08Q26J023J235J449J277O84J17l57j002j279j115q24o26n39n56n21m84m49l26
3.29623A047k41j98j01r1m5o4m9ql1l4j4j6j4j0j8Kk4Okl0oMmL2j4K2n1QJkk5J6J5jJ3k8J3nK6
$$ plain form
3.43664 23 39 14 -12 -5 -15 -8 -5 3 -5 10 3 -14 10 2 -2 -13 17 -19 8 4 11 1 -6 -12 -20 17 1 3 5 -8 1 5 7 -10 11 16 -4 0 -10 18 26 12 3 -6 24 0 0
3.41273 0 -17 15 7 3 -5 -18 -19 -25 10 -17 -27 -22 -14 -7 1 3 30 -12 30 0 6 13 -13 15 -16 0 2 -6 4 10 -13 -10 5 18 3 -9 -1 -5 10 5 -20 -6 -1 24 1 -15
3.38933 -15 7 3 -3 19 -4 4 -19 26 -11 19 -6 -5 -3 -2 5 -11 6 -21 0 -4 0 1 12 -1 -18 -5 9 12 7 2 11 -2 14 0 26 15 16 -8 21 8 29 19 17
3.36745 17 4 -1 0 -20 24 26 -16 6 -8 11 14 17 -3 -3 16 14 16 -10 -12 11 16 -9 -12 5 10 13 -12 2 25 24 31 17 17 -4 12 2 14 -2 27 2 18 15 27 11
3.34507 11 -2 9 29 23 12 32 22 39 19 25 15 11 10 24 20 12 26 23 58 15 39 15 28 47 19 66 49 53 46 71 51 75 61 90 86 110 90 126 98 131 125
3.32421 125 132 150 147 150 144 180 149 167 177 210 195 214 246 222 246 258 262 290 299 311 335 385 380 414 454 520 553 620 682 760 899 1044 1244 1525 1906
3.30641 1906 2514 3340 4363 5598 7047 8324 9008 9125 8768 7766 6487 5372 4548 3922 3383 2827 2306 1822 1373 1047
3.29623 1047 806 608 507 416 371 307 258 250 219 185 171 155 141 131 113 115 91 97 95 65 59 63 59 91 77 99 48 56 57 55 30 46 61 60 73 45 58 53 79
3.27639G9k7lMm1J1KL8n3K4k2J3nL2k0j8Oj5L5k5kLl0L0pL4k0j4J6j6J9l2K7k6M7l7OJ4k0Nj8
3.25604fK5j2Pj5J6kj0J0%qK2j3jj5NOPpLj%k5J4J2q%K5k0J5K1j8J6lj3Qj4Pj4K6qrpPj9RORk2
3.23163Fk5K8rQnj1K4j3J4jpTnNj1J5jOj6OkjK1j2j7J9Mk8K5j0K2j0Nj1J1nk6J2rJ9K1l4MJ3J1
3.20873B3pOn8N3k1nj2K4k4N5n7QJ5J7j8PJLj3k9L7Mk0Kj6K5J3k2LJ2oqlMmqJ3Oj2jL6qj5J5l8
3.18584b3MJK8l3K2j3J5j1J5j0J9j1j5K0KK6k8j6LK1j6LloQj0J9mM0k6J4nJ6pj3j9J7k1J1j4Q
3.16498HJ4j0J6k7Rk9L8l0M0l3J7j0J1L2m4M2l2J1j1pnK0J5l0L2j7J8Jl2J2k0J8ojj0%j2jK9j2
3.14464DJ0rTK5j4oTK9l6rK6j1J0j5j0K1Qj1j2K4l7K8NQk3LPk1L3l1J2k9L7Qm0L5j6J4k2K0Jj5
3.12327a4J0j6PlK3j9j6L5k8L1%k0Kj0JK7Jj8K7m8J7Pj1K9l1J7JLjj3J6oJJ0l6K5NJ0j3K1j8j9
$$ plain form
3.27639 79 52 49 53 12 23 25 63 10 34 12 25 20 52 32 14 20 5 40 15 13 16 -14 16 9 43 23 9 25 9 28 -4 23 -3 44 7 13 27 7 12 -6
3.25604 -6 19 7 14 -1 15 13 3 13 13 5 27 14 13 -2 3 9 16 9 12 11 11 -14 0 12 4 4 29 9 24 45 27 43 40 27 35 21 28 14 40 32 23 16 23 4 13 19 28 6
3.23163 6 -19 9 0 8 3 -8 16 3 17 16 9 2 -3 2 -9 6 5 11 -5 1 -1 -2 19 7 -10 9 13 -15 10 0 22 12 17 6 17 12 -14 -2 -11 8 29 -5 -1 12 23
3.20873 23 16 22 -36 17 -4 -9 -21 3 -21 34 -23 -15 0 17 -1 6 7 10 -3 -32 5 9 -11 -9 -25 0 13 -9 -6 6 0 -8 -11 -7 -11 -19 -6 0 -12 -13 23 15 0 15 -23
3.18584 -23 -19 -18 10 -23 -1 -14 1 -10 5 -5 14 3 -12 8 10 36 8 -8 -5 16 0 3 0 -6 2 -8 11 7 47 21 35 30 46 39 26 7 24 3 14 0 8
3.16498 8 22 12 28 1 10 -19 19 -11 29 -4 13 3 14 46 2 44 12 23 12 5 0 20 35 5 37 20 38 39 7 19 -1 17 11 10 0 0 -12 -13 16 4
3.14464 4 14 5 -4 21 7 1 -5 24 -12 -21 5 -6 4 -11 -21 0 8 -3 -15 9 -28 0 5 13 -10 -7 0 -21 12 -19 -7 -36 1 9 -31 4 -12 2 -20 0 1 -14
3.12327 -14 -4 -20 -13 -16 7 -12 -28 7 -21 10 10 -10 -8 -18 -17 10 11 -7 20 -28 -11 -4 -15 14 -17 0 1 4 3 -10 6 0 1 11 -25 0 5 15 2 23 5 -14
3.10190a4K0J0%Jk1mKMj8K1j4L4m9K1OK0k0j6KJ8j4K3l1K3oNLK2j6jTPkMKqJ8%pJ5n6L6J6jk1
3.07901A3j3J2J1oj7pmL4q%j3LMlK8p5O1k7PKJ2k1LK4l0JK1nL0Ln3J3%J5nJ7JMRLML2qL6J8K5R
3.05510A60Mj8jJk4k5J0k7k3nJ5j5j1j4J4Lk7mQj0lOl0J8QmO%Mm5K8J1Onlm5N5m0N3l7L5m2M3
3.03323C0n6M1l9L4l2K4j7L3j8olK3l0QTJ2J3k4L2k3jml9L8m0P8p2L7LoK3k7%K1j6pJ9j5L6l8
3.01288@J5jj9K0k3Ok6K0j4J3m3O1j6ljJ4j1JRkj1Qj3j2K2L8l6j9LM1k7J2Nj0qJ9j9Pk4K8qj2
2.99151a6M8ol5RkLjJ2k8J6k1K9j5K2pnj2Qk0J3KJ0j4L0qJ0j7TJ4rJ1J0rJ7rpLj2K3oj7RJ2l1k
2.96862a5J8qK5j5K7l9K9l5J3J1Nk2lQpN4o6K6j0L3l2J3pkKLJ8l3K7l1J3J1pOk3L6pk8M1k6K9
2.94776C2l0L5l4PpmjJK2j9L6l2j4O%rJ5kLmL6j9j7NLJ1k6J9j8KRNk1L1rlm%J3j9j1J2qR%PqK0
$$ plain form
3.10190 -14 6 16 16 17 -4 -8 -6 -2 -20 1 -13 21 -28 -7 -1 19 -1 -17 -15 3 -11 12 -19 4 -2 3 6 28 12 11 10 17 15 19 21 13 31 31 24 39 -17 19 35 34 13
3.07901 13 0 12 23 17 0 -7 -11 23 15 15 2 5 9 6 34 -41 20 -7 0 2 14 -7 -4 20 -10 -9 12 7 37 40 -13 0 0 15 10 27 28 32 41 44 48 80 72 108 126 151 160
3.05510 160 164 146 145 146 122 97 107 80 57 52 67 52 41 27 41 44 17 13 21 11 8 14 -16 2 10 6 12 12 16 -29 -1 10 16 11 8 -37 18 -22 31 -6 29 -13 30
3.03323 30 -26 15 -24 10 -22 2 -15 18 0 -6 -9 14 -16 -8 0 12 25 1 33 10 9 5 -34 4 -36 42 -30 7 10 4 27 0 0 21 5 -2 17 2 38 0
3.01288 0 15 14 -5 15 -8 -2 -28 -8 -22 -9 -52 9 -7 -10 -11 3 -8 -7 2 0 -11 -3 -16 -28 -6 32 -4 -23 -20 21 -6 6 11 1 -7 12 -7 0 -24 4 -4 -16
2.99151 -16 32 26 -9 0 -2 1 0 12 -16 0 -21 8 -7 15 8 3 -9 -1 -21 -8 -6 4 -10 20 12 22 5 -12 2 -7 4 14 5 22 13 6 9 -3 20 14 -3 6 18 -13 -15
2.96862 -15 3 -5 20 5 32 -7 22 -13 0 11 16 -6 -9 -1 -8 46 -20 6 -4 29 -3 10 3 1 3 6 24 -9 18 -13 0 11 4 10 -13 23 16 -12 29 3 32
2.94776 32 2 37 3 10 3 -1 -2 -1 21 2 38 6 -8 -2 -2 -11 4 2 5 1 37 18 1 6 9 20 -6 13 -5 -3 6 11 -10 21 12 9 5 5 18 -1 -12 0 -8 1 1 8 0 20
2.92335B0j3L7l4mK8j6J0l8K7lj1M7m2L9l6L2j9K5l1J9K6j1j8L3J2k%k2L6j3rj3J0rkl1L5l4o
2.90351A9J9l3J8L6ol0L1qJ8n3K8o%KTn2N6jLKNj8lK6k6K3qMk1J3K9l5M3m4L4NTJ4j3J9lJ2j9K
2.88112H9NK4pk5L9j6J3k0K8J6l6QJ0k%J8K7KPK9J5MK5%M6%J0L8J0OL8L1K2L4K6L3lM7NL9N6l
2.85976F88P7j5O1JJ04K2R0N1R4J03R0J48J52J19J84J73J88K33K60L12M00N60P47J073J578
2.84704G493K392L518M813L853K789L602K967n85k165j512k352l691l416k620j978j670j562
2.83839I876j571j420j290j095r43o87m95l40k99k25j73j35j50q7j28p2j20k7q5l4m1n6jl0m4
2.82567C28l3N4o8pk6lMk0k7J1plJ9k5M2o7Mj0j3k1K0k6%K8l9j4k6M4j9kk5j4K3N%pj1j9K0J3
2.80533H3j6Qk4J4K9qrqprJ9J1Nk1Nk8J3Tk7J4j1oK1qJ1j3oJ6k5K7l6L0k7pJ8J1j9K8j1k2L3%
$$ plain form
2.92335 20 7 44 10 6 34 18 28 -10 17 14 3 50 8 47 11 43 24 49 18 37 63 52 34 67 79 77 77 55 91 78 69 56 66 57 55 24 59 25 19
2.90351 19 38 5 23 59 53 23 54 46 64 11 39 33 33 35 37 -15 41 40 43 45 50 32 29 55 29 52 44 48 27 40 69 34 77 33 67 72 77 91 78 97 94 106 87 89
2.88112 89 94 118 111 86 125 109 122 102 130 146 110 118 128 126 126 144 171 173 180 209 224 228 253 253 299 299 309 347 357 363 401 432 454 488 514 547 544 591 596 635 691 688
2.85976 688 765 750 811 812 916 938 1028 1079 1173 1276 1366 1514 1666 1785 1969 2142 2330 2563 2823 3135 3535 4095 4842 5915 7493
2.84704 7493 9885 13403 18216 22069 24858 28460 31427 30842 28677 27165 24813 21122 17706 15086 13108 11438 9876
2.83839 9876 8305 6885 5595 4500 3557 2870 2375 2035 1736 1511 1338 1203 1053 966 838 766 646 619 534 500 459 403 402 372 328
2.82567 328 295 349 281 274 248 245 249 229 202 213 206 203 222 197 239 172 176 166 153 132 152 126 126 154 115 101 75 119 100 98 73 59 82 87 87 80 69 50 70 83
2.80533 83 67 75 51 65 94 86 77 69 62 53 72 83 88 67 72 44 57 70 43 57 46 40 61 53 64 51 45 61 36 63 27 57 30 23 41 52 33 61 50 28 61 61
2.78396F1j0j3K3J0MOK0K9k5M5qJ6l3J9k0k2j4j7TK7l4J6k1Kj7K1m0K4k5J1qPj0J4j8LJ9LMqj
2.76310B3j5NkK9j9%mkK0Mj8K3qj0K0nqJ9LOmJ3j9J8k5Prkj0j6JPl%mk9L2k1J8mJ4Pl5K4k5K0
2.73970A6k5K3j4J1pj5J1rK3nJ3j8L3j9j0J8j0lNK2l1J2Rk9J2j0M8j5Ok1RK0k1MJ5l6L6nj8L9
2.71935F4j6jK8l3J7K3m4N1m7J8m1L8rLl7K5PK0Onk9j1K9j1J8j7k6J8j1L2k7j7TJ9onJ3Mk0PJ6
2.69850B6j1J8k8J7j0mJL1j7K4LQj0J6l6nK2k2K1%J4MjQk3J4j8j0mk2mL3k3J9ljj4K4l1M4k3TN
2.67662IkLlNj9J0pkj2K5j7j3J6K2oj0j9J9jj2J4RkmJ0k7J0nK1j3J0J%Tk5j0K4j4K5oljTmj5J1
2.65322iJ8LOk6L5j3j8MKJ6PLj9lLrK2%jJ5m4L8J5k2lL7k9JL7m0jQoJ3J7j7K5k5J5j9J4J9K0P
2.63084I6K9j0K6JL8j4nl1J6m2k3j4J7j6pJ7k7nPk3PJ1j3Ol0L1l7NPj1pMRJ4nk2RNLpKk0kJ2j6
$$ plain form
2.78396 61 51 38 61 71 75 81 101 130 105 150 142 158 125 144 124 102 88 71 54 81 47 63 42 44 27 48 8 32 7 18 10 17 7 21 3 6 25 28 32 24 23
2.76310 23 8 13 11 40 21 21 17 15 35 39 21 44 36 26 46 41 33 52 55 61 57 70 51 69 44 51 42 40 30 14 15 22 19 19 15 -14 18 -3 15 11 25 32 -3 21 -4 16
2.73970 16 -9 14 0 11 4 -11 0 -9 14 9 22 4 37 18 8 26 16 13 18 40 9 21 30 1 13 3 51 36 42 21 30 50 29 33 48 12 48 43 25 64
2.71935 64 48 47 75 42 59 82 38 89 42 60 19 57 48 51 14 39 46 66 72 67 38 27 56 45 63 46 20 38 27 59 32 15 -2 17 11 6 19 23 3 10 26
2.69850 26 15 33 5 22 12 8 9 40 23 47 50 58 48 64 28 23 45 23 44 44 58 62 61 69 46 60 42 32 28 6 2 35 12 31 28 27 13 37 6 50 27 4 9
2.67662 9 7 10 7 12 -7 3 -4 -6 -18 7 -10 -23 -7 15 9 -1 -20 -1 -2 -14 0 9 7 3 13 -14 -4 -9 12 -1 9 10 10 10 -15 -25 -1 -15 10 4 1 0 -1 -5 -20 -9
2.65322 -9 9 12 18 -8 27 14 -4 0 2 18 25 28 9 6 9 0 22 22 21 36 -8 30 45 23 20 57 28 29 66 26 25 33 27 40 57 40 65 40 55 36 50 69 89 96
2.63084 96 125 115 141 142 180 166 161 130 146 104 81 67 84 68 61 78 51 46 53 30 37 48 35 41 11 42 5 10 17 6 -1 3 12 26 21 -1 8 13 16 9 11 -9 -11 1 -15
2.60795a5K6k3J4K5l6j4K3KTJj8N0l5K0k2J1jj2J3Mjl4M4l7K6K0k2J4k5Mj5K0mRj3J9j7l6O2k5
2.58760DL4m5j9J1LPj1K9nJ8n0RJ7qkj1J6j1J1Jl0J3J2NnK3rlJ3j9K7j4PMoj1Pk7j1RJ9k3J0J4
2.56521CnKoj1N0k3Jj8J9JK4m0LJ0k0K9JMj8Qj4K1k8TM3Ojqk4J7J5J4ql4J0PLk5L1j6j3KL8k2j
2.54232aPoJ1k5J2NK1m9M6Pnl3K3j8J0RPTm5M2m%jRMj4K0k6N8n0L7m4L5lL7l3J4RJ2j1j4J7oL1
2.51994A02j8L9k3K0oK3J4j9L9J2PrK8k8L9JMJ7K7N1j4L1l2O4N0K9Q0J23J89J82J73J03Q2k7r2
2.50213A261l2o4Q7M8K06K69M00K92J69R8n2k05k33j73m7J17J52L28M51M03K18Q8p2l87m13l53
2.48891B556k32p1M3Q0J61K04P2m6r2k43l74l10k10q3r0J7j7RJ7p7p9j35j33k07j08j28p1n2T
2.47415C49o0m0n2n6m8lj0l7J8j8Ok0jk3L8j0jMkl1L3pk4LoL5k0j1L4k4Qj4J4k9NK9l2LK6k5P
$$ plain form
2.60795 -15 11 -12 2 27 -9 -23 0 2 4 5 -13 37 2 22 0 11 10 -2 11 15 14 -20 24 -13 13 33 11 25 0 4 -11 9 5 14 1 20 3 -33 29 4
2.58760 4 38 -7 -26 -15 -12 -5 -16 13 8 26 -24 -15 2 -6 -8 -19 -3 -14 -3 -2 -32 -19 -7 -2 -7 16 7 4 17 -2 25 11 18 22 16 5 12 -15 -26 -17 2 -21 -11 3
2.56521 3 -2 0 -6 -17 33 10 11 -7 12 13 37 -3 0 10 -10 19 20 24 6 14 0 21 -7 -35 8 14 13 5 -19 -2 13 27 19 -15 -5 2 5 -20 11 -5 -18 -16 22 0 -1
2.54232 -1 6 0 11 -14 -2 3 24 -25 21 28 23 -10 13 -5 5 14 21 28 -17 25 21 21 20 29 33 19 39 13 71 21 58 14 49 46 83 50 64 73 85 74 60 77 71 102
2.51994 102 84 123 100 120 114 137 151 132 171 183 190 181 209 181 220 221 225 242 269 320 306 337 305 369 419 448 528 651 840 1022 1195 1298 1380 1353 1261
2.50213 1261 1229 1165 1252 1300 1506 1775 2175 2467 2636 2734 2682 2477 2244 2071 2024 2141 2293 2621 3072 3475 3693 3781 3709 3322 2909 2556
2.48891 2556 2324 2253 2296 2376 2537 2741 2813 2767 2675 2432 2058 1748 1538 1455 1365 1382 1365 1374 1391 1314 1235 1100 967 760 652 524 453 401 349
2.47415 349 289 249 197 141 93 90 80 43 61 43 49 29 28 5 43 33 32 36 34 3 36 29 5 8 2 37 17 6 40 16 24 10 24 -5 0 29 -3 0 26 1 8
2.45330HK4nm0RJ6j8L7k5j4k5L4jJ0j0K2k8rJ5%rK3l1K7k0KJPkK6k0PK6j3MrTlj3M2k4J9k4K1
2.43142B8k3K2j4J5k8J4K1pPl5M1l0K3lj8Ok1J0j0L8j9j5K2j3J0j6K3l8K4qJ6jJ0J5MjK4m2%J2
2.41107D3j3j2JJ4j1J4j6K2k8M1m6K3j4K7m7NJ0Rpj4K8j1J3lk0J8rj0K0l1J4RjrpOJ0Nj1JJ8J0
2.38971D1k6L8J7l8rJ6Pl2jj1K6k9K1k0m%Pj4J8l9K9jLj9Rj1RjPK5j5TLkJ3j7K5jj2qL1j3rK4L
2.36682B5k5jJ9PpjJj8k3K5mj2J2QnNk3J5mJ9k9J6LQj1pMTJ0kLj3mj3L8j2jk0J3NMj1OJ0K2l6N
2.34291Ej4J9J6m2K7pLJ2J0m7L6Rj1j0lL9m6Qo%TK8qpTQl2K2k8L1K0%l1K0qKj8K1Jklk3NLTK4
2.31951A9j0j8MJ0J4k0kk1oK0J8l0RTj9NPJ3lOj4lJ1pnOk0jM2l4K5J0Oj4j9lJ9%Om1J6QoJ3j7
2.29661a7J3j3J7%J1kPl5k2L7j4NnM1j4Llpj5K4kJ0j9J7Kk0lJ3j6J6Ml1L1Nm2L2Rj7rRk3K9J1o
$$ plain form
2.45330 8 32 27 -13 -4 12 -6 31 6 -8 -33 1 0 10 0 22 -6 -15 0 0 -9 14 -17 10 -10 -8 -7 0 -2 24 4 11 37 24 28 19 10 7 -6 36 12 31 7 28
2.43142 28 5 27 13 28 0 14 35 28 35 0 41 11 34 31 13 19 -2 8 -2 36 17 2 24 11 21 5 28 -10 14 6 22 21 31 46 50 49 73 31 31 43
2.41107 43 30 18 19 33 22 36 20 42 14 55 9 32 18 45 -2 3 13 22 15 1 29 18 31 28 8 26 17 7 27 -4 10 19 18 9 2 8 18 23 12 13 31 41
2.38971 41 15 53 70 32 23 39 46 14 13 2 28 -1 20 0 -4 -4 3 -11 7 -32 -3 -4 -1 -20 -11 -22 -13 -14 -7 18 3 -12 -9 -11 2 -15 10 9 -3 -11 20 7 -2 22 25
2.36682 25 0 -1 18 25 18 17 18 0 -23 2 -2 -14 -2 6 1 6 -17 -2 -6 13 -16 0 3 11 0 -7 -3 1 11 9 12 -1 -5 -18 20 8 7 -13 0 5 9 -2 4 14 36 0 5
2.34291 5 -9 10 26 -16 11 4 7 19 29 -18 18 27 16 6 3 42 -4 4 -2 -2 -2 26 18 11 4 12 -20 2 -26 5 25 25 -6 14 6 8 -10 11 12 10 7 -16 -11 -8 -5 19
2.31951 19 9 -9 -5 5 19 -1 -3 -24 -30 -10 8 -22 -13 -4 -23 -18 -11 2 -1 5 -9 -12 -1 -8 -13 -7 -27 -28 14 -20 5 15 21 7 -12 -15 4 4 10 -31 -15 -7 -13 0 -17
2.29661 -17 -4 -17 0 0 11 9 16 -19 -41 -4 -18 -13 -18 23 9 12 9 2 -13 11 9 19 0 17 19 -1 -4 9 -7 9 13 -18 13 18 -24 8 17 0 -9 0 -23 6 17 11
2.27423A1RNl3N2k7j7K7nj7J7mKRnJ1j8J8k5K2K1k1lOj8K6nRlj4k7MJ2jNQk2L3m1K1J7o3N1onq
2.25134HkRoj2K1rj2j6PK8k8LKK8l1MQRj2K7k1nPk8kJK6rqLJ0j3Rmj5PoJ6mk4L8j5k2M2J3nk8
2.22743a1J1jmrJ5rK4j6mJ1k3K7j3Kk7J9JPmqJK%P%KJ2l5K7Jk2NMlJ2J4j6jTj2J1lL8j7k8L1j7
2.20352@k0K6pQj7jLj0L2J%k0m0L5J1k2L0Jjj2rRplJ5Tl3M1l8K9j9j7J8k1L6n8N8k0K3m9J7nJ3T
2.18114ElK1l6J9j0j9J0TpQLMPk3j5K3J1Lm1L2%pk1K6j9lK9Mj9OnpQk9K4Qk7J5K9l1jJ0J7jml
2.15774Ak8L7l0K0MplJMj6pJ5Lj9K1qRk1M4m2PKK3j6lj5NL9k2rnK3k2J3j7PJ5l2K9j8L0m1L0k3
2.13535b2K9l6K0Qj2JTMoMk2L5k7L2J0k0mLk6OL0nj6Lj4RK6%k1JLj0J1%J6Ql8kJ7qj6K2k2L7l7
2.11246b8K7onj9L3K4l0K5j4j1Mkl3K1LOK4k1Nk6N0n2M2m8K1%pK5m3N6k1j4Q%kNkJ3Jk3K9m4J2
$$ plain form
2.27423 11 20 25 -8 44 17 0 27 22 5 22 18 20 29 24 35 17 35 10 32 53 32 29 35 17 43 38 47 44 30 3 7 19 18 23 31 9 42 1 22 39 -24 27 21 16 8
2.25134 8 6 15 9 -3 18 9 -3 -19 -12 16 -12 -9 -7 21 -10 -6 2 11 -1 26 5 0 7 -21 -23 -22 4 -5 -13 -10 0 -13 -4 -8 -23 -16 -22 -6 -10 -34 4 -11 -33 9 22 17 -11
2.22743 -11 0 -1 -5 -14 1 -8 16 0 -4 7 -16 11 -2 0 -27 -8 -7 0 -4 -12 -11 -9 -9 -2 -2 0 12 -23 4 5 -17 -12 -8 -11 1 15 -1 -2 -3 -15 -4 -7 31 14 -14 17 0
2.20352 0 -20 6 -1 7 -10 -11 -8 -18 14 15 15 -5 -45 -10 1 -21 9 10 9 -3 -12 -3 -10 -13 2 17 -16 25 -13 16 -3 -20 -2 -23 13 -45 13 -7 16 -33 -16 -21 -8 5
2.18114 5 2 23 -13 6 -4 -23 -13 -3 -10 -2 1 5 12 -11 -26 -3 8 11 -30 2 2 -5 -26 0 -19 -22 7 11 -8 -2 -7 -14 -6 -35 -11 -3 -30 -15 14 -17 -18 -8 9 8 4 1
2.15774 1 -27 10 -20 0 4 -3 -6 -5 -1 -17 -24 -9 -6 -25 -4 -12 -3 -24 20 -22 -15 -13 10 -6 -9 -24 -19 20 -2 -11 -16 7 -15 -2 -19 -12 3 -29 0 -18 12 -29 1 -22
2.13535 -22 7 -29 -9 -1 -13 -12 -11 -7 -13 -9 -31 4 -23 9 19 -1 -5 -2 -28 -22 8 3 -13 -10 -24 -15 11 11 -10 -9 -6 -16 -5 -5 11 19 -19 -21 -4 -12 -28 -6 -28 9 -28
2.11246 -28 -1 -7 -12 -31 2 26 -4 21 7 -4 0 -2 -35 -14 -11 -5 19 -2 3 -23 27 -25 17 -31 -10 -10 -17 8 -35 21 0 -14 -6 -6 -8 -3 -5 8 9 -14 15 -29 -17
2.09059a7K9l1J2j8K5rnNJKj3J6qj0L6l0J5k8K5knLJ2Qj6J5l5K7l6K1Qk8L8j3J3k7J7nlK6m1M4
2.06922A8n0L9j4K8l4OLK5k7KJ0MTn1K3%O%NMj%qkj8MJ9J5k0MJ5l6M9l7PK2m8L5k6J5QJqMk2K4
2.04582cJ4j9QrK1k2MJ4l5L8m3J4RJKK5k0k2L5k2J2l9N0k3Pj8J8k1K1MRj4Ml4L1J9j7k1OlK4l5
2.02445c0QJ4J0k3J7k2L9j7jJ1klj6qK1PKnj3K9l9OJ5rJK0j6LL1m7J5Oml0N0l8J0OrJ6J3l3J1
2.00258dJ4j2J0jMj3jK2l3N1k4Nk8K9Kj7J7oTjRl6L3j1K3j4Pj8jK5NnLj4OK6l7J7kMLQK7lL4K3
1.97918A20J74L39M13J66J07J3j26l48l26r9o5Ml4n6m3n1p7m9k7oj2pj0L9n6K7j4NnJ1j7LOKTj9
1.96086a6nM1k9Lj7K7mK6k4l6K6JJ0k3K3j5k2L7J2pj1nK3k2mJ4k8K5J3Oj8j6L6j3j6L2j1j9jj8L
1.94001b2J0rJ2JRJ0k6jJ8kj4J8Mqk2NJ2KNpJOk2J5j4L7j9j7Rj8K6k5L4l8L6mj9%Ul1M9j2pkMK2
$$ plain form
2.09059 -17 12 -19 -7 -25 0 -9 -14 -9 -8 -6 -19 -3 -11 -21 15 -15 0 -28 -3 -5 -10 -7 5 13 -3 12 -23 4 -32 -11 -3 -31 7 -6 7 -20 -3 -8 -11 15 -26 18
2.06922 18 -32 7 -7 21 -13 -7 -4 21 -6 -4 6 10 14 -37 -14 -14 -8 -8 -3 1 0 0 -8 -10 -28 -24 -5 10 -10 -6 9 -27 22 -15 -8 14 -34 1 -25 -10 -2 -1 -9 -5 -27 -3
2.04582 -3 11 -8 0 -9 12 -10 -6 8 -27 11 -32 -18 -9 -8 -6 19 -1 -23 12 -10 2 -37 13 -10 -3 -21 -3 -24 -3 1 10 -4 0 -34 -3 16 -1 -22 -16 -19 5 -30
2.02445 -30 -22 -8 2 -21 -4 -26 13 -4 -5 6 4 1 -15 -23 -2 5 7 2 -11 18 -21 -15 0 -9 -8 12 -4 -1 30 -17 -2 4 0 -30 20 -18 -8 -2 -11 5 18 -15 -4
2.00258 -4 10 -2 8 7 11 -2 -3 19 -14 37 13 18 -10 19 21 4 21 15 9 8 17 -19 14 3 26 12 19 1 0 25 30 25 28 14 20 46 9 26 24 28 31 39 66 63 97 120
1.97918 120 294 633 1046 1212 1319 1332 1206 858 532 433 368 372 338 282 239 188 111 62 35 29 17 10 0 39 -17 10 -4 1 -4 7 -10 -7 -1 1 3 -16
1.96086 -16 -21 20 -9 -6 -23 4 0 26 2 -34 -8 -7 3 -20 3 -12 -34 3 15 8 -3 -8 15 -7 -11 3 -25 0 13 19 1 -15 21 8 -8 24 13 -6 -7 -25 -22
1.94001 -22 -12 -21 -9 -8 1 11 -15 -16 2 0 -14 4 8 0 -22 -17 -5 -3 2 -5 -4 2 -20 -5 -19 18 -1 -18 -9 -27 -1 -26 8 -30 6 2 -17 -17 -17 -17 -48 1 -11 -18 -20 -16 6
1.91610Fn0K3OK2k8J3J7k1J6k0K5l2M5l1QK0k8K4kql7L1j7ROJ9n0M0J2j9k6K6KJjj1J7j6Ql1L3P
1.89473HJ1k5j9L4j0k8J9K7k4j3J3j0J4j0KJ2j3nNM1n8JK9j3TJ2K3j4k1K7pPk%jmKm2M1K3k8j7
1.87337b6J0loJ7MJ3j8Kk9J9pL0j6J2jj8J2J5j9K1j0nj4J4j6J1oKRoj1K0j5oj9N3k6JQk1M6k1j8
1.85149a8nJ4mpPOKMk1L1l1K2j2LkJ7j4J4lNj6J9j1kk6K5KnrL3k2Pj3mPT%nqJ9ll6K2k1J9mJ9o
1.82707dK3k2J6qj9NK1j4%J2oMJ1n8K2M0m1PJ1J2j7lj4lJ6J2j7K8j7j9J6j7L7j7j2QRk2Pkk8M1
1.80571bj2kOkJ7JJ1m1K2mLkTK6l3KlJmJ2L5n1K6J4k2Nj3K1k2%K6m2N1k3%j1K1l9K4lPK5m5J9j9
1.78282b2OL9m9J6qJ9j5LKkKNOk2K6J4l5JK2k2oRPj6PJ1lj4J4j7J8RmpLJ3Qk4J9k3mj5L8j6L3l1
1.75941enJ4j9npM4j8K%k0PJ8Mj6oJ3k8L5Jnj9PlK2k1J7j3J4k5%K9k5LJLL0k0k3LKJ0MrMk4J4qP
$$ plain form
1.91610 6 -44 -21 -15 7 -21 -8 9 -12 4 -16 9 -23 22 -9 -1 19 -9 15 13 5 -32 -1 -18 -9 -3 16 -34 6 18 -1 -27 -1 1 2 1 -10 7 -9 -1 -32 1 8
1.89473 8 19 -6 -25 9 -1 -29 -10 17 -7 -20 -7 -17 -3 -13 -11 1 -12 -17 -12 29 -29 -28 1 -12 -25 -13 10 -4 -25 2 -5 2 0 0 -1 -5 -3 -45 -4 19 -9 -26
1.87337 -26 -16 -19 -25 -8 -4 9 -9 -7 -36 -17 -24 6 -10 2 1 -17 -5 10 -9 12 2 -3 -17 -3 -19 -8 -14 -12 -3 -9 -20 0 -15 -21 -40 13 -13 -12 -4 -25 21 0 -18
1.85149 -18 -23 -9 -13 -20 -13 -7 -5 -1 -22 9 -22 0 -12 -9 -11 6 -8 6 3 8 -8 11 0 -2 -28 -3 -1 -6 -15 18 -4 3 -10 -14 -7 0 0 -5 -13 6 3 -33 -11 -32 -13 -17 2 -4
1.82707 -4 19 -3 13 5 -14 -9 12 -2 -2 10 4 8 19 -39 -17 23 -18 -11 0 12 -5 -8 -22 -25 -9 3 -14 14 -3 -22 -6 -23 14 -3 -15 -7 2 -20 -13 -15 -43 -2
1.80571 -2 -14 -16 -10 -12 5 6 17 -24 -2 -6 -3 -5 -7 19 -14 -12 -15 -14 -18 -6 29 -22 4 18 -4 1 -12 9 -13 -13 13 -29 22 -1 -1 -12 9 -30 -6 -9 -2 23 -22 -3 -22
1.78282 -22 -16 23 -26 -10 -18 1 -14 -11 -9 -11 -9 -4 2 -20 6 20 -15 -14 8 -14 -20 -11 -4 -20 -13 -2 -5 -19 -5 -22 -4 5 1 -6 -3 10 18 -6 13 -10 -14 -29 9 -7 26 -5
1.75941 -5 -10 4 -15 -20 -27 17 -1 1 1 -19 -12 6 10 -6 -12 1 -27 8 9 4 -15 -8 -11 11 -10 7 -6 8 -17 -17 12 -13 -10 -9 -6 24 4 -19 -16 -14 -4 0 -9 -5 -29 -15 -23 -16
1.73500a6J5PjJl4K5Joj7J8J7k3J4rQoj3PQJ0j9oL4k9K5j7j2pL5k0j7K6KL5l9Mm7N2pj8POJ5MJ1
1.71210B4l5K6k5K1j9J5k1pLJ8j3J3KJ6l1pOTrKJ5m0L8mK0k0TJ4LK4k5J4k6J6j7J0Rj2K7Lm3OJ6
1.69023gjj1J2l7M3l7L5j3K2k3KJ5QnPj8j5QJ2mk9K3PqJ8k7M7j8KJ0l5KRqJ7Pk8J8mkj9J1J7j4K
1.66734ik8K6pjL1l3K9k9%J1Qk1K3j4MJ6k6LJ9k8K2oOk7K1JTK%l2J4NQRj2J6j5J4rkPkJ6l0J1%J
1.64343gqNRPl7O0m4M4o2J9J3K3l5K9qj7j2oJ8QJ6ok9K1j5J9Pk1Ok3L6j9J5j7JLk7K4Jj0QmJ6lK
1.62054@j2K6k9J9k7J1J4OmNK1l2j0OlmJ3l8L5Jj2nLrJ9MmlmPJ3k4K9j2lj0rK9mkk6K8J2Jn7RL1
1.59663aj8J1K1k7%TL3j6k4J0j6PJ4j2PMJ3oJ9l7J8k2K6j6J9k0J6qoLjknJ1k1K1MQjk0lJ6LJ9l5
1.57373a4J9j1J2%jJ4j4J9j0l8L2k6j1nN3n4O0j7j1oJ5j1KmJ2j6J1Lpj4MJ4J0j0k6K0OmQJ8k1Mj
$$ plain form
1.73500 -16 -1 6 5 6 -28 -3 -2 -8 -25 -7 10 -13 1 -8 0 -6 -19 -12 -4 6 -13 -19 15 -14 11 -6 -18 -25 10 -10 -27 -1 1 36 -3 1 -46 6 -1 -19 -12 -6 9 13 24
1.71210 24 -11 15 -10 11 -8 7 -14 -21 -18 0 -13 0 2 18 -13 -20 -14 -8 -17 -15 0 -40 -2 -6 14 -6 -26 -12 -9 15 -10 4 -22 -6 -23 -13 -4 -16 11 14 -29 -23 -7
1.69023 -7 -8 -19 -7 -44 -1 -38 -3 -16 6 -17 -15 0 8 3 10 -8 -23 -15 -3 -7 -36 -13 -6 -14 4 -23 24 6 8 18 -17 -15 -6 -14 3 10 -18 0 -4 -6 -25 -14 3 -11 -9
1.66734 -9 -37 -11 -18 -19 12 -21 8 -21 -21 -10 -2 -23 0 -14 -10 6 -20 -17 2 -26 -4 -10 -4 -31 -10 -9 -8 -6 -6 -38 -24 -19 -11 -2 -14 2 -13 1 -8 -10 -3 -5 11 -19 -8 -8 -7
1.64343 -7 -15 -10 -1 6 -31 29 -15 29 -33 -14 -1 22 -13 16 8 -9 -21 -27 -9 -1 15 9 -20 1 -14 5 12 -9 -3 -26 10 -9 6 -11 -10 -7 -34 -10 -9 -19 -11 -15 1 -2 0
1.62054 0 -12 14 -15 4 -23 -12 2 8 4 9 30 -2 -12 -6 -9 -13 0 -38 -3 -2 -14 -19 -16 -25 -6 -2 -6 -9 -13 -6 7 -17 12 0 -3 -13 -22 7 3 1 -25 3 15 16 -41 -32 -1
1.59663 -1 -19 -8 13 -14 -14 -14 19 3 -21 -11 -27 -20 -6 -18 -11 -7 6 0 19 -18 0 -22 4 -12 7 -13 3 -5 -11 -8 -9 -11 -16 -5 -26 -5 -1 7 6 -14 -17 -1 2 21 -14
1.57373 -14 5 -6 6 6 5 19 5 24 14 -24 8 -18 -29 -34 19 -35 25 8 -3 -9 6 -5 -3 -7 5 -11 0 3 -4 -18 -14 0 10 0 -26 -6 0 -4 4 22 1 5 4
1.55186DokJ0k5J7kj2J5J7m5L5l2L3k1K0Ll8RQJ5k0J1L7m2J1rmnKmK1j4J7k9QJ0J3L1m3POl0L0
1.52999Gj3%k5M6j8Qk6J3K2k0k1J6k6L2j4JMk4O5m4MM1l2Jj6NpK0J8m3J6KK6l2J4Ml0L9j5k3RJ4
1.50862b%j8OJ5K7k1ql3L8j4nOmRj0j8M2j6j0K0k6L1Mjj3nPpL9p2K5j5K8oJ8k8kJ4nlK9l1j3K9K
1.48573CJ0j1Pj1J3k2mqN3l0Mj7Rjj9J0K6l5J1J2j1L9n4L4k7NQJmj2L0Nj8k9K6LMj9NJ5J1Oj9Mm
1.46284aj7K0kJj4j8K0NmJ0j0J2j1lJ3k3L2n2P0k5Jl1L0J5j3k4J2K1k6oQK4j5kRj4K5m3M1k4J8
1.44198Im1L0kJ1%k6K1J5k7nJJ8Lkk7K7l5QKJ2j1J8J2mQml5K5j7J8Lj6Lj3L5j7oOJ7j2TPpK6j3
1.41909Cj5mK3k1%TN0k7K4l4K3j6OnjJ1l5K5j2J0l6K4pOK3k9J0J3Qm5J4J0k6M5l2N4n2K7l6J6J9
1.39823A1oNl1M6n5M1qK0l5L3l0%RKj5J9oOj3OLn5P9m3L8l9K1nK3k6k3M6m6L1J1j6MmJj0J4l1L3
$$ plain form
1.55186 4 -2 -4 6 -19 -2 -4 -16 -1 16 -29 6 -26 7 -14 6 9 -29 -20 -12 3 -17 -6 31 -11 0 -9 -13 -18 -16 -20 1 -13 4 -25 -17 -7 6 37 -6 1 7 -23 7
1.52999 7 -6 -6 -31 15 -3 5 -21 -8 14 -6 -27 -11 -37 -5 -19 -18 -14 -38 27 -17 -13 28 -4 -3 -19 -14 -21 -1 17 -26 -10 -8 18 -14 0 4 -26 13 -2 -25 -16 -2
1.50862 -2 -2 -20 -14 1 28 7 -1 -34 4 -10 -15 -9 -13 -4 -14 -32 10 -6 -16 4 -22 9 13 12 -1 -6 1 -6 33 -39 -14 -29 -1 -7 11 -17 -19 -5 -10 -13 16 -15 -28 1 3
1.48573 3 13 2 9 -2 11 -11 -15 -23 30 0 4 -13 -4 -5 -24 -14 12 -23 -12 0 -11 28 -26 8 -19 -14 -6 -5 -9 -21 9 14 -4 -33 -7 -4 0 -19 -14 1 12 18 -1 3 -1
1.46284 -1 -18 2 0 1 -13 -31 -11 -6 -10 0 -10 2 -9 -12 1 -22 10 -42 28 3 4 -27 3 18 5 -19 -7 14 -12 -18 -10 14 -1 -3 6 -8 17 -26 15 -9 9
1.44198 9 -32 -2 -4 7 7 -19 2 17 -10 -15 -14 4 7 5 -22 5 -30 -22 -20 -8 -19 -1 11 7 15 11 -24 1 -16 2 5 -11 -8 -21 14 -3 -9 -3 14 2 -10 -3 -10 16 3
1.41909 3 -12 -16 7 -14 -14 -14 36 9 33 -1 22 6 12 7 6 17 -18 7 -5 5 -31 -7 -14 -8 15 -14 -4 9 17 -28 -14 -4 -30 15 -17 37 -15 12 -24 -8 11
1.39823 11 5 10 -21 25 -30 11 3 23 -12 21 -9 -9 0 2 -13 6 0 6 -7 -1 2 -53 26 -17 21 -18 3 -2 21 -5 -28 18 -28 3 14 -2 2 -2 -1 -11 3 -28 5
1.37635EnK5l0Nj2J6k2J8%Mjj5J0J2oj0K2n4M2n0M3j1J3j5J1l6J4LJ6kNJ1j2oJ9k5K0kJ2Pk4l6
1.35499d1L4J2qOj2k0K4jOJ0k4KQpJ9k8L7k5LpmOJ6lqTJ4qNqpL7m1J1MlmJ5rOk5J8LqK3Ok6oJ7
1.33006Aj0k3K9pOrqJ2Mj5pJ7J3Pj6QJ1k2oJ3J8j7rLKjJ7k3Lk0L7j5mKpJ4jOJ6m2K0Qk3%J3J1j1
1.30615eL0k3pK2k2KRJ8k1mj8K5j7QPKj8J2k0J4j0K3j2Nk9K8%oJ8k7qK1j0N%LmK2j8rJ4J6Jl3K4
1.28326Hk7K2rLTkJj0%RJ8j1kLNj0jrJ8j9rJ9pK2ll1L7j3K2ok7qL5jj9RK1k2K9l0mnL6l5Lj8L3o
1.25884A2J6l0JJ3Tlj8J0j4L8k9LK2j3jl5M1j0J1j4nJ3oKk9K2k1K6J2oj6j0K8j5K3j5nJ2lk9L7
1.23799B8k8P0o3J6l9M8m2M8l4L1qk1L1l1lK6Lk5K2lj8kN6m3J0jJ4k4M7l8MOPj3J9m3J7Nj9K3k0
1.21713A3RJ5Nk8J3K8l7M6l5K3l8L7k0L4m4K4j8l7L4J0ORk2K0j9QK6j7j2Rl1J8j8M1l3J1k2KRj7
$$ plain form
1.37635 5 0 25 -5 0 -12 4 -18 0 0 4 3 -12 -2 10 4 -6 16 -38 4 -46 -3 -14 -1 -16 -5 -41 -27 -24 -8 -10 -5 6 -6 -12 7 -18 2 0 12 19 -5 -41
1.35499 -41 -7 5 -3 3 -9 -29 -5 -6 0 10 -14 -12 -4 -11 8 -20 17 -8 -5 -12 -16 -10 6 3 -5 -13 1 -7 -2 -10 -17 20 -21 -10 -6 -9 -13 2 -7 -1 -26 -8 -5 -13 10 16 -10 -16 1
1.33006 1 -9 -32 -3 -10 -4 -13 -21 -9 -5 -20 -27 -10 3 10 -6 2 13 -9 -15 -2 16 -1 -10 -7 -5 -6 11 -12 -9 -29 8 -7 -11 -9 -16 -2 -3 3 19 -23 -3 5 -18 -18 -5 6 -5
1.30615 -5 25 2 -5 17 -5 -3 6 24 3 -1 -19 6 -11 -3 4 6 -12 0 -20 -6 -16 7 -5 0 -29 -1 -1 -7 11 -16 -24 -3 -13 -8 -8 -5 -9 13 -5 -14 0 16 17 -16 8
1.28326 8 -19 3 -6 -3 0 -2 -1 -11 -11 -2 16 5 3 6 11 1 0 -9 9 -10 -19 0 -7 15 12 -19 18 5 27 21 -6 -14 21 20 1 10 31 9 38 8 4 -1 35 0 3 -15 18 12
1.25884 12 28 -2 -1 12 25 22 4 14 0 38 9 12 34 21 20 -15 26 16 27 13 8 21 15 17 -12 10 -11 15 27 21 5 -5 23 8 31 16 11 23 20 -9 28
1.23799 28 0 70 7 23 -16 32 -10 38 4 35 27 6 37 6 3 29 32 7 29 26 8 6 62 19 29 28 42 18 65 27 31 37 44 31 50 7 24 29 10 33 13
1.21713 13 22 37 42 14 27 55 18 64 29 52 14 51 31 65 21 45 27 -10 24 34 40 49 27 47 28 36 62 45 33 42 11 29 11 52 19 30 8 10 19 2
1.19678BK4Qnk1J0J4J1m0M4l8Qj2L3j0M7j8M6J62J13o0L9O0j49p8l5l9j3K0j2Tm5J1k4nj2l1J6
1.17796IJ7j7j1RJ0KJj4NQJ2m5J4J1J6kTj0LJ4OJ0kTL6L4J27M36J1o5J69n8l18j33p7J6j4Pl5m3
1.15761A35m1k9m7Nj4J6l8N3Om8PrJ1J4pk0K6j6K0k6k1L9j4lPJ5%j5L0%K6l0O6J29J68o3K3M4r0
1.13777C09r4o1rJ6l2k9j0K4l6nj8m7L1l0knM2k3j7k5M0k5J1j9L0m6L7j6%kJ3k1J1J9j2jrmJ5QK
1.11691A0l6L8k3L1n3N1k7L1l2mp%J4PJ1k2K5pn%J9k6K9l8J8J0l3J2Ok2K4mkJ5k9K6j2KTkLOj3Q
1.09453ALJoKpJ8l6LMORkj9K1lK5k8J5j0kJj4L2j8J1l5L0k2j8L3j9N7n4L5j8%J7j5J8nk5J4Rl7
1.07215b8L2j3J6j6J6%O%j9J0k3L3j8J5k2J7m2O0j8j0Kj9LK2k1K2j1j9K2k0L4JqKj1Qj5J4j1j3
1.05180b2K8Lk0NJ7mk6L7%J6l0mljK2j1j7j4J3K6j6qJ3J7k7MK3k1k9L2rk5M3k5J8j8K9o4Q4n6K9
$$ plain form
1.19678 2 26 34 29 8 18 32 43 3 47 9 17 5 38 28 75 57 103 265 378 318 357 417 268 190 155 116 103 123 111 99 54 65 41 36 24 -7 9
1.17796 9 26 9 -2 7 17 19 20 6 11 19 31 -14 0 11 27 25 23 13 16 30 36 46 44 42 78 112 239 675 686 621 790 732 414 281 204 220 206 213 178 135
1.15761 135 94 65 18 23 9 25 -13 40 46 -2 5 -4 7 21 14 -6 20 4 24 -2 -23 16 2 -1 6 21 21 6 36 36 62 32 98 227 395 332 355 399 309
1.13777 309 215 154 145 161 129 100 90 114 78 73 55 8 39 9 7 2 44 21 4 -21 19 -6 5 -14 16 -30 7 -9 -9 -11 2 -19 -8 11 -1 -2 -11 -15 0 8 10
1.11691 10 -26 12 -11 20 -33 18 -9 22 -10 -14 -21 -21 -7 0 11 -11 14 7 2 2 21 -5 24 -14 4 14 -19 -7 -1 -23 1 -3 -5 10 -19 7 -5 -3 -1 -3 0 6 -7 1
1.09453 1 4 5 -1 1 -6 12 -24 -21 -17 -11 -2 -4 -23 -2 -5 20 -8 7 -3 -5 -4 -18 14 -4 7 -28 2 -20 -38 -5 -24 33 -21 14 -4 -4 13 -2 16 11 -14 0 9 -28
1.07215 -28 4 -9 7 -9 7 7 13 13 -6 4 -19 14 -4 11 -11 6 -36 24 6 -4 -2 -21 -18 4 -17 5 -6 -25 -3 -23 11 12 4 6 -5 3 -12 2 -9 -22
1.05180 -22 6 9 -11 -6 11 7 -19 18 18 34 4 0 -3 -4 18 7 -10 -24 -11 15 -1 -9 4 21 -6 -2 21 0 -29 3 -6 -31 12 -13 5 -13 16 -48 36 -20 9
1.03094Il9L0Kl7L0j7K0qj7K4k2K5oj0RLj6J3Tj1K1n0J9Mj5J1mL1m2K0Kj2J5k3L3l6L5Kj9L3j6
1.01008Dj2oL1l8L1rqKMJ0k3qJ9J0j8JjrM3m4M1j6J5k1J7r%j7K4l3K2kj1JJ2k7K5k6rJ5%N0m3NL
0.98719ej5K1KqJ3o3N1k3L9l4M3j7mnmOLJ8k6L6j7j0OpJnmK0j1k3J7Nj0nROqkK1km1J5J4JJ2j3J
0.96328bKPj2j3OJ2%ljJj2kNrJ2k1K5j8K1k9K0k5K3K1k6L0j3k1J0PLJ4l1MJ1Lj3J2qnK5Jk3J1j3
0.94039a4j0J0LMK4nmokK0K9l2J7nl6j3M9l3L0l1K8l9J9j6K4ljl8J7pRj1K3JJ2k6L8k0j2MKPo%T
0.91750@J1k4J0lJ6J9l7RKL1MK7nlK4k7j8kj0Nj7Rk2Oj3M0n1N3l9JK0k0LMRj7nJ0lj1J2LTnjJl0
0.89359c1J2K8kJ8l6K0l0L9k6K8k4L0Lj5J3Nj5Lm3PRNj3J5J6K6n1L3m0Nj7K0j4NnL7%k7K6j4%K7
0.87222B7m1MOj3mK7oJ0j1J1TqmrQNl1L1k4K0k1K0k4K4mTjJqJ3J7k2J7j9J4PNj1j2jJ4Mk6L3k7
$$ plain form
1.03094 9 -30 0 2 -35 -5 -22 -2 -10 -27 -3 -25 0 -6 -16 -7 -4 -20 -7 6 -5 16 -34 -15 -11 -26 -15 -19 12 -30 -10 -8 -20 -5 -28 5 -31 4 6 -13 20 4
1.01008 4 -8 -14 17 -21 10 1 -7 -5 -1 9 -14 -22 -3 7 -11 -10 -11 -20 23 -21 20 4 19 -2 15 6 6 -11 13 -20 2 0 -11 -10 2 -25 0 -26 -35 -20 -20 30 -13 -8 -5
0.98719 -5 -20 1 3 -5 8 -55 -4 -27 12 -22 21 4 0 -5 -9 -3 0 18 -8 28 11 1 7 0 1 -4 -8 12 1 -22 -5 0 -10 -15 -6 0 -8 -10 11 9 -32 -17 -3 -2 10 -3 -2
0.96328 -2 0 7 -5 -18 -12 0 0 -3 -4 -3 -15 -17 -12 -21 -9 -30 -5 -23 -2 -31 -11 -36 -13 8 -18 12 -1 -22 -12 -5 -2 12 -19 -15 -4 -1 -14 -2 -10 -15 10 11 -12 -1 -14
0.94039 -14 -24 -14 -11 -7 17 12 8 2 0 20 49 17 34 29 -7 -20 29 -4 26 -5 23 -16 3 -13 11 8 7 -31 -14 -21 -12 -23 0 1 13 -13 25 5 -7 -3 -1 6 0 0 0
0.91750 0 11 -13 -3 -6 10 29 -8 1 3 34 38 65 60 57 81 54 36 34 24 29 12 21 -1 5 -8 32 -19 34 -5 -4 16 -4 -1 3 12 -5 -10 0 -3 -14 -2 1 4 -1 -2 -1 -31
0.89359 -31 -19 9 7 25 -11 9 -21 18 -8 20 -4 26 29 14 27 32 17 20 -23 -16 -7 -2 -15 0 16 42 -9 24 -16 -11 -28 -8 -22 -17 -22 15 15 -12 14 0 0 27
0.87222 27 -14 -10 -4 -17 -21 6 0 10 -1 10 21 13 9 0 8 13 -18 13 -11 9 -12 8 -16 8 4 0 -1 0 -8 5 22 0 17 -2 12 19 24 13 1 0 14 18 -8 25 -2
0.84933bJ4lk0K5%qPkKRj6K3j1L5l8L0k9kJJ6Jj5j1Nk3L0JJ2onj9J2jQkj6J0k5L4m5N6k5K4l0Ol
0.82593Dj0KMoQkqK0J5l0L3l2OK9j7JK8l2k0J8Kk1L1j0j5K7j7J2k0K7l1L0j2j1J9l2J9k5LJ3Krk
0.80405iL4j9Pk0pK0%J3j0Tj3RTqKj0Rj7K2J0j8MNnJ8rk8L0k0RJ6lj2Rl2N5m3Kk6OL0mLkLm6O3
0.78015A7m9J4J2j7L5k1%l0J3J4%J7k6L5j4Jl0K4rJ1l0M7l0PJJ0j6J8j9k1J3KQPK%rNJ4k0J0j3
0.75878a7j4K2j4K3l3J7K9l1L4m6N8l1oqkj4K0J3j3J7JRk3K8k5k3M2l6PK5qjj0j6J3JNQJ1k2j7
0.73792b7N0m1jL5m8MJ5l0M3%k9L3k2oK8Ol4kk0M5k2PlJ4j1J7k7O1l6l5L8Ok1OpJ3J5k4J2j8Rq
0.71656a5J5M3l9j1mOjqK0onk3K1qJ1Nk8J9j3J6j1J9j3%j4K4k7LNj2J5nJ5j3JToM2m6K6k0KK8r
0.69417@j6L3j2j3NPKrj2J3olTK9k7L2o0J6L5l1QJJ8j4J9l3Qj0J7l5L9MknOjm0L5J0j8jJ0Okql2
$$ plain form
0.84933 -2 12 9 -11 14 14 6 13 11 13 22 6 29 18 53 15 45 16 14 15 31 32 17 6 11 -12 18 19 31 25 20 1 13 12 20 18 2 12 -13 21 -24 32 7 31 1 7 4
0.82593 4 -6 -4 0 -6 2 0 -8 12 27 -3 30 -2 4 33 16 17 45 13 -7 11 13 -8 23 13 -2 25 8 20 0 27 -4 26 14 3 22 -10 9 -16 -13 0 2 -7 -9
0.80405 -9 25 6 13 -7 -14 6 6 19 9 -1 -14 -5 4 -4 -2 -12 -3 -20 2 12 -6 -2 3 -2 16 7 -21 9 -11 -2 14 11 -1 8 -24 31 -12 -10 -36 -30 0 -4 -1 -3 0 -46 17
0.78015 17 -32 -18 -6 -23 12 -9 -9 -39 -26 -12 -12 5 -21 14 0 1 -29 -5 -14 -3 -33 14 -16 -9 -8 2 -14 4 -15 -36 -23 -21 -13 -6 -4 -4 -13 -8 6 -14 -4 -17
0.75878 -17 -31 -9 -23 0 -33 -16 13 -18 16 -30 28 -3 -9 -17 -19 -33 -13 0 -13 4 5 14 -9 19 -6 -29 13 -23 -16 9 1 0 -10 -26 -13 -12 -7 1 12 -10 -27
0.73792 -27 23 -18 -19 16 -32 -28 -13 -43 0 0 -29 4 -18 -24 4 10 -24 -26 -46 -1 -23 -16 -19 -5 -16 1 -26 35 -1 -36 2 8 -13 -7 -14 -1 14 -10 2 -16 -7 -15
0.71656 -15 0 43 4 -7 -11 -5 -6 -14 6 0 -5 -28 -7 -15 -4 1 -27 -8 -21 -5 -16 3 -10 -10 -24 0 -27 -24 -19 -31 -16 -21 -6 -19 -18 -17 -23 19 -27 -1 -21 -19 9 0
0.69417 0 -16 17 5 -8 -3 4 6 -3 -15 -2 -8 -11 -14 15 -12 20 -40 -24 11 -20 -12 -11 7 -7 12 -21 -13 -23 -6 -41 -2 2 0 -5 1 0 -40 -5 5 -13 -14 -4 2 0 -8 -40
0.67077d0M2K1k2jpj4ML5j4j0j5L4kQl5RJ5J4l7J3MRj1J2j4JJ3l8PjK7l4K7k2Oj5KK5jTj1pL9j8
0.64839cqJ5j0r%mJ5J0j3jj3oMJ8j7K0J9k1mnRj6O%K2l7J3j1kL1k4L7l3J2%k2M7l8J9k9K9l5M2
0.62651Gj9kK4k2K3k5K0oj6LklJ4J8k9MK7j6j7K3pMj2L0j9J1k0L0k7Pl8J9QjPl1L9l1K0mK5j4j2
0.60464a0Lj3lJ7k0J5kMRmj6J8ljj2LOJ3j0J2j6nk0K6oTj7K9NmJ2oj2oK2j7J9JqJ7k2mj0jJ4K8
0.58124A9j8kk7K8j2%j6K0oJL%qJ4k7L8l7J0RJ0j1nOj8L1k7J5lJ5k6J7r%J3l8N7j6pl8J3L6Rk6r
0.55886b2J3%olJ0Oj3J4j7K4k6J0Jj7OJ4OkJ6l1J8l0N4m0J6j2rqJ9Kj6J6qJ5oj2J9jj7J2j0J4j
0.53698bj2M3m2J9j9J6jonJLj3KORJ8j8L1l3Rok5M2jn0K9oKLj3k0NTK3J1k7jL9k8J0J3k5pJ2N%K
0.51307bnpj3L3m1M0j5K4j7k7K3PJ4m1J3lmQJ1LNj9j4OK5prLrjJ2Pj2k0M0l5MK4j7K0j6krJ0j9
$$ plain form
0.67077 -40 2 23 1 0 -7 -21 -17 18 4 -6 -21 13 11 19 -16 -7 8 22 -15 -2 2 11 0 12 -2 -1 12 -26 -19 -20 7 -27 0 -22 -16 -31 -29 -4 -5 -6 -17 -24 15 -3
0.64839 -3 -11 4 -6 -15 -15 -19 -4 6 -7 -8 -21 -27 -23 -5 -22 -2 17 -4 -8 -13 -4 -20 -14 -14 8 -29 -16 -27 -29 2 -22 15 -18 -6 -6 -28 19 -19 0 -29 0 -35 7
0.62651 7 -12 -14 10 -12 11 -14 6 0 -16 -13 -15 -18 -4 14 -15 -11 16 0 -17 6 -1 3 -9 21 2 13 -7 23 -4 3 -35 -16 -8 -9 -2 -33 6 -25 -5 -9 16 2 -10
0.60464 -10 -7 -20 -23 -6 -26 -11 -13 -9 0 -4 -20 -2 -5 -6 -18 -15 -9 4 -6 6 -10 -15 -35 -9 -15 -21 -38 -9 -4 -8 4 -2 -14 -20 2 -15 4 5 -3 14 -8 -12 -22 -23 -9 19
0.58124 19 1 -1 -28 0 -12 -12 -28 -8 -14 -13 -10 -10 -18 -4 -31 7 -30 -20 -11 -1 -12 -17 -11 -29 2 -25 -10 -13 2 -24 -7 -16 -16 -3 -41 16 0 -7 -45 -32 4 13 -13 -22
0.55886 -22 -9 -9 -15 -18 -8 -2 -15 -1 -18 6 -20 -10 -9 -26 -20 -6 0 -2 14 -17 1 -29 25 -15 1 -11 -20 -28 -9 -7 -23 -7 -15 0 -6 -18 1 0 -17 -5 -15 -1 -2
0.53698 -2 -14 29 -13 6 -13 3 2 -4 -9 -8 -5 -18 -16 -10 -1 17 -1 30 -3 6 0 -25 17 16 -34 -5 -11 -9 -6 -19 -39 -34 -29 -6 5 -22 -23 16 -12 -2 11 -14 -21 -9 -4 -4 -2
0.51307 -2 -7 -14 -27 6 -35 5 -10 14 -3 -30 -7 0 14 -27 -14 -17 -21 -13 -2 1 6 -13 -27 -21 4 -3 -12 -9 -18 -19 -7 0 -12 -32 8 -27 -23 1 -16 4 -12 -14 -23 -13 -32
0.49018c2K9Rk8KkJ8Ol0QL4j3lTJ1n3M8l8L3J7m4K7k6K0J7l9K3rj1j7M6j0J0Mk0PqK5l1QL0m4L8
0.46881Il2K4j8L3k2qK4pn0M1mJ5nTj9K2KpJ1Lj4Nl3L2Krj0JJ3%kL4l2j2J8oPm3J9J6j6K2qK0k2
0.44592a1Jk2L0j3MNj3JlL7k7J3j7J6j8K5J5k8J2k4lK0j1PTj3PJj0j1OK6j3LrpJ4p%RnKRk2K5k6
0.42252a8K4pj3j4%K3k0M4k8o%Qk6K4KnJ2nl9J7K2j4OnK6J2l9K2pTQj5kJ9rJ0j0j2M8n6M3m3K6M
0.40014@nk5K8n%kmJ3j2PJ3l2K1K7l3l6M2qJPnjmQj2Rj9K7j5lj2N0n2M7l6m%K0qrK1j5RNK0l5K6
0.37623Ik0j4MOLJ5nk5J5k0J6nL1k8J9k4JOJ6pJ1j6J0J1k2JLK8j6Mk0J8j0jk8K0J1J7pk7lJ1JJ0
0.35385aj5pJ9Pl2K9Nj9j0QJ8nj4J3k6L0lj1Pk3J7j6pL5%Kqj2rJ7L3o6M4J0l6L5k7J8j8K3k2K0Q
0.33197A1j4l1J9j6J2j3M3k4J2j6j2M2k0kK2k9K4k7K9k0mLL4l9pK0kj4K3J6k8J3l1K1rqlJ6OpK9
$$ plain form
0.49018 -32 -3 6 -22 -20 -22 -4 2 -28 -20 14 1 -2 -5 6 -47 1 -37 -4 13 -31 -4 -30 -10 7 -32 -9 -18 -29 -46 0 -10 0 4 -16 -9 -17 8 -23 -15 15 -29 9
0.46881 9 -23 1 -17 16 -6 -14 10 3 -47 -6 -10 5 0 -5 -24 -2 0 -7 4 7 -7 -2 -35 -3 -1 -10 -20 -19 -6 -6 -8 26 -6 -18 0 -6 1 -42 -23 -7 -23 -1 -9 11 -11
0.44592 -11 -10 -32 -2 -15 -11 -6 -19 -18 -21 16 -11 2 -15 1 -17 8 23 -5 7 -17 -20 0 -11 -4 3 -10 -3 -2 -12 -23 -17 9 -4 -1 -10 -17 -3 -10 -10 -1 -6 -4 5 -17 8 -18
0.42252 -18 6 -1 -14 -28 -28 -5 -25 19 -9 -15 -15 -7 -33 -9 -7 -12 0 -5 -44 -27 -5 -19 -13 -18 8 20 -19 3 -4 -11 -3 -18 -20 -1 -10 0 -10 -22 26 -30 13 -30 -4 0
0.40014 0 -5 -30 -2 -7 -7 -9 -13 0 -12 -5 8 -24 -3 24 -9 -45 -3 -11 -10 -3 -8 -9 -13 -5 -17 -8 -27 0 -15 -18 -30 20 -32 15 -21 -25 -25 -5 -13 -22 -1 -16 -7 -2 18 -17 9
0.37623 9 -11 -25 -21 -15 -12 3 -2 -27 -12 -32 -16 -21 10 -18 1 -23 -22 -16 0 -7 4 -12 -2 9 -13 -12 -9 19 3 7 -13 5 -5 -6 -34 -14 -3 14 7 -20 -23 -12 -11 -1
0.35385 -1 -16 -23 -4 3 -29 0 5 -14 -24 -16 2 -3 -17 -4 -30 0 -3 -14 -7 -30 -13 -29 -36 -1 -1 1 -7 -19 -28 -11 22 -44 0 10 -26 9 -18 0 -18 5 -17 3 11
0.33197 11 -3 -34 -15 -31 -19 -32 11 -13 -1 -17 -29 13 -7 -9 13 -16 8 -19 10 -10 -14 -11 23 -16 -23 -3 -5 -19 4 20 -8 5 -26 -5 -14 -22 -25 -9 -3 -10 19
0.31111A9m5L0j3j0MQPj8K1l6K1l8O3l9R%L2l7J0J8l0J0KJ0LNn1L9l4M1l1L0j9J8j1qJ1J9j0j7
0.29076a7J2K2n0M0l9L1l8L6rJ2k3K0k4K1k7K4RPKmj2j6K4l2K8k6J9k4J9k4M2Pj1Kk3K0j2kj9Q
0.27042b7J3L1j7TJ9J6l2J2Okk7J0Tj6OmJ6k5M4m1K1Pj5k0RlL3Ll2J6pK2j1onJ3Mk4pRkJ6pJPJ1
0.24702Hj1J5l0mj1K8pMJ9ok1LK3j3mQol4OK3j6L7j6J1qk7N8l4NK3k4Kj8K8j0nPOj3pPk5J5QMKr
0.22311iPJ0j9RNl0LQnRl1L4j4K3l3NM0j2pJ4l1K0J2k3j3Lj5J9K6j7L1l4J0j4JJ0Rj%j9J7k4lL5
0.20072FokqTRKTNj0j4J1Roj4PMk2L4moLQkj9J5%J4qk0J6%j0K8k6J9Ml6Qj1K0j4K6l1PJj5L7j4L
0.17580hjK6n2L9j6J9l4J8k4K4oj2K7l2J2K1j1L4j1k6kJ2j4J7j1Qj6J9kKK2k2l0J1K4Rl4Rj4J9J
0.15494ejMLj9K6qk4oK6kk4J1kLpL4j9MqK9nk5J5%K1rk2%j4PLJ9j2mJ1ok8J0j1K6Rrj0j3M9m4J0
$$ plain form
0.31111 19 -26 4 -9 -19 -15 -7 0 -18 3 -33 -12 -50 13 -26 -17 -17 15 -22 -12 6 -24 -14 -12 -2 1 6 -45 -6 -40 1 -30 0 -19 -1 -12 -20 -9 10 0 -17
0.29076 -17 -5 17 -33 7 -32 -1 -39 -3 -12 0 -23 -3 -27 -6 -33 -9 0 7 9 5 -7 -23 1 -31 -3 -29 -10 -34 -15 -39 3 10 -1 1 -22 -2 -14 -16 -35 -27
0.27042 -27 -14 17 0 -17 2 18 -14 -2 4 2 -25 -15 -5 -21 -15 -19 -3 -28 16 -25 -4 3 -12 -32 -23 -26 7 10 -22 -6 -13 9 -2 -8 -13 0 4 -20 -27 -18 -20 -4 -11 -10 -3 8
0.24702 8 -3 12 -18 -22 -33 -5 -12 -8 11 5 -16 -13 10 -3 -7 1 -5 -39 -33 -10 -26 11 -5 6 -2 -29 29 -5 0 23 -1 1 -17 11 1 -4 3 9 -4 -11 -4 -29 -14 -6 -2 0 -9
0.22311 -9 -2 8 -11 -2 3 -27 -24 -16 -21 -12 -43 -9 -23 0 -33 -28 12 0 -7 7 -24 -4 8 -15 -28 -25 -40 -21 5 -12 19 -15 -5 -19 -18 -8 1 0 0 -19 -2 -26 -29 6
0.20072 6 0 -2 -10 -18 -9 -7 -5 0 -10 -24 -13 -4 -10 -24 -17 -13 -35 -1 -5 -11 -8 0 -2 -21 -6 -6 8 0 -20 -4 -4 -14 14 -12 7 11 -25 -17 -28 -8 -22 4 -27 -20 -19 -34 3 -11 -8
0.17580 -8 -9 17 -35 4 -12 7 -27 -9 -33 -9 -15 -27 0 -32 -20 1 -10 24 13 -13 -15 -3 -17 0 -11 -3 -19 0 -2 0 22 0 -30 -19 5 14 -20 -11 -25 -6 -5
0.15494 -5 -6 -2 1 -18 8 0 -24 -30 -4 -6 -30 -19 -21 -18 -25 9 -10 -6 -14 15 10 -15 0 0 21 12 -10 -10 -24 -17 -14 5 -7 -11 0 -6 -34 -24 -35 -9 0 -9 -19 -32 17 -27 -17
0.13103a7RpqK1mT%k8L6j4Ql8M8j9O0o0%J3k9QmL4j5NKk2jJ4J8k5K1qJ2l0jL0J1m6NL0k3lOK5k6
0.10814a6PJ2Rj0TJ1j1LmLk0J3J2k9L6k2J9qJ2m0K7k5L5j6LRrqj7L4k1J4j4J1J7kk6J1Plj4j7L2
0.08626ej2J7LJ1l5jJ8roJ6Qk7K5k2LMJ8Nk2J0Mk2L5m1L3j2L9n7K8n3K5K7jpLl1K2mnqJ1K3Jl4
0.06388b5K5qk1J5J4j2QpjJ1j8ML3k0J0j1Oj4K0k4J7%l2J5LJ2rJ2qPk0jJ6LkRk6J6l9K9J0j3Pj2
0.04150b1LJ2Krj3J3j5M0l2L3k0J9n0J7K5j7MLKj6J9Oj4RlTNLlk4jK0j4QN0p5N2n3O2m3J7J1Mj6
0.01911cl8M4j4%K1j7Ol3J6J1J0JJ5jj7J7l8K3l4L1j3K4n7M3LpRk1mLPJ2pK0rk3L4k9K6j3k3K5q
-0.00276hJ4m7K0kK9m0M4n3K0O%j3M2l2K0k2OLj0J2J6nmJ2k2Lk0K5J0j3Mj6M7k3PpJ3k4lTR%rnJ4
-0.02565epmJoQMnJTQJ3k2Qj5kK7onj1J7m2L9j6J9Qj1nMK1l1rJ3J2j6J2knj4K0j8K4k2PNj9j5M8p
$$ plain form
0.13103 -17 -8 -15 -23 -2 -6 -10 -10 -38 -2 -16 -8 -46 2 -17 43 -17 -17 -4 -33 -25 -29 5 -10 -5 -3 -25 -26 -12 6 -19 2 -6 6 -24 -25 5 16 -30 -25 5 -18 -21 -15 10 -16
0.10814 -16 -9 3 12 2 -8 3 -8 -5 -9 -6 -26 -13 -1 -30 6 -16 3 -5 7 -33 -6 -31 4 -12 -9 0 -9 -17 -34 0 -21 -7 -21 -10 7 5 -21 -10 -3 -6 -20 -37 -5
0.08626 -5 -17 0 3 14 -21 -22 -4 -13 -19 -3 5 -22 3 -19 -16 -12 6 11 -11 -1 3 -19 16 -25 8 -4 35 -22 6 -47 -22 5 4 -3 0 -31 -9 -13 -18 -26 -15 8 9 -25
0.06388 -25 0 -8 -29 -14 0 -12 -4 -11 -12 -1 -19 -15 18 -2 8 -3 3 -11 9 -15 2 2 -30 -15 -12 0 -9 3 -5 2 -18 -19 -3 0 -2 7 -19 -3 -42 -13 -3 -16 -9 -21
0.04150 -21 -18 -6 -4 -13 -26 -13 -28 12 -20 13 -7 12 -38 -21 4 -13 -9 -6 -4 -20 -1 5 -9 0 -3 -6 -1 2 -1 -25 -26 -6 -20 -12 38 -37 15 -38 24 -19 -2 9 13 -3
0.01911 -3 -41 3 -11 -11 10 -7 -1 -34 -18 -7 3 4 19 18 1 18 -20 3 -31 0 -13 11 -46 -3 0 -7 2 -19 -23 -20 -13 -1 -8 12 3 -20 14 -15 11 -2 -25 0 -8
-0.00276 -8 6 -41 -21 -23 6 -34 10 -43 -23 -17 -17 -30 12 -20 0 -22 -16 -13 -23 -11 5 0 -4 8 -14 -11 -31 -6 4 -9 -5 -21 26 3 10 3 16 -8 -11 -14 -5 -5 -14 -19 -5
-0.02565 -5 -12 -16 -15 -21 -13 -9 -14 -13 -12 -4 9 -13 -5 -20 -22 5 -1 -6 -17 0 -42 -3 -19 0 8 -3 -8 -4 17 -14 -23 -10 2 -14 -2 -4 -9 -23 -3 -21 3 -19 -12 -7 -26 -41 7 0
-0.05007@j4J8m1L8k1L1l0RopQNJ0j4KJ5l8K7lmkKjJ7k5M7l8K4k2Lkj7J2MOj8L4J1k0k7K2l0K8P
-0.07246@j1pL2m5K6m6N0j8J5j3K5Jl2KJ9J0qk1j0K7j0rL4m0N1k9J7poJLj5JlQoKL1l4J7mJ1qj2
-0.09484a1J3QpkrOk7K6J2mNk5lKRJK1l1J8J1Nj6k5L2kLqKj6OLnJ0%j7J3nJj3K9j4koJ7Jk1J3l1
-0.11926c3K8l3M5j2j9K1k3j4L5MNk4J6j5%qM2j3j7J3pl1J8K6l0K6k7J0J5l3L8j6K2k9PJj9J6j3
-0.13910b8L0k1J2k2K6j2J2lj9K5lTj6K8j5k1K0Nk0%PK9j1TK8k4K0j0J2k9RK1k1j3rJ9jLj0J3p%
-0.16046a0J5Qk4J3k4K2Nl9MM0pn4K4L3j7MTl6K4JoL7j8k3K8k8L6k3K4k2k0J8jL4l9J1J2m1K8rJ0
-0.18132fmQj3K7m6J2L1j7jk8K4kk5L9j3K3k8K2klj2MJ6Nj8J3l5K7rJ1jJ1k0OmQj4M0k9j6K3k3J9
-0.20319@Loj4LJ8j7K1j9J1k0%k4M1qKRk6LTlkJ6kPl2M2l1K2n0M5l1N4m6M4k9j4OM3j7Mlk1kL1k3
$$ plain form
-0.05007 0 -14 4 -37 1 -20 11 -19 -10 -16 -23 -15 -10 0 -14 -12 3 -35 -8 -11 -15 -17 -15 -16 1 -24 23 -15 9 -13 -10 -12 -29 -17 -13 -7 -25 9 20 0 -27 -5 -35 -7 0
-0.07246 0 -11 -18 14 -31 -5 -51 -1 -19 -4 -17 8 9 -23 -21 -2 8 0 -21 -31 -4 -14 -23 11 -29 22 -7 10 3 -3 -2 1 -14 -13 -16 -8 -14 -12 19 -15 2 -2 9 1 -11
-0.09484 -11 2 10 3 1 -8 -2 -29 -3 9 5 10 -15 -18 -16 -7 -6 15 -16 2 13 18 2 -23 9 7 10 2 4 -12 -6 -3 -8 2 2 -15 -2 -7 -6 -19 10 -4 -6 -12 5 6 -15 -2 -33
-0.11926 -33 -5 -38 7 -5 -24 -3 -26 -40 -5 -1 4 -20 -4 -19 -19 -27 15 2 -15 -2 -9 -40 -22 4 -26 0 -27 -17 -2 -35 3 -13 9 -20 -13 -12 -31 -15 -28
-0.13910 -28 2 -19 -7 -29 -3 -15 -3 -6 -25 0 -3 -6 -22 6 -9 -30 -10 -5 -25 -25 -18 11 0 -11 17 -7 13 3 15 -14 -5 16 -5 -18 -27 -8 -9 -6 -16 -3 -10 -10
-0.16046 -10 5 13 -11 2 -22 0 5 -34 -30 10 3 -51 -27 6 -11 -7 -3 -39 -15 -14 -20 17 -1 -24 4 -24 12 -11 13 -9 -29 -11 -12 22 -17 -6 6 -35 -7 -16 -6
-0.18132 -6 -10 -2 -15 12 -34 -22 9 -8 -9 -37 -13 -15 -40 -1 -14 9 -19 3 1 -2 -14 -10 6 11 -7 6 -29 -2 -11 0 -1 10 -10 -4 -8 0 -14 26 -3 -19 4 -19 0
-0.20319 0 3 -3 -17 -14 4 -13 8 -11 0 -20 -20 -44 -3 -11 -9 0 -26 -23 -20 -23 -25 -9 -11 -4 -36 6 -25 -3 -53 -8 -39 15 -31 13 -16 -30 -24 19 2 6 3 -18 -20 11 -12
-0.22609a2J5j7Ok5K4LOj3J1j1nJ1K2k2J0Pl4J5OLqQlk3J2KM0m6J8j1Nj4K3kj2rK0Lk9J2J5j6rK8
-0.24847Dl1K6j1lkQOj6Nk9L1j9QJ0LJ0j2lJ9l1JJ1Pk9L7l3M3l2JJ2j6L9l6L1nm1M1j4K3k8ljQJ2
-0.27085AmNl0O7o6M8l0Oj3K4j1Ljk4K5Lk1pJ0Pj1K6j1J7n0J2K8k5L9m0L5pj0j7J2k5J0J1lk7M0m
-0.29222hk4K6mqK1j9K2Ll7J3ML3nl6L3l5K0j7J5j1J7l8N6l2Lj5J9j2M0k4J6k2rk0L7l6M7j7oJ0
-0.31257@k7J0nJ0OJ2j5Lj6L3j1%rj5N4m2J1l2J8j6L0qK1j3j5Rj4Mj8Jj1K8OK1k3%J3j7J7j0j6K
-0.33393b4K4j5J2Rk6j0OK5k8lK4qNLK6j5l1J6Jk1L8m6M6k3Qj0M6n5RPJ6j3J4k0Oj5K6Ll4K2J2j5
-0.35530hj3L5k1%lJ2j0j1RpL6ln9L4NOkTJ2j7L0l3OJ0ok8L1k7L5l9L4m1K4MJ5l2K1j4J8Rj3l4L7
-0.37717@l0J8J2J6k7KJ3K3n6L6l2J1J2j2M0k4l5lK2qRnK4l5L4l3K8j8J7jpKTNpLk4L2j5OJj8Rj3
$$ plain form
-0.22609 -12 3 -14 -8 -33 -9 -6 0 -13 -2 -13 -18 -7 15 -7 3 10 -24 -9 -3 0 -8 0 -3 -26 -14 -12 28 -18 0 -11 -6 -20 3 1 -11 -20 0 3 -26 -14 1 -15 -24 4
-0.24847 4 -27 -1 -12 -15 -17 -9 -3 -19 -14 -43 -12 -31 -23 -13 -10 0 -12 -15 4 -27 -26 -15 -8 -37 0 -33 10 -22 -21 -9 -25 14 -22 9 4 -37 4 -10 13 -15 -18 -19 -11 1
-0.27085 1 -3 2 -28 39 -27 21 -9 -3 -16 8 -3 0 -1 -25 0 3 -18 -25 -15 -8 -19 7 -4 13 -37 -25 3 -22 17 -23 12 5 -5 -22 -10 -35 -25 -14 -17 -44 -4 -8
-0.29222 -8 -32 -6 -10 -18 3 -16 6 9 -28 -15 -11 22 17 -19 14 -21 -1 -18 -3 -14 3 -35 21 -11 -8 -23 -4 -16 24 0 16 -6 -15 -35 2 -34 13 -4 -10 0
-0.31257 0 -27 -17 -22 -12 -6 6 -9 -6 -22 11 0 0 -9 -24 30 -12 -1 -33 -15 -31 -1 -9 12 -1 -16 -7 -21 -17 -35 -34 -45 -17 -11 10 -13 -13 0 -17 0 -10 -26 -24
-0.33393 -24 0 -15 -3 6 -20 -30 -24 1 -27 -30 -6 -14 -9 -6 20 5 -26 -10 -9 -30 8 -38 8 -15 -7 -17 29 -26 -17 -10 6 -7 7 -13 -7 -22 4 7 -27 -5 7 -8
-0.35530 -8 -21 14 -7 -7 -10 2 -8 -19 -10 -17 19 16 -43 -9 -4 2 0 -2 10 -7 23 -10 -4 6 0 -28 3 -24 11 -28 6 -35 -11 -7 8 -24 -3 -17 1 10 -3 -37 0
-0.37717 0 -30 -12 0 16 -11 -9 4 27 -29 7 -25 -14 -2 -14 26 2 -33 -36 -14 -22 -13 -18 6 -29 5 -28 0 -18 -1 -2 -9 -7 -5 0 -7 -4 -28 4 -11 -5 -4 -22 -13 -26
-0.39956b6J9pJoL7k5MjKl4L3j0J7j2kJ0K4l3mOJ6k0qK6j0oqL5k2k3J7MJ8j9oK1k2l1O0k7j9J6L5
-0.42143B0k8nj5K7l0LL8qkl6J1J8J1k1J6%j1J2%j7oK9k8J3k0lN5n2L3j8Pl0M4m5K9j3K2Rk8L1m1
-0.44229b9K8k2N8m9K5j1%Ll3N3k0k6K2Jq%Kk9L2j7OJ5j6J5m1L6%Nj2lPkRNTl8K2j8L7l3rLL5kl2
-0.46518b6rK2j6J9j0K0j1Mj5K6rMRk4K9l2RNoTJPj1J1Tk7TL8J4oNj0mPj6J3L0km2L0pqJ7j0Pko
-0.48909dj2Rj8K8j0pqj3K6Jj4jJ0Nj1M7l8J1j2M4k6k0mJ1Rk8K3j0k3J2%L8l7J3j0Mm4N4k2L5%l0
-0.51046b2QoK1k9J4j4J2J1J9pTk8J5Mj0J3j9K8J6l7J9Lj0mJ4k5J6j3K2Lk8kJ3J2j2TJ0mJ3j3K2
-0.53131Fk4MJ2j8J0RokJ7k5J4l9K4j3OJ9J4Tn0L3j5J6j2L9l1moPnkqoL6l8L0k8L2mk7NJ4JmqJ1q
-0.55471a0kLQJ5kRm2L7l8K6k3J6k0J6Kk3L5k9J0T%MJ5j7j0k7L7k2L8j3Mk2JJ4LJ7m3K4k0K6pj3
$$ plain form
-0.39956 -26 -7 -14 -13 -19 18 -7 -3 -4 -2 -36 -3 -13 4 -8 -10 0 24 -9 -13 -7 9 -11 -19 7 -3 -9 -17 18 -4 -27 -10 -6 12 -7 -13 8 -14 -45 15 -12 -31 -15 20
-0.42143 20 -8 -13 -28 -1 -31 -28 10 2 0 -36 -25 -7 4 -17 -1 -1 -12 0 0 -17 -23 6 -22 -9 -29 -32 23 -29 4 -14 -7 -37 7 -38 -9 -22 0 9 -19 12 -29
-0.44229 -29 -1 -23 35 -14 11 0 0 3 -30 23 3 -23 -1 0 -8 -8 -6 -35 -3 -20 -14 1 -15 0 -41 -5 -5 0 -12 -15 -8 -10 -1 4 9 -29 -7 -25 12 -21 -30 -27 8 6 -26
-0.46518 -26 -35 -13 -29 -10 -20 0 -11 -7 -22 4 -5 -1 8 -16 13 -19 -10 -5 -11 -17 -16 -9 -20 -9 2 -25 -52 -14 0 -6 -1 -11 -15 -8 -24 -11 19 17 -25 5 -2 -10 7 -3 4 2 -4
-0.48909 -4 -16 -7 -25 3 -7 -14 -22 -35 -9 -8 -22 -23 -13 -8 -19 28 -10 1 -11 33 7 -13 -17 -6 3 -25 -2 -12 -35 -23 -23 15 -22 -9 -19 -15 -59 -5 -27 8 8 -22
-0.51046 -22 -14 -20 1 -28 -14 -28 -16 -5 14 7 0 -28 -13 -9 -19 -6 -25 3 19 -18 1 4 -6 -10 4 -21 -5 -18 4 7 -21 -23 -10 2 -10 -22 -12 -16 -3 -16 6
-0.53131 6 -18 -14 -2 -20 -10 -1 -7 -9 8 -17 -3 -42 -18 -31 -25 -6 8 22 -28 5 -10 6 -6 33 2 -2 -8 -1 -6 -8 -16 -22 14 -24 6 -22 10 6 -21 -16 -2 -1 -5 -13 -2 -10
-0.55471 -10 -12 -9 -1 14 12 21 -21 16 -22 4 -19 -3 -23 -7 -5 -28 7 -22 -12 -2 -2 2 17 0 -10 -37 0 -22 16 3 7 -15 -14 0 3 20 -23 1 -19 7 0 -13
-0.57608a3j0J5J7lJ0rj9K2j6Nk5K0MK0m1L9l6J4k6J0L9l0J5Om0N6k5j6L7k7K3n2J3J1J8rj4J8k2
-0.59592b1L6l3L8k5j5J3k4L9l7K5jJ4rJ7l3J0OQk7L0k9KJ8j3OnrjoL3j1rkLL3k3kj6J1j1L6l4J2
-0.61779fJJ2k9K1l7J6j3J5PkRl7J5K3jNj3J6J7k4jJ7j7l5J7L2l4K1K0j1l4P4o9K5j6K9k9lJ9Mk9
-0.63865b5K2K0k0Rkj8kLKJrRTpj5K6qToM2l0Q%k8K8jJ8k6Rj3Ol9M5k1RmLK4j2l3K9JrL0l8L9k4j
-0.66307gl0K6J7j0Nl4L6j9J2TJk4K1j5K3j8J4qj5mj1L3j5J9k0j0J5J6mk4k9M1k4K1NmK0n3K4J6
-0.68342aj3TPK8k7L2j6J7j4J0j5j6L7n1K6J8pl4L7k1K0qJ1nj6JK4l0K1k9M0l6J5o%J4j5LJ2Ml7
-0.70427c3L5rlk8K6K0lj2lk2J5K1nOpK%j6TJ3lJ0J8l1K3k4RJ6Rk3J1j4J2J3j9jKlnJ8rj1J3j0QT
-0.72768bJ9k4%j6KrK2J7LpoKLl%qMoj3QJ0Pk6J7j5J3k3J7KQj6k9L8J7Qk5OJ3k5MoJ2j3J5k9J7k0
$$ plain form
-0.57608 -13 -23 -8 9 6 16 7 -12 10 -6 -1 -26 -6 -2 18 -23 16 -20 -6 -32 -22 17 -13 2 8 -32 24 -1 -17 20 -7 16 -36 -23 -12 6 -3 -17 1 -21
-0.59592 -21 15 -18 20 -5 -20 -7 -31 8 -29 -4 -5 9 0 17 -16 -6 0 8 -19 11 -18 -16 2 -11 -5 -10 -19 -20 -26 7 -4 -13 -15 -12 21 -2 -4 -20 -9 -20 16 -18 -6
-0.61779 -6 -5 7 -22 -1 -38 -22 -35 -20 -13 -15 -6 -43 -28 -5 -6 -1 -14 2 19 -5 -6 11 -6 -41 -24 8 -26 -5 15 4 -30 44 -25 0 -16 13 -16 -19 0 4 -25
-0.63865 -25 -3 17 -3 6 4 -14 -16 -13 -11 -10 -19 -10 -1 -8 -23 3 -5 -13 -19 23 -7 1 1 -27 1 0 18 -8 1 -12 -6 -45 0 -21 -12 -16 -13 11 -1 -34 -5 -4 -13 17 -21 18 -6 -7
-0.66307 -7 -37 -11 6 -4 1 -33 3 -16 -4 8 9 -15 6 -9 14 -4 10 2 -13 -17 -28 5 -10 9 -11 -21 -6 10 6 -18 -47 -6 -30 -9 -4 -8 12 -41 -17 -1
-0.68342 -1 -14 -27 -20 8 -19 13 -3 14 0 10 -5 -21 16 -35 -9 9 2 -32 5 -16 4 -4 7 2 -14 -13 11 -19 2 -27 13 -23 -8 -14 -14 0 -15 -12 0 4 -33
-0.70427 -33 2 -7 -10 -38 -12 8 5 -7 -10 -32 -17 4 -1 5 -2 0 0 -16 -32 -19 -22 -12 6 -25 -2 -26 -17 -1 8 -15 -4 -18 -6 7 -12 -13 -11 -14 -19 -1 -10 -21 -8 -18 -10 -2
-0.72768 -2 17 -7 -7 -23 -21 -30 -8 9 12 5 -1 1 4 1 1 -7 -3 -9 -22 -14 -4 3 -23 -6 -21 -8 -31 -14 -12 -4 -20 -49 -11 6 14 -11 -5 8 -17 -13 -19 -7 -20 -5 -34 -17 -37
-0.75158c7L2Qj7KNJ8l7RJ2k3RTJ6qkj6J0kJ2OJ2k2j1RL0l5J5j9OkRk0J5kj2PkLJ0lJ1m1J2UlNj7
-0.77600a5j1M0j6qQj4J4oJk6M6n9N7j4K7n0L0nJ1j9j1J8lPmrJ3K0l7K8k2J0j9k4JK6lJ1j8k%L1
-0.79737Dj2J9k0J5j4nQMlj7PK2j8L0k9J3j7%j4K0j9N2l3Nj9Qj3RJ3l2M1l1j1J5K2k3LJ7k0K2j0
-0.81823a1K6k3l6L7j0Qj9LK4lK4l3K5l5K1rPj5j0J7J3J7k0JKj2J2j5OoK6j3j4L8l8J6MJk6J7jj9
-0.83959b3K9k2J1K3l5L8j7mqj6J8j2Jk2L5j3Qqj1RQJ0lpqjj8N9l2PK2l8J5LTjj8RLj7K1k6K1l5
-0.86198d2L3k2K6k0J7pJ2L8p4J9j4L5qj8MNK0J3l1K0k4J1NJ5l4J1JJ3M1m7jl7N8k6lk7M4J1rk7
-0.88232a9j9J4J7J5m6M8m3L2Kk1Nk0J5J8J4k2jk1LL5Pl1K8m4K6k%j8L5k3L3l0K4mk0pJ9Lk0j7K9
-0.90318fR%j8NJ8j0opLKjK1oj8j3J8J7k4J7knJ2j6lK9l8kjJ3j7K4j2J4J5jk0J4j9mLK2l8J0kJ9
$$ plain form
-0.75158 -37 -5 3 -14 -12 -7 11 -26 -17 -5 -28 -19 -10 6 -2 -4 -20 -10 -12 0 6 18 -4 -15 -6 24 -11 4 -15 -9 -11 -2 -22 -7 -9 -21 -14 -16 -13 -3 -6 5 -36 -24 -12 0 -3 2 -15
-0.77600 -15 -26 14 -2 -10 -2 -16 -2 -8 -7 -33 13 -46 11 -3 24 -26 4 -1 10 -9 -20 -2 -5 2 -2 -11 2 22 -15 13 -9 1 -18 -42 -41 -15 -18 -7 -25 -27 -27 4
-0.79737 4 -8 11 -9 6 -8 -13 -5 -1 -4 -21 -14 8 -10 20 -9 4 -13 -13 -27 -7 -26 26 -7 -2 -21 -13 -26 -17 -4 -36 5 -26 -37 -22 0 -23 -20 -3 -23 -1 -11
-0.81823 -11 15 -8 -44 -7 -17 -9 -28 -25 -1 -4 20 -13 12 -23 -2 -11 -4 -19 -29 -12 1 18 -2 -1 1 -11 1 -14 -8 -14 12 -1 -15 23 -15 1 5 6 -20 -3 -4 -23
-0.83959 -23 6 -16 -5 18 -17 21 4 0 -8 -24 -6 -18 -17 -39 -4 -17 -9 -17 -28 -19 -11 -1 -4 -11 -19 -20 -38 21 -11 -4 18 -20 -5 -2 1 0 -18 -9 -6 -23 -2 -28 -7 -42
-0.86198 -42 -9 -31 -5 -25 -8 -15 -3 35 -39 -20 -34 1 -7 -25 -21 -16 4 17 -14 6 -18 -7 -2 13 -21 -10 -9 4 45 -2 -3 -40 18 -8 -11 -38 6 17 8 -19
-0.88232 -19 -38 -24 -7 8 -38 10 -33 -1 1 -20 -15 -35 -20 -2 12 -10 -11 -32 -29 6 13 -18 10 -34 -8 -10 -10 -28 7 -16 17 -13 11 7 -13 -20 -1 2 -18 -35 -6
-0.90318 -6 3 3 -15 -10 8 -2 -8 -15 -12 -10 -11 10 4 -14 -27 -9 8 -16 1 -1 -6 6 -10 -13 16 -22 -24 -25 -12 -29 -5 -17 -3 12 11 -9 5 -14 -18 -15 7 -31 -21 -23 -4
-0.92607dj6K0Mk9J9nJ1j8J0Pj2J4k3rK2ROMj9j1J3mlMLk6J9J5j9QqJ1j9K8k1K0oJKj8L6k8Rj5QT
-0.94947boLPlmnj0K4rM0l5kJ1j2j4K9m3K8k2K8k1L0j4K4k9JPl2K8qJ5k0J0j4K0%Om0M2Ll6K9j6%
-0.97186a2K1j7oM%j1L8l2K8l9RNK0K1o0M4j1K7l1l4L4Qj5pj2K8j3KkRlNrJ5Lj7K4m8M3k8MJ8j4j
-0.99424a2J7j5rK8l2jOJ9Pl4J2KL6l9K6l5K8k8M3l4%M2l1K8k9Jk4J1J2j1J7k4J4j6K7k6J6l0M7
-1.01408Ij8Pk4M1l3J0K7j4k6POk1RJ2Lk5K0jQKqJ4k0K9k4Oj0J2j1L6l4%J1j1ML5n3L3k2J8k7L1
-1.03545Hl5K3l2M1j7L0k5lj6MJ1nK1m2L7qj4J1J6l8K7Pl2J3J9j5J9mm9N5j2j5RJ2on%Rj0J3Mj4
-1.05681hJ9k7J0j1j2L9m2O3o7M5Oj9%pK6m4M2j5K0l9L0k1J5pk2K0j4J1J4qKqkk7O6k9J8k5MmNln
-1.07869a1Nj6L0k0J1j2OJ6%k4QPpNMRl5N2m4K7j5kMJ1m2K4J5k6J1J5jn2M1%NnJ5qj5K5nj1kj1J1
$$ plain form
-0.92607 -4 -20 0 4 -25 -6 -11 0 -18 -8 -1 -13 1 -22 -31 -9 0 6 10 -9 -20 -7 -11 -14 -10 -7 -33 -14 1 -18 -10 -18 -7 -26 2 -19 1 -5 -4 -2 -20 16 -12 -3 -18 -10 -2
-0.94947 -2 -8 -5 2 -1 -5 -10 -20 4 -5 35 0 -2 9 -3 -17 12 -31 -3 -25 3 -18 12 -2 22 -7 -6 1 -31 -3 -11 4 -16 -6 -20 0 0 6 -34 8 11 -25 4 -12 -12
-0.97186 -12 9 -8 -14 -10 -10 -21 17 -15 13 -26 -17 -12 8 29 -31 13 2 29 -2 -36 -2 6 -9 -16 -28 0 -13 -11 -13 -4 -7 -2 -11 4 7 -10 14 -34 9 -19 -15 3 -11 -12
-0.99424 -12 5 -10 -19 9 -23 -24 -18 1 8 -26 -14 -12 24 -15 11 -24 4 -24 19 -15 -15 27 -4 24 -5 -4 -28 -17 -5 -16 1 -23 -9 -25 2 -24 -8 -38 9
-1.01408 9 -9 -2 -26 15 -18 -8 19 5 -21 -14 -8 -29 -20 -8 -5 -30 -10 -11 -3 -1 -9 5 -15 14 -10 -4 -14 -2 -13 23 -11 -11 0 -11 -7 28 -25 8 -14 4 -23 8
-1.03545 8 -27 -4 -36 5 -12 18 -7 -10 -26 -22 -11 -16 5 -37 0 -8 -22 -11 5 -33 -6 1 -31 -18 1 -14 5 1 -48 7 -5 -20 -11 1 -5 -10 -10 -1 -11 2 6 -8
-1.05681 -8 11 -16 -6 -17 -29 10 -32 31 -36 9 15 -4 -4 -11 15 -29 13 -2 18 -21 9 -12 3 -4 -26 -6 -20 -9 5 -3 -1 -9 -11 -38 28 -1 17 -8 -4 -8 -3 -6 -11
-1.07869 -11 -6 -22 8 -12 -1 -13 -7 9 9 -15 -7 0 -7 -2 2 11 -24 28 -16 11 -4 -6 -2 9 -33 -9 6 -20 -9 6 5 -47 -6 -6 -1 -6 9 1 -14 11 6 -5 -7 -18 -7
-1.10158gqROk0M6m2kLmk0LK4J4q%J4j5K3k3qJ1JOl%rqPqJ6k5J5J2Ok0K4k8j4M9j0J2k0%J2pl1J7
-1.12549a0jQjQll6L5j1K5pk5RJ9j3l2M0j7J1lrqj1K4j7K0k2K8j7MJ8l3K4jj0K9JLj5mJ1k2kK1k0
-1.14787a2jOj9J5K8po5L3QK0k6K3j3J5mm1K3jJJ9m0L2k2L2k0K1j9J7lJ1j8Lj9j3J4lQPNl6L2jj6
-1.16975b6MJ8kk4j8M6j3k1L2nJk0N8k0k3K7l1lJ2jj7L2pkK0j5k2OlL0l1J5j2J3k8K8K5l4LPJ7l6
-1.19111b0J2kjj6L6Nm2J4K2j4j9JK5jRn0J6M5l8jOK3m0K4j0J2lj2NKJ2k6K3Nj1J0k2jJ8j1LK5M
-1.21299A7j7j3JNj3J8oj0J4KJJ1k0nj2J3K6m6M2j3k9J1M1j5J0Nk2L1l0K3lk1nk7L7lPlj3K3j5l1
-1.23435c4K4J%JK8l0J0j1K1l0J9rj3L7mj5KnKmnJ6jj0jj0K3k2Kk2M0j4J9j4j2L0j7MQ%ml3J7J6
-1.25674@k0K7jl5J2Tj5J6J0k6J5K4k2nJ9j2J2m1L6k3L8k0Lj0qmQjK8knj7lJ7ok2J4Nk4L6n4M2Qq
$$ plain form
-1.10158 -7 -15 -6 0 -20 26 -16 -18 -15 -19 -39 -36 -12 2 -6 -6 8 -7 16 -7 -15 -4 -3 3 0 0 -9 -17 -10 -18 -2 -27 -12 0 6 -14 10 -18 -32 17 7 19 -1 -1 11 4 -27 -10
-1.12549 -10 -11 -3 -4 4 1 -35 0 -11 14 7 -18 -9 10 -3 -35 5 -12 -1 -4 -13 -21 -32 -8 -25 -5 -27 1 -16 -12 6 -27 -3 -4 -14 15 16 19 4 0 11 -11 -13 8 -12
-1.14787 -12 -13 -7 -26 -11 17 10 -55 -22 -14 6 -20 3 -10 5 1 -40 -17 -18 -17 2 -38 -6 -28 4 -16 5 -14 3 0 11 -7 -4 -23 -36 -22 -25 -17 -10 -5 -41 -9 -10 -26
-1.16975 -26 -22 -4 -6 -30 -48 -2 -15 -36 -4 -9 -8 -28 30 10 -13 14 -17 -20 -8 -9 -26 6 -1 -3 17 2 -20 -14 -17 13 -18 -3 -15 -2 -30 -2 23 -11 -8 -1 16 -20
-1.19111 -20 -8 -10 -11 -27 9 14 -28 -14 8 -6 -25 -24 1 0 9 -41 -25 20 -18 -19 -13 10 -30 -6 -16 -4 -7 -19 -14 -12 0 -26 -3 2 -9 1 -21 -22 -4 -15 -12 13 17
-1.21299 17 0 -13 -12 -7 -20 -2 -8 -18 -4 -2 -1 10 -10 -15 -27 -14 12 -34 8 -5 -34 -23 18 3 13 18 -4 27 -3 20 17 -4 -9 -36 1 -2 5 2 -11 12 -3 -34
-1.23435 -34 -10 -9 -9 -8 20 -10 0 -11 10 -20 -1 -10 -23 14 10 -5 -3 -8 -6 -10 -15 1 0 -10 -11 -21 2 -20 -18 -40 0 -14 5 -9 -21 9 -8 -4 4 4 0 -33 -16 0
-1.25674 0 -20 7 6 -29 -17 -5 -20 -4 6 -20 -5 19 -3 -8 11 -1 11 -30 6 -17 21 1 4 -6 -14 -18 -10 -11 17 15 10 -7 -10 7 1 -21 -7 -2 -26 10 -44 -2 6 -2
-1.27912bJNj7LMjJ6j7j2L4k0kLmj5J8RpPMj5KOrj2LQoJ2Oj5M9o1OJ9l1J8Rk0L7r%k4K2j3K3j2T
-1.30354a2j4K2JkRrJ6k3Pkk1J6J9k7K2qL8n7K8j6KkPLj5K3%J3k6j6K5m7L8rJ7k4L9k5J9j1kj9j1
-1.32541c4%L3J0k5K2Qm4pK6k1K6j7K8k6k2L4j8K9Rj0j9lJ3j2J3ORl4K7Oj1j%jqk0M3j2Oqj2lj0
-1.34729c0K0J4JJ4k1Pm0L8j0%nJ2J3k3rJ5RpOj6K6ql8L8l3J8k0J2Ok3M2j7Ll6L4lJ7k3K7n0L8jl
-1.36916fJk0K3k2K2j7J6K3l6J3j1K7n5N4l3J9Qk1OJ4j1L4n2K3qprM0k4j1K6k0j4NJ1mMj1K3jRj2
-1.39053dj1J2j3J1Tk4NmJQJ2j2Qj1TL5l8J7qJ3K6m9K9rk0%J9j3mL7m9N0n3K8j9L9j2J0j5Ql7N0
-1.41189A3l5J6k7L1MOl5K9k6K1Lj5J0j7L6j5nTJ1l3ORNMOk5J5K7lj5J0j4j1J6j8K9mjl1L8k1J3
-1.43326Bk5K8qrRMok5QLK6Nn0L8l2L8k7KJ9m6J5PM1l7K9l3K4Qj6nmKM1l3k5L2nTLJ0rJ9l6K7j2n
$$ plain form
-1.27912 -2 -1 4 -13 -10 -6 -7 9 -8 -20 14 -6 -8 -5 -9 -24 -6 3 -4 3 7 -8 -6 0 -9 -21 -18 -10 -16 -4 2 -13 36 -25 -19 0 -31 -13 -4 -24 13 4 4 -20 2 -11 12 0 -12
-1.30354 -12 -26 -4 -3 -5 4 -5 11 -12 -5 -7 -28 -12 7 -20 2 -6 32 -25 3 -13 -11 -13 -6 -3 -18 5 5 18 -8 -24 1 -46 -8 -17 0 -24 15 -10 9 -2 -4 -23 -34
-1.32541 -34 -34 -1 9 -16 6 14 -30 -37 -11 -32 -6 -23 5 -21 -43 -9 -27 2 11 1 -18 -21 -8 -20 -7 -1 8 -26 1 7 -4 -5 -5 -6 -14 -34 9 -3 3 -5 -17 -20 -30
-1.34729 -30 -10 4 5 19 -2 5 -35 3 -7 -7 -12 0 13 -10 -19 -4 5 -2 4 -12 14 6 -32 6 -27 -9 -29 -17 -11 -34 8 -9 -6 -42 -8 -11 6 -17 10 -40 -2 -3 -6
-1.36916 -6 -5 -25 -2 -24 -2 -19 -3 20 -16 -3 -14 13 -42 12 -21 -2 6 -15 -9 5 -6 28 -24 -1 -9 -16 -25 15 -9 -20 6 -14 -28 -23 -12 -16 -12 -23 0 -1 8 -4
-1.39053 -4 -15 -3 -16 -5 6 -18 -13 -17 -16 -8 4 -8 0 -11 -22 13 -25 -8 -16 -3 23 -26 3 -6 -26 -26 -7 -20 -24 13 -36 14 -39 -11 -30 9 -3 7 -8 0 -37 13
-1.41189 13 -22 -6 -33 -2 2 8 -27 2 -24 -3 0 -15 -5 -22 14 -1 -6 -11 0 -33 -27 -18 -13 -9 -3 -28 -13 14 11 -4 6 -8 -19 -3 -21 8 4 3 -28 10 -11 2
-1.43326 2 -23 5 -3 -12 -3 1 -5 -30 -22 -19 7 12 -38 0 -32 6 -21 -19 0 -46 -31 -24 17 -20 9 -24 0 8 -8 -13 -17 -15 26 -7 -32 0 -5 -10 -7 3 -6 13 -23 4 -8 -13
-1.45666a3J1JqKTJ1nLkTMk5MJ3nk2L6qk8K1L8k8qQj3j4OJ5qRJkK0j3J5o6L5J3PJ0j6Rk7J4NkTj0
-1.48108a4JMK1k0K4k6L1m8N4o7N8l0L4m2K6k7K8k7J7Pj6L3j0pk5JJ2J5k9J3JTQj8J9l2ML5k1J8K
-1.50193Hk1J4J3j0jk1J7j4K7j0k0JkJ9K1k5KTj3j0L3n4O7n1M4l9J5j3J3lq%L1l0J4OJ4k9L0j4On
-1.52330DNk1J7j9M6m7J2J4k1K6l5J2Trj5Rj2J7j8J7NJ%OqQmJk2RjJ1j8K3Lj8J1l8N8l5K4m0OK1
-1.54568cJ1Lj5j1jR%J3j7oJ7j1jj1J9m4N1j1J5ok6J4J5qK%k3K1j9K9J4j3k7K0J3j3J2j2Nm1K4q
-1.56705b0L2k7J9jJ4j7lL4o4L2j3J3%J5l4J1Rpl%K3j8KpJQk1RJ7K5k9%J2k5M3l3nK2qLj5j6pM4
-1.58943A5o2K6j0M9k6rJ3k0K5PK4m8QJ0Ojmk4K6kpk5J3K3k2nK5qJ7l2%Kj0LTK0k9NK8j6L2k7Mo
-1.61182iJ2kk3JJ5j1nK2LJ3j9J1l1J8k4K0L2k5J1p%k6%K7LNj2l6L5j2K7k1ljk1N1l6MJ0J2m0M0
$$ plain form
-1.45666 -13 -2 -1 -9 -7 -5 6 1 4 2 0 4 -21 -17 -4 -9 -31 5 -3 -31 -10 28 0 -8 0 -13 -27 -21 -6 -14 -5 -4 -6 14 1 16 -50 -15 -2 5 15 -1 8 -19 -5 0 -2 -4 -14
-1.48108 -14 -13 -9 12 -8 16 -10 21 -27 27 -40 18 -12 22 -20 6 -21 7 -20 -3 4 -12 21 11 4 -21 -20 -8 7 -22 -9 -8 -7 1 -17 2 -30 -26 9 -12 6 8
-1.50193 8 -13 1 14 4 3 -18 -1 -15 12 2 -18 -17 -19 0 21 -4 -2 0 -13 -23 10 -44 23 -28 16 -23 -8 -21 -8 -11 -19 -19 12 -18 -4 2 16 -13 17 3 9 4
-1.52330 4 9 -12 5 -14 32 -15 -3 11 -10 16 -19 -7 5 -4 -19 -10 -22 -5 -23 -6 -1 0 0 6 -2 6 2 3 -19 -10 -11 0 -18 5 8 -10 1 -37 21 -14 10 -30 -24 -3
-1.54568 -3 8 11 -4 -15 -16 -7 -7 6 -11 -17 0 -11 -12 -23 -4 -48 3 -8 7 1 -25 -11 4 -4 -2 -2 -25 -4 -23 6 20 7 -20 0 13 0 12 0 5 -36 -12 -20
-1.56705 -20 12 -15 4 3 17 0 -3 31 -33 -1 -14 -1 -1 14 -20 -9 0 -7 -10 -10 13 -5 -3 -10 -9 -1 -22 -13 4 29 0 0 12 -13 30 -3 -8 14 6 9 -6 -22 -29 15
-1.58943 15 -47 -21 -31 18 -8 -17 -4 -24 1 8 32 -16 -8 2 8 7 3 -21 5 3 -4 -29 -16 7 -15 -20 5 -3 14 -18 -18 -16 -26 -23 -20 0 -29 -24 4 -12 20 -7 -3 -9
-1.61182 -9 3 1 -22 -21 -6 -17 -22 0 3 16 -3 8 -23 -5 -29 -9 23 -2 9 2 2 -24 -24 3 6 11 -1 -37 -2 -14 13 -8 -11 -12 -33 18 -18 -14 -4 8 -32 8
-1.63318Hl2N0n5M3k1Nk4J8jK0j9J5l5K4MJ1mk8rJ7nK6k1J8pk8K2nK1k0J9j0K1n1L5LkroRl3N1l0
-1.65506a5J6jOj9J7m%Rl1K4l1L3qOmj1K4j7j3M2l0K3k7kNJ8j4J7k9kRk1K8k2J4MK6l7PrJ4j9K5j
-1.67744@Qj9J6k7J6l0N0l8kJ2jj0K5k8L4j3J8k9J4j7J4J9J0j5j7J0kk2K9k1kLlmJ0K8m8J1K9ql
-1.69830cJ7l6K1j5K5k0K0j0j9K0m2M2Oj0l0J0OL1k5%j7M4k3rJ3KNJ6mm2J5OJj4TJ1M2k0nJ3nJm1
-1.72017c7M1L0q1O0m4M7l6L7l7j8M0J0Pn6O3l7K2k7J5MKjnNk0RmJ1Ok8QlK4J8k1k0L8nj7LQl3K2
-1.74205@j6J6k9M2l9K4nPNJ5l7L2Jqj6pJ3kMNjrJ6l0L4j7oj2pK2JLOj7J1J2j0j3oJ6Rk8J3OKk8
-1.76545b8K6Jl1M4j2KJ4k7K1Rk6J1k4K1j5lTL2k3J8m5L8j9pJ2J0J6n0L8k2%JJ3rKJ0J7j3lqj0J6
-1.78681fOj8Ok6L5%k2K2j8M8j8lnjMl3L5m8L5J9qj8L4j4j5LJ1rkJ2k1K9k3pK7J3k4kj1J3rjojkO
$$ plain form
-1.63318 8 -24 26 -29 14 -7 -2 -26 -8 -9 11 -8 7 -28 -4 0 11 7 -21 -30 -13 -18 8 -13 5 -2 -30 -8 -13 8 -12 7 -3 18 -33 2 5 3 -6 -12 -3 -36 15 -15
-1.65506 -15 1 0 6 -13 4 0 0 9 -22 2 -29 4 -4 2 -2 -13 11 -6 -19 23 -7 16 -11 -13 -8 10 -4 13 -16 -18 -9 -30 -2 -24 -10 -6 20 -17 -10 -19 -5 -24 1 0
-1.67744 0 8 -11 5 -22 -6 -36 14 -24 -26 -14 -15 -25 0 -28 6 -7 11 -18 -4 -21 -7 12 22 7 -10 0 -2 -24 5 -16 -18 -15 -18 -22 -12 16 -32 -21 8 0 -3
-1.69830 -3 14 -22 -1 -16 9 -11 9 -1 -20 0 -42 0 6 -4 -34 -24 -18 13 -12 -12 -29 15 -8 -17 -4 -2 3 19 15 -27 -12 -6 -5 -19 -33 -22 20 0 -5 8 3 4 -37
-1.72017 -37 4 34 -47 13 -31 16 -20 17 -20 -38 2 12 19 -37 26 -11 11 -16 -1 3 5 4 -1 4 -16 -7 -11 0 6 -22 -14 -17 7 25 4 -16 22 17 0 3 11 -22 0
-1.74205 0 -16 0 -29 13 -26 -2 -7 0 5 20 -17 15 16 8 -8 -15 -2 -4 0 5 4 -5 11 -19 15 -2 -8 -20 -27 -5 -4 -1 5 -12 -1 11 1 -12 -18 -2 7 -21 -8 -2 0 -28
-1.76545 -28 -2 -1 -32 12 0 2 16 -11 10 19 -7 4 -20 1 -14 -17 -20 12 -11 7 -38 0 -19 -26 -14 -4 12 -38 0 -22 -22 -21 -8 -17 -15 -5 12 -1 -4 -12 -22 -6
-1.78681 -6 0 -18 -12 -38 -3 -3 -25 -3 -21 27 9 6 1 0 4 -29 6 -42 -7 12 4 -14 20 6 -9 -6 5 -4 -6 6 -15 14 -9 -16 11 24 0 -2 -13 0 -9 -10 -16 -17 -19 -13
-1.81021a3%kJ0K0k4J8Ol1L4j0k3lpJ4k0J6PJ6l0L8l2J3k0J4J0Ql4J1QmJ1J8l0K4l7L6j5J0k5RJ6
-1.83107GRJ2l6Q%j3K4j9%k0J7L4l1j2K5j4K1km8L2k0J3J5j3J0k7J3K2j1PJ0j5Nk1L2k8J7krJ5j9T
-1.85244c1L9rRrl3J7J0lONn%PKj5PKL9l9Kj0J0k3L5k0J6m0K4mj0MlK5k3J2j4K5Jjlj5k2M3j2J4
-1.87533A0k6J4mj0j2J2M0l2J2k0J4k7L7j6OLk4lJ8j5M8m2J8k9L4J5l6JpRL4l5JTJ0j4K0k3Qj6J0
-1.89619a6K5rj1JK2k5K8l0QPQnTK6k8j3L7l2J0j6M2m7M5k8j6L4Jj3m3M3j2J2J0pk2J1On5L9J9T
-1.91704B0j8Rl1J4J0kJ0j9K0m2L7k7L0J4m8j0Pk1M0nMQrj6L1o5M8oJ1MoK8k7J2Ll5L3k0Oj4K7j0
-1.93841eJ8l2K5m1K1J3JOj1K6l3K4lj7J6Nopl6K2J1lnJ4qJJ1j7NpKJ4k4lK1J2k8M9m2OJM%LJ3n0
-1.96181c4M8k0Pj7jTPK3l0L4l7J8l1M6kj7kTRj7Lj1L1jj9QkTQj6M1m2O2m7rKJ6j0MKnJ9l8K1M7
$$ plain form
-1.81021 -13 -13 -15 -5 15 -9 9 15 -16 18 8 -15 -18 -25 -11 -31 -15 -8 8 -22 16 -16 -3 -23 -9 1 9 -25 -14 -6 -10 1 19 -11 13 -24 12 -3 7 -18 -9 7
-1.83107 7 16 28 -8 0 0 -13 11 -8 -8 -28 -11 23 -8 -20 5 -9 12 10 -38 -6 -26 -13 2 -11 -1 -28 -15 7 -4 3 13 -2 3 -18 14 -14 3 1 -8 7 -12 -31
-1.85244 -31 8 -1 8 -1 -34 -17 -7 -10 -4 1 -4 -4 3 5 -10 -3 -1 38 -1 1 -9 1 -22 13 -7 9 -31 -7 -11 -21 -17 -20 5 -18 -6 -20 5 6 5 2 -13 -35 8 -4 10
-1.87533 10 -16 -2 -6 -16 -28 -16 24 -8 4 -16 -2 -29 8 -8 -2 1 -23 -26 -8 -23 25 -17 1 -28 6 21 -15 -14 -21 -12 22 -13 -12 -11 -1 -15 5 -18 -10 -26 -16
-1.89619 -16 9 0 -11 -10 12 -13 15 -15 -7 0 8 3 -2 24 -4 -17 20 -12 -2 -18 24 -23 22 -6 -22 12 13 0 -43 0 -12 0 10 3 -19 -8 -2 -57 -18 1 20
-1.91704 20 2 11 -20 -6 4 2 12 -7 13 -29 8 -19 11 25 -23 -33 -26 -47 -7 -12 -8 0 -9 -25 6 -59 -11 -17 -6 -2 -8 20 -7 5 8 -27 6 -14 -8 -22 5 -5
-1.93841 -5 13 -19 6 -35 -14 -1 0 6 -5 21 -12 12 9 -8 8 13 7 0 -36 -14 -3 -6 -11 3 -5 -4 7 -10 -5 -12 -10 4 -20 -23 -2 10 -18 31 -11 -5 -4 0 0 3 16 -34
-1.96181 -34 14 -6 1 -16 -17 -18 -11 12 -18 16 -21 -3 -34 12 10 -7 -9 -11 -2 -19 -16 -27 4 3 -16 -8 -10 -12 -4 -20 21 -21 41 -6 -15 -13 3 -7 -3 -1 -6 13 -25 -4 43
-1.98470D3o8L7j7J2k0J6Onk1K8J3k4Kj7mJ8JL%J5k1J1Pk5L2l4J0n1K9J4J8k7J3kj5qM1kpjJ9k0J
-2.00658@l8K7kQ%Jj8J5mQPmRk7NnJ0J2rj2kJ5K2j6k8J2rLK2KNqj5K4k9J6j9J6J9m4K3j0J9j4K2M
-2.02998A3lOlk4K1j7Rj8JkK8Kk4j2K7J7m2L7n3K8kJ5k6lL0l3K6KJ8m8J7J6j8K3LTm7M2l8K8JMl3
-2.05185b9J1j8K1jL1k4j3J7NPj0Lj6K0j3J0qj3J1j3J9j0NQj7Mk4L0Jmj1K3K1m1L2k1Qj2KLj3K1
-2.07322Bj7J9qKk0J6kRJJ7j5kk2K1oMk9K1NlJ1rTK1l6J4K6j2plJ1J2j9j7LJ6NMj5J2l4J3QL6ok4
-2.09662fnOMj2RLJj1J2Qk1QKjk1N2m6L0k5J3%J1kl8K5J7ll2M4n2L1j3nROLqlj1RJK3l0L5j8k4M1
-2.12053A6k1K9n6M9m1L9k7J7j3NJ4k1Lk%J%j0J2%K0m3K1l2O4k5J6l7RK7pj7j1lJ4k4M0kj2rJ9k0
-2.14189a8J0KJ0k1J4J3qj7L0k1L2m2L7m3J9k3K6j4J6kL4l9J6l5L1qJ2J1m2J0J1k6K5OjJ3l4K2J4
$$ plain form
-1.98470 43 -25 12 -5 7 -13 3 9 4 -17 11 24 0 2 -15 -19 -1 0 3 3 18 -3 8 15 -10 22 -12 -2 -53 -24 -10 8 -19 -6 -8 -23 -31 10 8 1 0 19 -1 0
-2.00658 0 -38 -11 -13 -5 -5 -4 -22 -7 -11 -3 4 0 9 -18 -13 -18 -8 4 -5 -17 -19 -4 18 2 -26 -14 -23 -20 2 4 9 1 -14 10 -19 -3 -22 -6 13 -31 -8 -18 1 -13 9 13
-2.02998 13 10 16 13 -11 10 -7 2 -16 -15 -17 11 13 -11 -23 4 21 -21 16 -37 -9 -11 4 -22 -25 5 -28 -2 0 18 -30 -13 3 -15 8 11 14 -33 9 -29 -1 0 4 -29
-2.05185 -29 -18 -36 -15 -16 15 -9 -22 -5 0 7 -3 0 -16 4 -9 1 -7 -20 -9 -22 -3 -13 -8 0 -17 -13 -37 -7 -6 -10 -21 2 23 -18 14 -7 1 -11 -9 -6 -19 2
-2.07322 2 -15 4 -4 -2 -22 -6 -8 1 2 19 4 2 -20 1 -5 -1 -30 -9 -4 -7 4 -5 -14 7 -29 -15 11 -1 -8 -11 0 12 -7 -24 -21 -5 0 4 -11 1 -33 -20 -12 24 18 -6
-2.09662 -6 -11 -5 -1 -13 -4 -1 0 -11 1 9 -12 -4 -2 -3 -24 28 -18 12 -13 0 0 11 9 -29 -4 13 10 -22 22 -30 1 -12 -17 -8 -2 1 -7 -10 -21 -12 -11 12 -18 17 -1 -25 16
-2.12053 16 -5 24 -32 17 -24 15 -12 5 -8 -3 11 -10 -7 -9 -9 -8 -8 -18 -6 -6 14 -29 -8 -40 24 -1 15 -22 -13 14 7 -10 -21 -24 -10 -34 6 4 -8 -17 2 -18
-2.14189 -18 -8 -6 4 -17 -3 10 2 -15 15 -6 26 -16 21 -22 -3 -26 0 -14 2 0 34 -5 11 -24 7 -1 11 22 -20 -10 1 -25 0 6 5 18 -16 6 20
-2.16173B0l2jJ7Oj7Ll0QK9j5kJ3l0K4MPl3L6m2J9%L0j7J2k5rN4l1Nj5KK7j3K6j5Mn1M3j1j5L4m3
-2.18310b4L5K5l5K7n6M6n1J9LKnmL9j1Ol2L5m5%K1Tm4K7j1J9j4nJ6lPoJK5l2J1mpk2M6k6RJ8m2K
-2.20548a9J1KJ9j2k9J1K8j9J9Mm4L7j0lMj4J5k9K2PTk2POonTJ3LMj8j3pL4KTj5mPKnK6j4rQqJ5%
-2.22990EnLj4M7o2K4pJj3N4m7K5l9M3Ml6J6kQj6lJPj5mK8k5J8Mmj9M0nl0J8lJ7k3K8j9%j2TmK0
-2.25279hj2TK9Kk0J5j1K0Nk0kJ6j9JoJ4nKJ0k6J6K7j2p%rJ6%PrmKJKj0J0OqJ9k2j6L9k3kJ7Jk4
-2.27670a0J0j1qK0Pl1J6JqjK1j0l4J3K6Kk2J5POk2JTJ1J3K2m9J4rToJ1J3%qJ0k5J6J1%kl0J9j7
-2.29908b6K9l8K8l2L5j3Nj3M0j2Jj6j8N2j7nm5L5K0Nl4N2o1N5j8pj7mM5m1J4k8O2l5jTPJ8l6J8
-2.31943Cj5J7noj9M1k5rLM2m5J9k0J5MlmKj4RL3l5K7l1jJ7JJ7l7QpQJ2Nj4J8lj2KRk6K5jk2%j8
$$ plain form
-2.16173 20 -12 -13 4 10 -7 -4 -34 -26 3 -12 -14 -1 -31 -7 -3 4 -29 7 -35 -16 -16 14 -3 9 -16 -25 29 -2 3 -12 -10 17 4 30 15 19 -32 11 0 -15 19 -24
-2.18310 -24 11 36 1 28 -28 18 -33 -14 -11 -9 -14 -18 21 10 16 -16 19 -26 -26 -5 16 -28 -1 -12 7 -7 -12 4 1 8 2 3 28 -4 7 3 -4 -26 20 -6 3 21 -21 -19
-2.20548 -19 -8 -6 13 1 -28 -17 11 -8 11 15 -29 8 -2 -5 -1 -15 0 -29 -7 0 7 -15 -8 -2 -8 -13 -18 -5 -2 2 -16 -29 -36 -2 0 2 -13 -17 -10 -8 -13 13 -1 -10 -2 -10 5 5
-2.22990 5 0 3 -11 36 -26 -2 -9 -8 -21 33 -14 11 -28 15 19 -17 -1 -3 5 -11 -14 -13 -6 -21 -25 3 -22 -4 0 -4 -23 17 12 -18 0 -3 14 -9 19 0 0 -12 -24 -28 -8
-2.25279 -8 -20 -32 -3 -1 -21 -6 -17 3 8 -12 -14 2 -17 -16 -22 -8 -13 -11 -1 -27 -11 16 4 -3 -3 -12 4 4 11 2 -2 0 1 3 -7 3 9 1 20 -2 -18 21 -2 -4 13 14 -10
-2.27670 -10 0 -11 -19 1 8 -23 -7 -6 -14 -15 6 -4 -38 -25 1 3 -19 -4 3 9 -13 -12 -11 0 13 35 -14 0 -9 -18 -24 -13 0 0 -8 2 -23 -7 4 4 2 -28 -9 -26
-2.29908 -26 3 -35 -7 -39 -4 -17 -12 -25 15 3 4 -12 -30 22 5 0 -45 -10 10 15 -19 33 -28 27 9 2 -15 -19 26 -15 -1 -29 33 -2 -3 -4 3 21 -15 3
-2.31943 3 -12 5 0 -6 -25 16 -9 -18 -15 27 -18 1 -19 -4 0 -3 -7 -5 -19 -10 23 -12 15 -16 -17 0 1 18 -19 -11 -18 -10 2 7 -7 11 8 -4 -2 7 -19 6 5 -17 -17 -35
-2.34283c5L2pQk6M0m3N0j1Pk9kK4k3K5m3M5k5K0J7k9K6j1J8l8M5l7J9k4l7K5L0k1mJ3%oj2JL1r
-2.36318Dj6K2J4k2Ok9M0m0K1Nl2KK3J2ok6J5J3Pjj2mNTj7K3m2O0n1LK0J1k7K7j5K2l1K9rk2J4%p
-2.38506fj1K6j8J9j3PrK3l0%K0j3J0K5m7K0j6J8J0ok6j5K7NlJj3K6l0K0kJ1mj9K0rlJ0j3J4k5J8
-2.40642ak2K8j2jrK0k2K1Pl7L6m1jN1j0Qj1rk4NK7J2k1KK2j2j4nJ6k1KJ6k8K7QjJ2n5J8L9m7L6
-2.42779Ik2K8m5L3MJ2j3TQpLpK0k6M7k2pK8l0mj0K%J8k5J1J7j6j7N2jl1J8l1L1j6jLK6m8L3k4K8
-2.44966A5k5K5k4L8j9rk7L8l0J2qJ0k4LKL3rJ9j3j2mjQJ7Jk4l0M0Ok1J3knJo%rK5k6J7j3K8mjrQ
-2.47306Dj4J0Rnqkk4N2k4J2m4N3l1J8l5K9m0M1j6jj7PK2OJ1Qj4Pl1L5k8j5kJ9kJ1j8L5m2K8j4J0
-2.49443@j2L7j6l1L0k4K8j3qLj1J1K0pj9MK7j6L2o9L6k1K8j6J0j7JL2j3k5K3j4J9rjk5N1l1K6m0
$$ plain form
-2.34283 -35 -3 -10 -2 -28 12 -31 19 8 15 -14 -16 8 -15 10 -33 12 -13 7 24 -5 21 10 28 -10 35 -2 17 -7 -44 -19 11 -10 -14 -1 -1 -7 -19 -18 13 4
-2.36318 4 -12 10 24 2 8 -21 19 -21 0 5 -27 -25 -2 10 4 -22 -7 6 13 12 0 -4 1 6 -11 12 -30 30 -21 -18 2 13 -14 13 -2 20 -11 18 9 -13 1 1 -6
-2.38506 -6 -17 9 -9 10 -3 4 -5 18 -12 -12 8 -5 5 30 -17 3 -13 5 15 9 -17 -32 -5 0 -3 -2 -15 11 -19 1 -1 10 6 -13 7 -2 -5 5 -8 6 -19 -1
-2.40642 -1 -23 5 -7 -8 -17 3 -19 2 9 -28 8 -33 -34 17 7 15 4 -5 -29 -24 3 15 -6 -4 18 6 -8 -13 3 -18 -16 0 -28 -1 7 6 18 -37 -19 20 -27 9
-2.42779 9 -13 15 -30 3 7 19 6 -7 1 -6 -3 -10 10 -16 31 9 2 30 0 -4 -14 -12 -12 6 -19 -8 9 -7 -24 28 27 -4 14 -17 14 -2 -3 0 26 -22 11 -13 15
-2.44966 15 -10 15 -9 29 10 1 -26 12 -18 -6 -14 -4 -28 -25 -23 10 1 20 7 -5 -9 -10 -2 15 16 -8 -38 2 8 -13 0 -2 -7 -6 -12 -12 -21 4 -22 -5 -18 10 6 5 -4 4
-2.47306 4 -10 0 9 4 -4 -6 -30 22 -2 10 -34 19 -12 6 -29 0 -40 1 -15 -16 -33 -26 -4 2 13 21 7 14 -17 18 -10 -25 -27 -8 -10 1 -17 18 -24 4 -10 0
-2.49443 0 -12 25 9 -22 8 -16 12 -1 -9 -6 -17 -6 14 7 -12 -8 19 3 35 -34 2 -19 9 -7 3 -14 -13 19 6 -19 4 -10 9 0 -1 -26 25 -6 20 -20
-2.51478b0K2okqK1k9J3nJ9nMj1K1j5k2QMJ1K5l2PKkKk2J2K0K4n7M0l3QJj1J5jQPj4j8M9l6NJQj3
-2.53818eOk3J9j0K8k2L8m3J3%PMj2J1j2J0j6j4M2m5K8Rj5K2j1k7K2k6J1mL4k1j1J7knLJ7n5N4q
-2.55904Hl0J6L2l6L5j5Qk5JNPj3lpJ1k8M1J0l0L0k2qK7j3k2M4k8NnJ0lj0j9M1l8L6%Qk2J4l1PJ1
-2.58091a%j5J4Kl0J6NRNK6k7J6n4L1NJ9l9K2nK6j0l4KK3rlRj0%k1K4J4mj1J8k5Pj3K1qL1m5jJ1
-2.60329iK3j0J8k2J6k6L9m9J1%J2%j8J2jRrLJ0j5Ml3L3J8Pm6j0K5%Lj5K5j0qJ9j0j4K1Tl4KlNjj0
-2.62619a7J3N2m9rK6kTnj0J3k1RQJ5j7Nlj6K2oqkJ0j3J0j0%j8J5RKNk7L9k2L1k1TJ0j0L6j9K3k2
-2.64857Ck4K8k0J6mPl5O3m1J5k5k4K6K0j0j5lM6l2M4o4M1k4Qj4K2Rj7K9m9N6m8M4n3K7j3j6L5k0R
-2.66892cJ2Jk3QLJ9j7jK7l7Rjl9M0j0K8l5NJ3L5m2K7j4jqj4L0pNnL5p7M6j7L4l0k8K7l4M0j3Pnm
$$ plain form
-2.51478 -20 2 -4 -6 -14 7 -22 -9 -14 5 0 4 -7 14 -1 -23 -15 -11 0 25 -7 0 2 0 2 -20 -8 12 36 -21 19 -14 -6 -5 -16 -1 -2 6 13 -1 -19 30 -6 -1 0 8 -5
-2.53818 -5 1 -22 -3 -13 15 -7 31 -12 1 1 8 12 0 11 -1 9 -7 -21 21 -24 4 13 -2 20 9 -18 4 -22 -11 -15 19 -2 -13 4 2 -3 0 17 -38 16 8
-2.55904 8 -22 -6 26 -10 25 10 18 -7 -6 -1 6 -7 -10 -17 -6 -34 7 17 -13 17 -5 -13 14 1 -21 23 -5 0 -5 5 2 -8 -27 14 -24 12 12 20 -2 12 -19 -12 -1
-2.58091 -1 -1 -16 -2 0 -30 -14 -9 0 5 31 4 20 -34 -3 2 21 -18 4 -1 25 15 -19 -17 6 -3 -6 3 -7 -7 -28 -4 10 6 -5 13 -12 -5 -18 3 -5 26 -19 -20 -9
-2.60329 -9 14 4 22 0 16 -10 29 -20 -9 -9 3 3 -15 -3 -4 5 -4 -1 9 -6 -2 -35 -2 16 23 -23 -33 -8 -8 -5 -20 5 -5 -13 6 -4 -18 3 24 -10 -8 -11 -6 -7 -17
-2.62619 -17 -4 48 -1 -10 16 14 12 7 -3 10 -11 -2 6 21 4 9 6 -10 12 6 -2 -4 6 -7 3 -7 -7 -25 -10 -1 1 6 -21 18 -4 27 6 -15 -5 -15 21 2 25 3
-2.64857 3 -21 7 -13 3 -1 6 -29 34 -7 8 -17 -41 -15 5 -5 -20 -23 23 -9 35 -29 12 -12 -4 -18 4 13 -4 25 -24 32 -16 28 -25 2 -11 -27 8 -12 -3
-2.66892 -3 9 10 -13 -5 -2 17 0 -1 26 -11 -2 -3 -42 -2 -12 16 -19 -14 -1 34 -8 19 5 4 -4 -18 12 5 10 5 40 -37 9 -8 26 -4 -32 -5 -39 1 -12 -5 -10 -14
-2.69130a4J1Pl9K5QKj0LlK6j5MorJ3lK3n0L1j4J6pRk3Lj5K4%JK%J2j2kj5LK9j9J6j4oj6K5l2M1j5
-2.71470eRm%j2J7k1MJ9j8J0k1K8npPRljj6N5n2J0mJ6rnk1J7KmNMnrK7j7j1KoJ6J0l6J0K0M4m2Lqn
-2.73963cJ0prK1j0j6PK3j8j4J9J0l7K5j3J3J9k7J1k5K7J8k9j8QNK3prJ5nJ2l8L3j4nmj1K4k0jM1
-2.76099B4l4J2RMqj9K7Kk5mJ1J6pj0PnJ1lk9K9j3J9j5qlJ9j1Nj1PrOJ9kk0j0KN3l4J0LoJomJ7K1
-2.78490C8l0j0j2J9j6nJ3J2Lj8j0MJ6j6Qj3K6Npj6K2JNj9J1j8J%mK1j2K6k0j6L2ml0nL1k6jK1k%n
-2.80780@M0k7k4j2M9j2j0J1mj1j4J0pJK3J6j8k5MlJ5MKQm4K0K5l2K6k2kQJ5rOR%j9J9l1K4NMk0%
-2.83069bJ6k9K3kqk0QPJJ3Rl3QrJ1Rk0M6l4K1l2L9l4RJ9l1L0k5Rk2M9l2j0PjM6m8L6l8K4K1m6M8n
-2.85307B8j8qj7J3Rl0K3K4Rl6MJ9nNj2roJ4nRj2J8j4J3K0J1n9K8l0NM1m1K6jj7k1lJ5J0pMJ5j9J8
$$ plain form
-2.69130 -14 -3 4 -35 -10 -2 0 -10 -7 -10 16 1 5 -1 -10 3 0 23 -27 4 -10 6 -1 8 -15 -12 -27 -3 -3 -2 0 0 12 0 -2 -17 -14 15 -4 12 -2 -8 -24 1 -31 10 -5
-2.71470 -5 4 0 0 -12 5 -16 -12 7 -11 -1 -22 6 1 -6 1 10 7 6 -10 45 -7 3 -1 15 6 1 -20 -3 -1 -5 0 4 -1 -10 17 0 -11 -9 -15 1 11 -25 -15 5 49 7 10 2 -3
-2.73963 -3 7 0 -9 12 2 -14 -7 16 -2 -16 3 13 -24 1 -12 1 20 -7 4 -21 6 24 -5 -23 -15 -10 13 6 -3 12 7 19 -19 14 0 -5 -9 -20 4 -16 -17 24
-2.76099 24 -10 2 11 15 7 -12 15 17 -8 -12 -1 15 8 -2 5 0 11 8 -21 8 -5 14 -1 -9 -12 7 -4 1 -10 -3 -12 -6 13 11 -9 -19 -17 36 2 12 15 9 10 4 0 17 38
-2.78490 38 8 -2 -14 5 -11 -16 -3 9 12 -6 -16 -12 4 -12 -4 -17 9 14 7 -9 13 14 19 0 11 -7 -6 -6 -10 11 -1 25 5 -11 21 17 -13 -18 13 -13 -14 7 5 5 0
-2.80780 0 40 13 -11 -23 26 14 4 15 11 0 -14 -4 -11 -10 13 29 11 -14 -10 -13 2 6 8 16 -28 -8 17 -15 11 -11 -13 -5 10 1 7 16 16 -3 16 -15 9 14 18 -2 -2
-2.83069 -2 14 -15 8 6 -2 -22 -14 -7 -6 7 16 -17 -9 -18 -7 2 -18 28 -6 15 -17 22 -12 -3 16 -15 15 -10 -1 -23 26 -6 -16 -9 -10 36 -12 24 -14 10 31 -15 33 28
-2.85307 28 10 2 -15 -2 7 -23 0 24 33 -3 1 20 15 20 8 -1 -7 7 2 11 -1 17 3 16 36 47 -12 16 -14 -9 32 -9 17 16 -1 -22 -25 -10 0 -7 -3 12 -7 11
-2.87545A1kKmpTJ4pj2j4L4J2j0J1l1jpNL3l3J9jnJ8l1J7kj7J7J3k1M4m1J6j1pkK0k6K7k1NOjKJ9
-2.89835B4j0j7KJ1k7L3j6k0L2j1J2j9J2jK4m3j2M7l4J1oj4J6L4l4K0k3k6M0m%j1L6l0Ol1L6m5M6o
-2.91869BmK7l5NTj9RJ3J9j7j0J1J4l3K7rjJ0Nl8L7k7K1pOk3K8Mk3k2K0J8j5k1NQL3j2Tk9N2j0l4
-2.94057b2N1l5Ol6M3lm2J4L5q%j7K5l0K8k3K6l4LJ0K7lj3j4jK8ll3L7k1L3l3K5j8J0Nj7J3k9J5J6
-2.96143A5qk1J0j0J7nJ5nl1K3lTJ1k3J7j0NK2rJ1j0%poJ1oKrJ1POj0nNl4K4LTk5J7J9k6K7j5Rj3N
-2.98534Aj4L3qnPpJk1K5j2K0k7K4j7J4nRpk0J4pK0l1K2nJ4Knk3J9mj0oRmJ5k8J3K0k1j9M7m3K0rR
-3.00874@rK1j7PM7n3KJ7l1NK7k6K4j1MrJ1k1lL0j5Rk6J5k1N8m0NrjKj2K6k6J5rjRj2J3rL6k0%mP
-3.03214EJ6Nj6k1J3j7K5j1J1J0Lj4lj2L4n4M4k1J0j3J3j2K4k2Rj6J1kONl0M2j8oJ1J2q%k1J4k3J9
$$ plain form
-2.87545 11 9 11 7 0 -7 7 0 -12 -26 8 20 10 21 -10 -11 -18 -13 20 -13 6 5 0 18 -13 4 2 -15 2 15 -6 38 -3 13 2 -5 -7 13 -13 14 -7 -2 4 3 5 24
-2.89835 24 14 -3 -1 10 -17 16 0 -20 12 1 13 -6 6 5 29 -14 -26 21 -13 -2 -8 -22 -6 28 -6 14 -9 -35 5 1 1 -10 26 -4 2 -29 7 -38 8 2
-2.91869 2 -2 25 -10 -5 0 -19 -10 3 22 5 -5 6 20 -13 14 5 4 14 19 -19 18 -9 12 5 11 -12 16 20 -3 -25 -5 13 -2 -23 -18 -10 23 11 -1 -30 22 12 -22
-2.94057 -22 29 -6 0 -36 7 4 -38 -24 11 3 3 -14 11 -19 9 -14 12 -22 -19 -9 18 15 2 -12 -13 15 12 -21 16 -5 28 -5 20 2 12 17 0 13 -16 -1 15
-2.96143 15 7 -14 -4 -14 3 -2 13 8 -23 0 -3 -6 5 -18 -1 -11 -6 16 7 18 8 8 1 -5 6 0 2 -7 4 11 17 7 2 7 -27 -3 0 3 -22 -5 14 -12 15 0 9 -4 1
-2.98534 1 -13 20 12 7 14 7 8 -13 12 0 20 -7 17 0 14 9 18 11 -9 5 -2 18 -13 9 4 18 20 15 -8 11 7 -3 -9 0 -4 11 -17 -4 16 -5 -24 23 -20 0 -9 0
-3.00874 0 -9 12 -5 2 49 -4 -2 15 -16 -11 16 -10 14 3 7 -2 9 -12 -15 15 0 9 -17 -2 -23 35 -5 0 -9 -10 -8 -20 6 -20 -5 -14 -15 -6 -18 -5 -14 22 2 2 -2 5
-3.03214 5 21 26 10 -11 2 -15 10 -1 10 20 23 9 6 -6 28 -26 18 -3 7 -6 7 -5 19 -3 6 -10 1 -1 5 10 -20 22 4 -2 9 21 13 13 -8 6 -17 2
-3.05350BK3l9K7l0J7J8j8%J3jlk1PJ8J2k7j6NK7j0K1n2M8j6Rkk2J8Oj6J0J1Mk0J0j1j2J4qM2n6L5Q
-3.07538B5l6J6j4jJ0Rj3jJ3j3nlJ1KJlL1J0o8RJ1M1n0M0k3K5k4J4l8K0KJ2j6J2k1L1j8mL8k4K8l2L
-3.09725Glj1pK0qK8
$$ plain form
-3.05350 2 25 -14 13 -17 0 18 0 0 13 12 9 -12 -5 13 25 -2 -18 -13 14 4 25 -27 21 5 14 12 -10 8 14 -2 8 19 23 3 13 2 -10 4 -4 38 -18 17 25
-3.07538 25 -11 5 -9 -10 0 9 -4 -5 8 -5 -10 -13 -2 0 1 -2 29 39 -29 -20 -9 32 -18 22 -1 24 0 14 -24 -4 -2 10 -6 6 -15 16 -2 -6 32 8 36 4 7
-3.09725 7 4 -7 -14 6 -2 26
-3.10030B6    $$ checkpoint
##END=
