##TITLE= 3,6-Dihydro-3,5,11-trimethyl-4H-pyridazino[4,5-b]carbazol-4-one
##JCAMP-DX=   5.00   $$ Varian Associates, Inc., VNMR Software
$$ VNMR Version 5.1 Revision A, March 1, 1995
$$ Wed Jun  3 11:46:55 MET DST 1998
$$ svsj version 5.1, 97/1/14
##DATA TYPE=  NMR SPECTRUM
##DATA CLASS= XYDATA
##ORIGIN=     varian
##OWNER=      haider
##SPECTROMETER/DATA SYSTEM=   Varian UNITYplus-300
##.OBSERVE FREQUENCY= 299.9498529
##.OBSERVE NUCLEUS=   ^1H
##.SOLVENT REFERENCE= 2.490        $$ solvent=dmso
##.FIELD=             7.04         $$ Tesla
##.ACQUISITION TIME=  3.7376000    $$ seconds
##.AVERAGES=          32           $$ number of transients
##RESOLUTION=         0.153        $$ digital resolution in Hz
##.PHASE 0=           -36.9        $$ zero order phase correction (left edge)
##.PHASE 1=           0.011232     $$ first order phase correction, deg/Hz
##$REFERENCE_POINT=   929.936      $$ Referencing label
$$ Varian specific parameters
$$ --------------------------
##$acqstatus=    (0..1)  101 0
##$alfa=         19.9999923706     $$ usec
##$alock=        <n>
##$array=        <>
##$arraydim=     1
##$arrayelemts=  0
##$at=           3.7376
##$bs=           16
##$celem=        1
##$cp=           <y>
##$ct=           32
##$d1=           2                 $$ sec
##$d2=           0                 $$ sec
##$date=         <Oct  9 97>
##$dfrq=         299.9493529       $$ Hz
##$dm=           <nnn>
##$dmf=          200
##$dmm=          <c>
##$dn=           <H1>
##$dod=          0.00999999977648  $$ sec
##$dof=          0                 $$ Hz
##$dp=           <y>
##$dpwr=         30
##$exppath=      </export/home/varian/haider/vnmrsys/exp1/acqfil>
##$fb=           2800
##$file=         </export/home/varian/haider/jk4>
##$filter=       54.0999984741
##$fn1=          1024
##$gain=         48
##$homo=         <n>
##$hs=           <nn>
##$hst=          0.00800000037998  $$ sec
##$il=           <n>
##$in=           <n>
##$lb1=          0.318309992552
##$load=         <n>
##$loc=          0
##$math=         <f>
##$method=       <z1z2>
##$np=           37376
##$nt=           32
##$p1=           0                 $$ usec
##$pad=          0.5               $$ sec
##$parversion=   4.3
##$pmode=        <partial>
##$priority=     5
##$proc1=        <ft>
##$proc=         <ft>
##$pslabel=      <std1h>
##$pw90=         16.8              $$ usec
##$pw=           10                $$ usec
##$rfband=       <ch>
##$rof1=         10                $$ usec
##$rof2=         9.9999961853      $$ usec
##$seqfil=       <s2pul>
##$sfrq=         299.9498529
##$sn=           0
##$solvent=      <dmso>
##$ss=           0
##$sw=           5000
##$temp=         28
##$tin=          <n>
##$tn=           <H1>
##$tof=          500               $$ Hz
##$tpwr=         57
##$vtc=          25
##$vtwait=       300               $$ sec
##$wbs=          <>
##$werr=         <>
##$wexp=         <>
##$wnt=          <>
##$wshim=        <n>
##$wtfile1=      <>
##$wtfile=       <>
##$x1=           -103
##$x2y2=         327
##$x3=           123
##$xy=           335
##$xz2=          0
##$xz=           62
##$y1=           22
##$y3=           -133
##$yz2=          0
##$yz=           -40
##$z1=           -1449
##$z1c=          -103
##$z2=           46
##$z2c=          185
##$z2x2y2=       0
##$z2x3=         0
##$z2xy=         0
##$z2y3=         0
##$z3=           81
##$z3c=          0
##$z3x2y2=       0
##$z3x3=         0
##$z3x=          0
##$z3xy=         0
##$z3y3=         0
##$z3y=          0
##$z4=           -105
##$z4c=          0
##$z4x2y2=       0
##$z4x=          0
##$z4xy=         0
##$z4y=          0
##$z5=           0
##$z5x=          0
##$z5y=          0
##$z6=           0
##$z7=           0
##$z8=           0
##$zx2y2=        0
##$zx3=          0
##$zxy=          0
##$zy3=          0
##$rp=           19.3
##$lp=           -56.2
##$rfl=          1676.8
##$rfp=          746.9
##$axis=         <p>
##$sp=           -30.1
##$wp=           3809.3
##$cr=           1404.4
##$delta=        757.3
$$ End of Varian specific parameters
$$ ---------------------------------
$$ Y-values stored with standard (16-bit) integer precision
##DELTAX= -0.0005087113
##XUNITS=        PPM
##YUNITS=        ARBITRARY UNITS      $$ (mm on paper)
##XFACTOR= 1.0000000000
##YFACTOR=       0.004191806
##FIRSTX= 13.5686394668
##LASTX= -3.1003049043
##MAXY=          137.348704
##MINY=          -0.197015
##NPOINTS=       32768
##FIRSTY=        0.083836
##XYDATA=        (X++(Y..Y))
$$ [...]
12.22920A7j7%J9J4nj1J0j8K5l8J0kL5k2K3l1Rl0J6J0JK8j8%j3oRrJ2%j5QjJ4j4J6kLk8L0kLNk6
12.20682Ij4K8K0k7Lnl1L4J4j8NKj3L6l1ok5M2j3j0L4m6J4J0j1Kj5J2K2Jj9J3OJ3lk4L2l5PjqK2
12.18545B6k9K6k2K2k8K0k9J8J2l4K6oLK4k3jTJTLMj1JJ6nkJ5qK4l4OoJ0Tl%j4K0jk2J2lrJ1kJ1
12.16205B9j1J8mj1j5L4mk2KJ8m1K9mTj1RPjK1roKJk6K0k0LQJ5l5K2J2rmk7J8K2k5%J8nJMnJ2k1
12.13865EJ5j6M2k2J0j3%Tk0MJ4J1j0Qk1PJ3l3K8l0L3JJ4l6K3Qj5qLnMj7K1OKOj3Po%Qk3K0pj8
12.11576@K2Oqj7J5j0%J0j1J4K2l8JK8j7PMKlJ4k2jQpj2J5rJ5j2j4KPK7%Mj9Jj9J7J2k6K4j2OoL
12.09236B3J7k3J5J7n9N3j8Oj5J1j3MOj8NKL8m1OK2rj0QnLJ4l9M3j3lKqJ0k3L3k3J1nj8J4mk1L2
12.07048B7LjKj0rK1j4K7l6QpJ5k5K6J6k9J7j0QqJ8m6J4J0j6K0L1m1RQk2K3Ol4K1j5J4j7K3k4K5
$$ plain form
12.22920 17 0 0 19 33 28 17 27 9 34 -4 6 4 39 17 40 9 18 -12 4 14 15 43 25 25 12 6 15 6 18 18 3 11 10 24 10 26 24 27 -1 29 27 30 35 9
12.20682 9 -5 23 43 16 19 14 -17 17 31 13 18 20 7 43 12 6 -19 23 10 0 34 -12 2 12 1 3 -12 0 22 23 4 17 23 36 33 9 41 6 13 12 4 26
12.18545 26 -3 23 1 23 -5 15 -14 4 16 -18 8 2 5 29 6 5 4 5 6 9 13 2 3 19 14 12 27 19 43 9 15 9 19 29 26 26 12 32 31 9 21 18 9 20 18 29
12.16205 29 18 36 32 21 6 40 36 14 16 34 -7 22 18 14 3 12 19 18 39 30 24 26 27 1 21 1 4 12 27 -8 14 26 17 13 -14 4 26 1 1 19 14 15 19 14 26 5
12.13865 5 20 4 46 24 34 21 21 21 1 5 19 30 20 28 7 14 27 -6 22 -8 25 26 40 4 27 35 20 12 15 10 14 -3 18 24 26 32 19 26 20 20 28 5 25 18 0
12.11576 0 22 28 20 3 18 8 8 18 7 21 43 5 6 34 17 24 28 30 27 41 19 18 26 19 7 22 13 28 16 2 4 11 38 38 42 23 24 5 22 34 8 32 20 26 20 23
12.09236 23 40 17 32 49 -10 43 25 31 16 27 14 18 24 6 11 13 51 10 16 38 29 19 27 22 25 39 0 43 30 27 29 21 31 8 41 18 29 24 6 20 16 -5 27
12.07048 27 30 29 31 21 12 33 19 46 10 18 11 26 1 27 43 14 31 21 29 21 39 -7 7 17 1 21 52 11 20 28 6 29 35 1 22 7 21 4 27 3 28
12.04963B8oqKK1l5J7qJ1LNj7R%mK4k8J3l5L2J1nLOk9J9l0L2%M%j3J8j1l8N4l6MkTJ5Oj0j1J6k
12.02674B3J0Tk0K0j2j3j1L0l8K1oj0K7Pj7Ok3L2l7N1l3%k4K1JJ5Qjl5Nj8K4K6k2kPJ3k3J7j3J0
12.00588B6jj8J6j4QJ0J7l1J1J6njMk7j1J2j5J5lJ9J3k0J1l2J7kJ5J2l1ML4m1kjJ5nRrL2l1oJ6
11.98451B6j9L3k7K4l2N0ok2k7L5j6LJ8J2j4j0J7j9k6L1j7K5k8L5qJ9k6pJ5J0ql5K4k3M5k5Qk2
11.96518A3J1kLTlpJ0j3kOmK1k2K0j9QNKRj0J5l6J6qK6l8K2LqJJ0Kj4K6j6K5l0K2l4L3j3J9k3JQ
11.94229C8J4k2j5K0LTk2L1j3oMnLj0J9kj7L5l6PKlOj7J3K3j8l2L4l5L2JJ2k7J4k7N3m0MOM0l3n
11.92041C2mJ8j2J7rj3J8l9K9k4NJ2J1k6K4k1J4oqO0n1NJ8l2K4%MmMj5k7M0j8K8l3J2PRNk3Ml0
11.89905EK4J8J1m0K2j4L3j7Qk6KJ8qj8K3nMK4l2J3j5J7Mk8K7Oj8Pj3J6K8n9L3k8J7Lj7L9k0J5
$$ plain form
12.04963 28 22 14 16 37 2 19 11 22 25 30 13 22 22 18 42 14 27 -8 24 35 30 33 39 10 29 -1 31 31 35 35 22 40 29 -9 45 9 13 11 9 24 30 20 9 25 23
12.02674 23 33 43 23 43 31 18 7 37 -1 20 14 4 31 38 21 27 4 36 -1 50 17 17 -7 14 15 30 38 37 2 7 -11 13 39 17 15 22 35 12 29 16 26
12.00588 26 25 7 23 9 17 27 44 13 24 40 35 34 38 11 0 12 -3 12 9 28 41 21 32 0 17 15 30 42 11 15 49 8 6 5 20 15 24 15 47 16 10 26
11.98451 26 7 40 13 37 5 55 49 27 0 35 19 22 40 52 38 28 45 26 0 31 14 39 11 46 38 57 31 24 39 49 41 6 30 7 52 27 35 13
11.96518 13 24 22 25 28 25 18 28 15 13 19 15 36 14 34 15 23 28 30 39 29 44 8 24 16 42 4 26 29 21 22 32 34 20 46 30 55 25 47 13 46 33 52 29 30 38
11.94229 38 52 30 15 35 38 41 19 50 37 31 35 30 33 23 42 40 23 58 22 29 31 28 34 17 30 53 35 3 37 2 34 35 47 20 34 7 60 20 24 30 70 37 32
11.92041 32 28 46 34 51 42 29 47 8 37 13 18 30 41 15 39 18 32 26 18 78 27 32 50 18 42 42 46 42 46 31 4 44 26 54 21 33 40 49 54 31 35 5
11.89905 5 29 47 58 18 40 26 59 42 50 24 26 44 36 18 41 36 40 64 32 45 30 47 51 23 50 56 38 45 32 48 76 17 50 22 39 42 25 64 44 59
11.87870E9k1qNlpK8jj7K6j9PnLPJk3j0J6MOJ0j4%TK3k9J3j0lj4L2J0ll3J4j3KJ4Tm3M1Qk4LL3
11.85581G9m2K7l4K2MJ3k6qKK2lj2rK5Jk5J6JJ8j5j4mnRM2j9KJ5j5l5K5J5pQl0K2%j4J8j6Pj2J2
11.83393F0MK3l9J9k7K3K0k6K4k1nK2J1Nk4RJ4j8J9m9N8qpkk3j6M2Nk6K7j3rK1k9j7J4nK0J1j3P
11.81308H1kK4k3j7J1j3K6j1L0nj3rJ4j7J3qK1qJ4j1K6l5JmK%Pj7L6j6j2K6oJ4j0k2K1j5OJ7J0
11.79222A26k0j1J1nJ3K2l5J0j1J4k6N5m5L0Rj5K4l7K7jpoJ0L2m8L8k2J1Qrmj1L6k1L1l8J5J1l2
11.77238A29J4NJ0l7L7k8K4j3L2j1%j2LJ3j5K8j9K4j8RMOk1M2j1Nj0j2J1j7L6mj0J1Nj3LNMJ8l
11.75152B24J0j2Mj2QJ8nNJ2j9j8K7J2J0J3k8L3k7Qk8N3lnOkjNKkK6k9L0%J9j1k1K1kJ6j7L4l4J
11.72965C21J0J4Pj8K5J1pkrN6m9J9j9K1J4LK1m1J2J7rK4J2j4mL3j8jJ9j3K9n2N2kK6m2L8k7L8
$$ plain form
11.87870 59 38 30 35 32 25 53 52 35 61 42 49 44 47 54 55 32 22 38 42 48 58 44 44 44 67 38 51 41 38 24 56 66 63 30 44 31 33 47 61 18 59 67 43 46 79
11.85581 79 37 64 30 52 56 69 43 35 37 59 56 44 35 60 61 36 52 53 71 56 42 38 33 42 84 65 67 82 67 32 57 72 65 73 43 65 65 51 69 53 60 48 60
11.83393 60 64 87 48 67 40 63 83 57 81 60 55 77 88 93 69 78 92 74 93 44 102 94 87 85 62 46 88 93 67 94 81 72 93 64 47 61 56 76 87 74 81
11.81308 81 79 103 80 63 74 61 87 76 106 101 88 79 93 76 89 81 102 94 108 97 123 88 89 85 87 87 94 77 113 97 85 111 105 119 109 87 108 93 99 116 126
11.79222 126 106 95 106 101 114 136 101 111 100 114 88 143 98 128 137 122 146 109 136 135 128 122 132 164 116 154 132 143 151 142 138 127 163 142 173 135 150 161 129
11.77238 129 143 148 158 121 158 130 154 141 173 162 162 150 153 166 151 179 160 184 166 175 179 185 164 206 195 200 190 178 189 172 208 204 194 205 210 197 200 205 209 227 224
11.75152 224 234 222 226 214 222 240 235 240 252 233 215 242 254 264 277 249 282 255 263 235 288 285 280 286 284 283 288 290 288 314 285 315 315 334 323 302 323 321 337 320 354 320 321
11.72965 321 331 345 352 334 359 370 363 361 352 408 359 378 359 380 394 397 418 377 389 406 397 421 433 419 415 448 430 429 448 435 464 412 464 462 488 446 484 457 495
11.70981D95m0K4J0Pl3M4%j5K0kpoqK3Jj1K6JlJ6j6l%K9l0L6rl9J0j0M6k6J8jj8J7j1K2j9MjJ5
11.68844E56j9J4k9M6j6lk0j3J6KnJj7J5kj4K3kj7j1k9L7l3NK2k6RJ7k3K6l7K0j7qj9K8j9Qj5j8
11.66809D33M4l0k9J3L%lj2noOL3m3Ll7M0j9MoJ4l7K0l0J6j1K4k1oj8L4j8Jl8J8k4K8k4pPJ6j9
11.64724C14j6%TJ1Qj7pJ0k6Qj4jRj2nJ0ml6M3j0Ml4oK1qlRJ2o3L8j5J0k3L4k1J0Lqj1J2j4nj1o
11.62485A90J5Tl1lK4qk8L4k7L3o3L9K6m8J4J7j8J2j1J2k2J9m3K9l9J3J5oK8n7N4m3J1kNoJ2l7
11.60552A25L5k9QjJ1lj3J2ojJ4l0J4k7K2J0k1r%J2Oj1K1l3J4k4K1pJ8mJ6l7MmLL9l9J5m6J1K7
11.58467A13j3MJ0j9QOl6K2j9K1Qj2Nmj6Oj1J7j8J4j3N2l1J5qRk3J3j6%K2m1J4Km%KK4k7k1K0P
11.56330H2j6K3Ol5J0K2nj5LPOk3N4m7%K4l9K2Pj8kM6n5K0OMk1Llj2Q%K0J5k6j8K5PmrJ8m7J9J1
$$ plain form
11.70981 495 455 479 489 496 463 507 507 492 512 510 503 497 489 512 513 502 528 529 526 542 526 523 523 552 522 558 549 510 520 510 556 530 548 547 529 546 535 557 538 542 541 556
11.68844 556 537 551 522 568 552 549 529 516 532 534 529 530 513 528 526 512 535 533 516 505 476 513 480 485 507 481 490 507 484 510 473 493 476 468 449 477 458 466 451 433
11.66809 433 477 447 418 431 434 434 431 419 414 408 414 447 404 407 370 410 391 395 389 403 366 386 356 372 361 385 364 358 340 374 356 357 319 337 313 341 317 310 317 333 314
11.64724 314 298 298 298 309 317 300 293 303 277 285 271 270 279 267 262 272 268 232 275 265 269 235 229 250 242 239 248 260 197 235 220 230 207 241 220 230 233 225 214 226 212 207 196 190
11.62485 190 205 220 189 186 210 202 174 208 181 214 151 190 216 168 182 199 181 193 182 194 172 191 148 177 138 151 166 160 188 131 185 142 153 151 156 150 162 125
11.60552 125 160 131 139 138 149 146 133 145 139 138 152 122 136 109 131 141 120 111 111 123 129 118 139 106 120 96 117 110 128 124 140 103 107 103 106 145 106 121 75 86 113
11.58467 113 100 104 114 95 103 109 73 95 76 97 105 93 98 94 78 84 73 90 72 86 73 125 94 109 101 110 87 100 84 84 106 65 79 81 77 77 79 103 76 55 75 82
11.56330 82 66 89 95 60 70 92 87 72 75 82 88 65 119 72 72 96 57 79 86 68 66 112 57 77 83 87 66 69 66 54 62 62 82 97 71 53 78 85 81 72 90 43 62 73
11.54092G3l2NK3J1k1J6j8J4Lj7j2L2l0K8j5j0%LQk9RpJJ3MNnRJ1j6k8J2pK5k2J5j2J0J2J0nj3
11.51955E3j6KK9l9J1RNjj0Jj0L7m7L9l0J0oL2l3K0j6LklJ4Nl3K9noOj1MLj4K2m4O5n5K4pLRqjJ
11.49615C9kmK7k3oOK1l2OJ4jj9J8%Rk2MKj2kK6j4Rk1K4j3TJ8k8L5KpKJk7J9lK7l4kJ2jLj1kL7
11.47275F2j2j8KjkMrj8LNM5l9J1lJ6k5oJ5Rj8K6oj6J0K5j3J4l4k4L8j6k4K1k2J7oJ5J7j5MNmQp
11.45037C4j1%j5J1Ok0J6pJ5k9L1mlQj6M0m3M8n2JK6k4L0ql6K0J9j3j2J6k4L4rK2l3J5qj4K0j9
11.43002A2L3l5J2j5KJ7kj0j2M8k8plK1j3K3Kk9K1J3l0L2l8MJ0KJ3j5pJJ5k7J2k7L9pmpK6k0moL
11.40814A5J1K5l0J1k6J6Rnk2J5Oj3J1opRj9PL9l2jKLj0J4kKJ1oPl4%J0J9j0j8M7k1j4oLQJ5k7O
11.38525A2L3l2J1qK0Lj6Jj3K8krPj2pJmQk5L7k7OrK2Pom6L9mJ1j1JNkTPj3J6j3OJ2j2j4K7l9N7
$$ plain form
11.54092 73 41 46 69 80 59 75 57 71 74 57 45 77 47 75 60 50 50 53 61 32 41 34 35 48 52 57 52 61 72 56 28 40 33 58 36 51 39 49 61 71 66 53
11.51955 53 37 39 68 29 40 49 54 53 43 44 34 71 24 63 33 43 37 69 36 56 40 43 41 38 52 57 24 53 48 42 48 37 41 44 30 52 8 73 18 42 35 38 47 39 38 39
11.49615 39 37 33 60 37 31 37 58 26 32 46 45 26 44 44 53 31 35 37 25 23 49 35 44 23 47 34 21 39 11 46 48 41 43 44 17 36 33 60 26 24 36 35 38 27 25 62
11.47275 62 50 32 34 33 31 35 26 8 11 16 61 22 33 30 46 21 15 30 39 21 47 41 25 35 60 47 61 27 3 41 25 1 22 0 17 11 26 43 28 32 37 33 41 34
11.45037 34 23 23 8 19 25 5 21 14 29 0 31 27 24 32 16 56 13 61 9 10 36 12 42 34 -2 18 37 24 12 28 4 38 29 51 18 33 25 11 31 12
11.43002 12 45 10 22 7 9 26 24 14 2 50 22 15 12 33 20 43 45 16 37 50 20 52 14 18 28 30 43 28 21 22 37 10 22 -5 34 27 23 16 42 22 18 12 15
11.40814 15 26 51 21 32 6 22 31 26 4 19 25 12 23 17 10 19 0 7 46 14 13 15 18 8 22 20 22 33 27 34 0 0 10 29 19 1 48 27 13 7 10 18 33 6 12
11.38525 12 45 13 24 16 36 39 23 24 11 39 37 28 35 23 16 17 13 21 -4 33 6 12 3 25 32 26 -20 19 15 26 15 16 21 19 17 24 11 27 14 20 32 20 6 33 -6 51
11.36185E1k8j6J8k9M7jln2L8pJ5rm0L7J3l3NJ8j4kJ8rk7L7l4J1J2k2K3j6K5Qj7j1PJ8k6j1K8j9
11.34150CL4oLJ1m0L3k1Kj9K2j2Lk0N4l7pJ5j9J8oK0j2kj1TK4J6k2LTj8Pk7L1Ok4OKK3jlTpjQR
11.31810B7j0rNj7J7mJ7k8L8k3Rj9L4k8j4JK5Jk0J3KOj2J4nJl4L5j6qK7m1K3%j0J2mLRqJ5j9j1
11.29623fK0Tk4qK1Rrk1RK0j1qj1LJmQTrpJ7k2Jj0J3J0nJ1lJ3j6LQrK0l8RJ9k2j5M3j6Nj9%lK9
11.27232B4j5K7j2Kl6L2rTj8K1NlJ9pJ1j7k5J3K3mJ6j3j4j3K4j8L1k7KQk7J2QrK9k4K9m1K9l6N5
11.25146D3l5Lj1L9m1K5j1J7j5Pj6Pj2RqJ1j6jOPK0pNj3klj1NL7l9mOJ2rLJ2Kol5L8qK2j8pOK0
11.22806C4l5MJK1pTkj3J7Tk0Jj0J2oj9RK2L0m9J4j0J5l1K7nMk4K3L3j8j3Mj1nJ1K7n2M2k0Qj9
11.20669@K2Lnjlj6RQok3L0k3nL6l9M0k3K5j9jJ9k0J1k3K3k7M7m0RmK3j7j2M6n5N2m6J8K2j0k5m
$$ plain form
11.36185 51 23 7 25 -4 43 42 39 -13 25 18 33 24 -16 21 34 1 6 24 10 8 26 17 -10 27 -7 4 16 -6 17 1 26 34 17 6 13 31 5 -6 22 3
11.34150 3 37 31 34 45 5 38 17 19 0 22 10 13 -7 47 10 3 18 -1 17 11 31 19 17 6 -5 19 35 13 16 19 1 8 -19 12 18 -6 0 2 25 24 21 18 11 10 18 27
11.31810 27 17 8 13 -4 13 9 26 -2 36 13 22 3 37 9 -5 -4 21 22 2 15 17 23 11 25 20 21 -13 22 6 -2 25 -16 7 7 -3 9 5 8 17 9 24 5 -6
11.29623 -6 14 34 10 2 23 32 23 2 11 31 20 12 1 4 5 1 9 17 8 1 18 -4 -3 -13 0 10 5 16 13 26 10 13 21 12 32 -6 3 22 0 -15 28 12 17 -2 -2 -5 24
11.27232 24 9 36 24 26 -10 22 13 4 -14 7 12 9 28 21 32 15 -10 3 26 22 38 25 11 -2 22 4 35 8 10 18 -9 3 11 2 31 7 36 -5 24 -12 43
11.25146 43 8 11 0 39 -2 23 12 29 14 21 5 12 0 9 1 12 -4 -5 1 8 28 21 26 13 11 8 -3 2 39 0 -4 2 14 5 8 20 22 16 -19 19 11 33 15 8 14 34
11.22806 34 -1 3 4 25 18 11 9 -4 13 30 10 11 1 13 7 -12 -3 19 49 0 14 4 19 -12 15 10 14 -10 13 46 28 15 19 8 3 14 41 -11 31 11 19 0
11.20669 0 22 25 20 19 16 0 9 17 11 -12 18 -5 -10 26 -13 27 4 29 10 9 28 8 19 -4 19 -8 39 -1 8 4 27 10 -2 44 -11 41 -5 13 35 25 0 -4
11.18533dL2Ml4j2L7j2pJ8mj7K6jj5J8jpj2%Lj5J1K0j6J4j2Rl5K5j9K6l5L0k9K8l5N8nKm0L3k3
11.16447DJ6oj5%K4l2K8j0K1k3j8KJ4j8J3K8m3J8LJ0k9L3k0J9k2J5pONj4k3M1k4K1k8LK8jj4QJ1
11.14361B4k6K1J3l2J3jmpJ3k9K3pJ0%lKpK3j9K0%j1J0l0mK4LPqnl4K1J5k1K2rk1L1k0MpK4qRk0
11.12072aOLK0k0J9k3%j1K1k4L9k2onQjNQPk0K0%Jk4K6l4J9rLnJ4Qk6j5K0J6l2K1KJ%J0k2j1L0q
11.09732HJmqJ5J0l6J6K0j5J1j4%J5J0l0JK3kl2K7rJ9j%rJ6k4%nL0j7%ok0J3J4pjj5rL8j6L0j3
11.07494B4J0k4Pj4J8j0k0J4KOj8NRK6l6j1OQmL2Nl9L0j1j6J0NMj7K5k8K%nJ7j5J0k4K0Q%j0QrT
11.05204iL5poJ0qj9J0lK5k0Qk6L9k3J3l1J2OK8k3KJ9k7L8m6J0j5QJ4%k0K4j7L5m7M1o8L9mpK1
11.03119A1j9L8k7k6J8J5LRl1J3j3K3j2Nj5lK5ll1K5L1j3j1j5JmQJ9j2oRk8K7j7J5oOj8K8MJ3k8
$$ plain form
11.18533 -4 28 32 -2 -14 23 11 4 22 18 1 27 26 11 29 28 21 9 9 12 -3 8 28 12 26 14 23 -12 13 -6 20 -15 15 -14 14 -21 37 32 34 -6 27 4
11.16447 4 20 14 -1 -1 23 -9 19 9 30 7 -11 -9 5 -13 0 28 -15 3 6 16 -13 20 0 19 -3 12 5 11 16 2 -21 20 -4 17 -11 -8 20 19 5 13 24
11.14361 24 -2 19 32 0 13 12 8 1 14 -15 8 1 11 11 8 10 3 26 7 27 27 16 26 -4 -8 16 19 26 18 13 -21 0 15 -6 16 7 -14 17 -3 1 -6 18 10 19 -1
11.12072 -1 5 8 28 8 27 4 4 -7 14 -10 29 7 1 -4 4 3 8 16 23 3 23 23 24 0 26 -8 11 2 5 0 14 22 -4 -19 1 17 -15 6 8 9 9 19 -3 -14 16 8
11.09732 8 9 5 -3 12 22 -14 2 22 7 18 4 4 19 29 -1 0 23 21 -11 16 7 26 25 25 16 32 8 8 3 33 16 16 10 -10 3 17 10 9 -6 -15 23 7 37 24
11.07494 24 34 10 17 3 21 11 -9 5 7 13 -5 0 9 35 -1 -12 -6 2 -2 30 35 -4 26 15 -1 9 14 18 1 26 -2 0 0 -5 12 -3 7 -17 3 11 11 1 9 0 -9
11.05204 -9 26 19 13 23 15 -4 6 3 28 8 16 -10 29 6 19 -12 0 6 34 11 13 32 5 43 -3 7 -8 0 14 14 -6 18 1 36 -11 30 -38 1 -3 -10 11
11.03119 11 -8 30 3 -23 -5 10 13 22 -9 4 -9 14 2 7 -8 -11 14 11 -20 5 36 23 12 -3 -2 -6 2 21 9 3 12 -16 11 -6 9 3 9 -9 19 23 36 8
11.00982HJk6N0l6K9l0J6rL8m4KK4k3Lk1O1l0K9n6L2npL5n5M1l8J7mJ2j5j0J7QK4k6j1LJ4Mj0TL
10.98846EOj5L6l6j5M1j6MJ8j5oj9K8Kk2J1K4m3L9o7O3k4J6k7L1j2J5nj4J1k7K1ljj6J4j0MK1n
10.96811A2K8l8j9J6JK2k2J8Ql0j0J6K1k4J5qRLOj9J2j1J7k2LTkrQK5k4Mp%Qk0K2jK2k3J2j8j7n
10.94572a8K7J2j0oj4J7mMNj7MK%J7j3Qj5KQl3M5k1K5l7J9K2k5nk0L2j3j8QM5%k8j3j8K7j5N6m4
10.92436bK8l6J6pKM0k3j6j9J6j5J2Mk2J9pQj5J7%rj4J3kK9k1J1k1JK7pj5%KjJ2%J3l7J9K1j5J0
10.90248A6k0K9l8J2PLJ7j7J4j4MJ4j9K1l4KJ6k1lJ3MoK4l4L3l1K6k0pRlK2qj1J1MlOj8Rj0J1J
10.88061A1j2%K8k7MKj2J6k1K4mT%J2Mj9J9k1LkTK0k5K7n6M5j0j8L8j8l1K2J4j5K3j5%K2k8J5J1
10.85975B0k4MJ8qTj3J9J7k1j8MK3j9oj2K0M%J6k0kj0nK3o%K2J3k8K0j4Rk2J5j5j8K2Mj0oJ2pK4
$$ plain form
11.00982 8 9 -17 33 -3 26 -4 12 3 41 -3 -1 23 0 3 -18 43 13 42 -14 18 13 6 41 -14 27 -11 6 2 14 -1 -11 6 14 38 12 1 4 18 22 12 2 5
10.98846 5 11 -4 32 -4 -19 22 6 10 28 13 7 -12 16 18 -4 7 31 -12 27 -40 23 -1 15 -12 19 7 22 17 3 14 -13 8 5 4 -12 2 -8 -4 17 12
10.96811 12 40 2 -17 -1 0 22 0 18 26 -4 -14 2 23 -1 14 6 15 18 24 5 17 6 23 1 4 7 5 -4 4 29 5 9 2 2 10 -10 12 11 33 10 22 4 -13 -18
10.94572 -18 9 21 11 5 -9 8 4 8 13 -4 0 2 2 19 6 14 -1 1 9 -24 21 0 25 -12 7 29 4 -1 -21 11 -2 -20 -12 33 33 5 -8 -26 1 -14 42 -2
10.92436 -2 26 -10 6 -1 1 41 18 2 -17 -1 -16 -4 0 -22 -3 -10 -2 -17 0 0 -9 -23 -10 -12 17 -4 7 -14 -13 14 7 -8 -8 -6 -7 5 5 18 -19 0 21 6 16
10.90248 16 -4 25 -13 -1 6 9 26 9 23 9 13 27 8 29 -5 -3 13 -8 -11 2 6 0 24 -10 23 -8 18 -2 -9 0 -3 19 11 0 11 15 12 18 0 9 -1 10 11
10.88061 11 -1 -1 27 0 4 6 -6 10 -11 13 9 5 5 17 21 2 21 0 3 1 -1 19 -6 21 -35 10 0 -18 20 2 -29 -7 7 -8 15 0 0 22 -6 9 20
10.85975 20 -4 0 18 10 2 -11 8 25 4 -14 -10 13 -6 -12 -24 -4 0 0 16 -4 -6 -16 -21 2 -4 -4 18 31 3 23 9 18 -4 11 -4 -22 0 4 -6 -12 0 -7 17
10.83788A7k0TL5kl2L3j5L0l0J5jj0j2K5J4l2K2qrOpKK0k8NKjJ0pKMLrk7K7nK5Rn9L0Qj7J7Qnp
10.81448FJ9n2M9m7N9l7j0J6L2m8K2nj8NJ0j0J8mj5K2rQj1PJ6l4K2j8j5J9K6l0MJ4J2k3J1J4m3
10.79464a8K8k2L0j7klOKPj5j0L0l1J7KJ1j3K1jk2pJ8Nm3M9j7%j5nQK0j3nJ1J4j5rJ2nj0QRj5j1
10.77225a6L5nm2OK4J1j3J8j2J2k1J6j0j8J5J9rj5K7k5K%TnJ6nJ6j1j2j1L1k1J2mkJ9j9NJj5j3
10.75140a9L6k7oL9m1K7k6J7LJJ3rqK0l7JOK9l6N5l9K2k7J7n7N3KJ3m4N0Jkl1L5m9L4k1M0k9Nk9
10.73054a8J9J1mj3K1l8K1pj3K5J2j5K8j7k4M3l0k7L0Ml9M7j1j0k3L4pJlK3l2MK4k3n%pL4nk1J4
10.70968Cj6JJ3LJ9Plj7j4J8m1L5L%l1J7K7m3jM0m6M1jk2%oMK1k6Rj2M5j0j5TJ9k7M0j0J4k2K2
10.68832B3k8kJ7Mj0qJ2J1l3N2m4PmRk4L9l2M1l6jQJ2l8L3qK8k3rJ0Rk1LKNpK3kLlrTnOoJ3j0k1
$$ plain form
10.83788 17 -3 -23 12 10 -22 11 -4 26 -4 11 10 0 -12 13 27 -5 17 9 0 6 -1 1 21 -7 -2 0 -1 9 2 4 8 11 2 -25 2 -3 22 31 -28 2 10 -7 10 18 13 6
10.81448 6 25 -27 22 -25 34 -3 -13 3 35 -13 9 4 -14 -9 1 -9 9 5 -10 12 3 11 0 7 23 -11 11 -7 -22 -3 23 -7 -3 11 23 0 11 25 -18
10.79464 -18 10 -12 18 1 -1 -4 2 4 11 -4 -14 16 -15 2 4 15 2 23 22 0 -7 11 16 -27 22 5 5 -10 -15 -7 13 0 -5 6 20 5 -4 8 3 -7 1 10 -5 -16
10.77225 -16 19 14 -28 -22 2 13 0 18 6 18 -3 13 3 -15 0 19 10 -5 22 -3 -1 -1 -1 -6 10 5 21 10 -2 -13 18 -3 9 5 3 22 3 8 9 -6 -19
10.75140 -19 17 -10 -16 23 -18 9 -17 0 3 4 17 8 0 20 -17 -16 -10 19 -17 38 -1 21 -6 11 -46 7 9 22 -22 28 29 27 -4 31 -18 16 -5 35 6 11 -18
10.73054 -18 1 12 8 -5 16 -22 -1 -8 -21 4 16 1 29 12 -12 31 1 -26 4 8 -31 16 5 -5 -28 6 -1 0 -3 20 -12 -8 16 -7 -12 -12 -19 15 10 -11 3
10.70968 3 -13 -12 1 4 23 30 27 10 -4 14 -27 8 11 11 -20 -3 24 -19 -20 20 -26 15 14 -8 -8 -14 -10 11 -15 -6 -18 27 17 2 -13 6 -21 19 9 23 1 23
10.68832 23 -5 -7 10 14 4 -4 8 19 -14 38 -6 1 -3 6 -18 21 -11 30 -6 -7 1 13 -25 8 0 28 5 -4 6 15 -6 -3 -1 4 -3 20 18 21 18 9 0 -5 1 -5 8 -2 -23
10.66441b3J5J8l1J7KK6l0LlRJ7Om3J7J1j9j0M6k0j6Qj3K5j3J3j9MQlMj6JR%K7l3L9m0L8l0rnJ3
10.64253@j0pj0N8k7j6K1jlnL0k3Ql2J0J7l5O2o8L3LJ3j2K8n0J3K0l2J8MjK3l9LJ2j2LnRk4M0k9
10.62117a3J7k0L3k8L4k0j3K0j2mj4K2K1l5J7k0K8j6K0j6J5L3o1K1pknPj1NMjKLNJ7l1RnpnK6j2
10.59929Aj0J2j3QkK5k5jL5l5J8l9J8J1QompqK3j5RlK1l0j8M2j2K3k7Nj4J7k4L3l2L0j5J2l6M6
10.57843B1l5K7pMTpj4K6j9LJ1j4qj0OK3rlmK1j2J4l6J1K1pk7M4m8M7j3pNnlj8L1k7OQK9k4pK0
10.55605A8l6L8J0j2k7K6j5qk3L7j1Qj9OJ6k5L2k4K3Mk6K3mj7lrK5p%lJ4k9K0jj3L3k7Mj4J6J5
10.53519A5j5qJ1%J3l0L1j7qL0k3KQoK3n1J3K2Nnpj1K8k4Rj5J8k0L0l4K3oOj2J7Ml3J4kJ3mnj5
10.51332a6K2qRMOKLk4K6l6L2k0Kj1K0k2rM1l3NK3j9olLj8J9JpOJj6K4L9k4qlJ0Ook3%j1L4k1K5
$$ plain form
10.66441 -23 -8 10 -21 -4 -2 24 -6 -3 -6 3 20 26 -17 0 11 -8 -18 28 8 -8 0 -13 12 -1 12 -7 -3 5 2 6 -10 -9 0 0 27 -6 33 -7 31 1 -8 -13 0
10.64253 0 -10 -17 -27 31 4 -12 9 8 5 0 30 7 15 -17 -7 10 -25 37 -31 2 5 18 6 34 -16 -3 17 -15 3 7 6 29 -10 -7 5 -7 -4 -9 0 -24 16 -13
10.62117 -13 4 -16 17 -11 23 3 -10 10 -2 -6 -20 2 23 -12 5 -15 13 -3 17 1 16 49 -12 9 2 0 -5 2 -9 -4 0 -1 1 4 9 26 -5 4 -1 -8 -13 13 1
10.59929 1 -9 3 -10 -2 -4 21 -4 -5 30 -5 13 -26 -8 3 11 5 1 -6 -14 9 -6 3 0 21 -9 -27 15 3 26 -1 4 -10 7 -17 16 -16 14 -1 11 -25 21
10.57843 21 -14 13 6 10 14 7 -7 19 0 3 14 0 -8 -18 -12 11 2 -1 -5 16 4 18 -18 -7 14 7 -20 24 -24 23 10 3 8 3 0 -18 13 -14 -8 0 29 5 -2 18
10.55605 18 -18 20 30 18 -9 17 2 -6 -29 8 -3 5 -14 -8 8 -17 15 -9 14 18 -8 15 11 -6 -9 -18 7 0 0 -3 11 -18 2 1 -12 21 -6 -2 -16 0 15
10.53519 15 0 -8 3 3 16 -14 17 0 -8 22 -1 1 9 3 26 -25 -12 10 15 10 3 -8 20 -4 5 -10 8 -12 18 -16 7 1 7 -5 12 16 -17 -3 -5 8 4 -1 -16
10.51332 -16 6 -2 7 11 17 19 22 -2 24 -12 20 0 2 -9 11 -11 -20 21 -12 -7 16 -3 -9 -12 -9 -27 -8 -7 -14 -8 -7 -23 1 40 16 8 5 15 21 15 -8 -8 -19 15 -6 19
10.48992A9j3lrJ2OJ3k1J6k0J7k3Rj7KJ0J5lj0J1qkKoJ8j5J1k3J0mrM4l9K5k3K7j4kj0KQj7J0k2
10.46804b6K0L5m0JnJ3pL4m1L3l3L0j3QNl2M7k0Qml3K1Pk6L5j1J0l2J6lOj6K0KNjm6L5k0K2J5k5
10.44668fMj0L1nl1M1k5lJ1k3J3J1jRrKj4J6j4pL1k8jQJ3j3lNj2K4Nj1Tj8J8qJ1mOK2lTj5MmJ4
10.42328A7k2M1k5Nj3j1Lj4J6J3j1lPMj1J4mj1J9l8K6m%k9N2l2J7km%KK0n0M0j5K9k6nK1k0K7n2
10.40191b9K9QJk9J7JJ0k6L5l7MkK8k9PK5k0nL2j8mj6K6k8M4k8K2j1jNm0K8JlJ1K1l3k8J0TL1l1
10.38055a2OJ7lk3K4nm%PQm9O6l1KlkKj6J6l8M9k2L9m1J7rNj8L0k0oLPJ5Jj2pJ6Ml4K2kNk4J0L7
10.35714B7j9j2K4qrj5J1%J6j6nK6l2J2J5j7Mj3L0m1J2Nj7J4TPk8K0J2j0j2K3j0pmJ7ol7L8k2J5T
10.33578A7l9L4j1Ol9M9k6Rj6J6OlK3j7orPRj0JJ6j8Pj5K7k1%jj6M9n0L9j2J0qJ1pk1K2l3K6kn
$$ plain form
10.48992 19 6 3 -6 6 12 25 4 20 0 17 -6 3 -14 -12 -2 13 10 0 11 3 1 3 -3 15 0 11 -12 -2 -6 -15 29 -10 15 -8 19 5 3 -7 -5 3 -14 -4 -26
10.46804 -26 -6 29 -11 -10 -15 -2 -9 25 -16 17 -16 14 1 9 14 -18 29 9 17 13 -20 1 8 -18 17 6 16 -16 0 -3 3 -13 7 9 14 13 -33 2 -18 4 19 -6
10.44668 -6 -2 -12 19 14 -17 24 -1 -4 7 -16 -3 8 7 16 7 9 -5 11 -3 -10 21 -7 -8 0 13 0 -3 2 -10 14 19 8 -3 -21 -3 -11 0 -4 2 24 21 18 3 7 3 17
10.42328 17 -5 36 11 16 3 -8 -5 -19 -3 10 -1 -4 3 7 -4 10 6 -5 14 -24 2 -2 -2 -31 21 -11 6 4 0 0 2 22 -28 12 -3 26 0 -5 16 -4 23 -29
10.40191 -29 0 8 9 -20 -3 -2 8 -18 17 -20 -16 -18 10 -19 -12 13 -7 -12 20 2 -2 -18 8 -20 24 -4 18 7 6 11 -29 -1 0 -3 8 29 -4 -32 -22 -12 19 -12
10.38055 -12 -6 11 8 -15 9 4 0 0 7 15 -34 32 1 3 0 -2 0 -16 0 -38 11 -11 28 -13 4 -5 0 -18 12 -8 -14 -11 -4 11 12 0 -7 9 13 -21 1 -1 4 -20 -10 27
10.35714 27 8 -4 20 12 3 -12 -1 -1 15 -1 -6 20 -12 0 15 -2 2 -11 19 -22 -10 -5 -22 -8 6 13 -15 5 17 7 -5 18 8 1 -3 14 8 -29 9 -13 2 17
10.33578 17 -22 12 1 7 -32 17 -9 0 -16 0 6 3 26 9 3 -6 1 10 0 1 17 -1 6 -9 18 -3 -3 -4 -20 29 -21 18 6 16 8 19 12 -9 13 -20 6 4 -1
10.31390aj7M3l2J3Jj8J5j1Jk3PK5lJ9m5L3Pk6J2mJK2l4J8PQk1J5Jj3%j3J5nQLK0j1Pl1rL2m2M0
10.29152A4j9KnJ1lj7M0l3NOJL2j4rTLPj1Ml5L5k4J9k6K5JRm8M8j3j7L2MK1l3J2k9MJ4j1J1Rj3K
10.26914Bj1L5j0rl7M6j7pkJ6j9J2%noLJ1Jqk3L3Mj6J6k6N5n3L5j9J4k1Pj0K8l2ojK1LJ5k8QoK5
10.24675A8rk3L6m3L4j7J3oJkJrL3m1K4k1K0Kj5K4rj9J7lqk2L5K6m3K0k4K5l%j9J5j2pJ9Oj0k4
10.22539b0J0K4k2LNJ0ok1K3k3L8n6N5k2K2l5J0LJTk9L3k4J6j1nK5oj3L1mk2K0J7l0pJ5oJ3j3J6
10.20453A6m8O2m0J5k5L0j0rLqK7k5%K1Qlk4Kj9J8KmJ0J8k8J6J7j5k1PJ3j0RMj6rK3nj5nKK3m1
10.18266c4K9jQk8N6m1J2Nj1k2L8%j5K1l6J1J4mj2k3L9j5K3n3J7lJ7J9Nj8j6K9j7J4mkTJ0oJ2k1
10.16180ej2K4nK0rRk2j0J0QoK4j5Ml3K6j3K9m1L7jj0j7KqL1k9%mQK5jk1J2k1K0j9K2k7qNK4lJ
$$ plain form
10.31390 -1 -18 25 -7 6 7 -11 4 -7 -6 -29 -22 3 0 19 -26 7 14 -12 0 -4 -3 19 -15 3 10 18 -3 12 13 0 0 -13 2 -3 5 8 28 17 24 -7 -16 16 -26 14
10.29152 14 -5 -3 -8 3 0 -17 23 -10 -5 1 2 34 20 11 2 5 12 1 5 -30 5 -19 0 -26 -1 0 9 -39 9 -4 -21 11 15 36 3 15 -14 -10 4 -7 4 13 0 2
10.26914 2 -9 26 16 7 -30 16 -1 -8 -10 6 -13 -1 -1 -6 -12 -9 2 3 -5 -28 5 9 -7 9 -17 38 -15 20 1 15 -6 1 -9 19 -13 -19 -20 1 4 19 -9 -1 -7 18
10.24675 18 9 -14 22 -21 13 -4 9 3 4 2 3 -6 27 -14 10 -11 9 11 -4 20 11 -8 9 6 -2 -24 11 37 -6 14 -10 15 12 12 -7 8 -4 -11 8 14 4 -20
10.22539 -20 -10 14 -8 -5 0 10 4 -17 6 -17 21 -35 20 -2 20 -15 -5 -2 -1 0 -29 4 -20 -4 -15 -20 5 -1 -14 17 13 -9 11 28 -2 -9 6 0 13 0 16
10.20453 16 -32 30 -10 5 -20 10 0 -9 -6 -14 13 -12 -12 9 17 14 -10 -8 -27 -9 -7 -11 -1 17 -11 5 22 7 -14 -7 6 -4 5 9 -7 -16 7 2 -13 -18 -16 7 -34
10.18266 -34 -5 -6 2 -26 30 -11 1 6 -5 -27 11 11 -4 17 -19 -8 6 2 -10 -33 6 -9 14 -39 -22 -25 -8 11 16 -2 -18 11 -6 8 4 2 0 10 4 16 -5
10.16180 -5 -17 7 2 22 13 22 0 -10 0 8 2 26 11 15 -18 8 -5 24 -17 20 19 9 -8 -6 -14 17 -12 -12 -16 -8 17 16 -5 7 -14 6 -13 9 -18 -26 -21 3 0 1
10.13942AJ3K0l6%j7K4jTpJOrK7m1PJ1Nlj9K1k9L1j5J2k2J1L3k6Kj6qL0j4K5k6L0rk4kM0l0J3q
10.11754@j9MJ5MPl0L3j3jj5M7k8TM5m4N3l4J0pJ9l1J3k2L7j0j2MJ4k4KJ0pj6L1Pk1k6K3K5j3%
10.09668BJ2j4j3J4j1K1j1K9k6Rm2M2j2Jj4J6j1J4j0j8K8Jpj3RJ1J9j5Jk3pQPqK3pKoK0k8L9l2
10.07532@j6K0j7jOLk1J7lLpqK7J2pjJ2l0J1k0J9j4Oj1K2JpNlTk5K0oJ8oJ6j6K3k5kPQj6%J8J0
10.05192A9j9j6J6k%lL1k0oNTl2QPL0j1l4J3k3M6l4K0J3j1rqKj1M9k4J1l0NJ7rJ4j7K9j7nj1K0O
10.03004A4k3NJ2m1L0J4j3K5n0K9j1L2l8J7rJ6K2l9K3l1J6MTmk1mJ0L8l9K0k1Pk5M5kj0kJrl6N6
10.00919A2l1L1k0J9n4N0j4M3o3M1j4Pj2nKTM5m8%JJ6Mj5J5k6K4oJ3k0K3m1M5k4J7k9qK7lk3K9
9.98884A0l4K7J8k8L8n4J4JOj4J3KLrJ9l1J0K5k2k%l2M6J6k5J6k8J0JLpLJ5j2j8J6PK2j6Nj0n
$$ plain form
10.13942 1 14 34 -2 -2 -19 5 4 3 -4 -3 3 -6 21 -20 -13 -2 3 0 -19 2 -27 4 -11 1 -21 -10 23 -3 -1 -17 -25 5 -9 16 -10 20 11 -13 -15 25 -5 8 0
10.11754 0 -19 -15 0 4 11 -19 14 1 0 -15 32 4 -24 21 -23 30 -4 6 -1 18 -13 0 -22 15 5 -7 -3 11 -13 -11 -1 -8 -24 7 14 -7 -33 -10 15 2 2
10.09668 2 14 0 -13 1 -10 11 0 29 3 12 -30 12 0 1 -13 3 -8 6 -4 -22 6 7 0 -13 -4 7 26 11 12 -11 -18 -10 -3 -11 12 5 7 1 21 -7 32 0
10.07532 0 -16 4 -13 -14 -8 -5 -26 -9 -12 -9 -16 -24 3 15 8 7 19 -11 0 -20 -1 -15 -9 -20 2 3 -4 1 -2 -5 -30 -10 -16 2 -4 12 -4 19 -6 -8 -1 7 -9 -9 9 19
10.05192 19 0 -16 0 -2 -2 -5 26 6 0 5 10 -22 -14 -7 23 12 -22 -9 -32 14 -20 0 13 2 -7 -15 -13 -24 25 1 12 -18 -13 4 -5 9 -8 21 4 -1 -12 8 14
10.03004 14 -9 -4 8 -33 -3 11 -2 23 -27 2 -9 23 -15 2 -7 9 31 -8 15 -16 0 4 8 4 -17 -21 -11 27 -12 8 -13 -6 -31 14 12 2 0 1 -8 -44 12
10.00919 12 -19 12 -8 11 -43 7 -7 36 -27 14 0 7 -5 -10 -8 -6 39 -9 -9 -8 8 12 -3 12 -14 10 4 17 -3 20 -21 24 0 17 -12 -20 7 4 -19 10
9.98884 10 -24 3 21 -7 31 -23 -9 -8 -2 -16 -3 -1 2 -7 12 -19 -9 16 -6 -8 -8 -40 6 22 -3 13 -15 -5 -4 -1 -8 -5 10 -2 -20 -4 3 25 9 14 4 -1
9.96747ak6L8j9J8m1J3J6J0k1K2m7K7JnL4m5J0J9Pk4K2j8K1j0rJ6NKk8J3j1J1Tk2J2Lk3%J4lT
9.94661a1K9j5Jk8L0j7J5pNK0k6J5Kn1L5mK7j6Nj9jJ1j3M4m8K9oNj1Tj5K0Lk0K3prK5j7J2j6l
9.92525a5K1kol0K4qK2j4J6J4k2qlJ8j4j2K1J3k1Nj2J9J6k6J5m3L9j4K3J0k4Mjl0J4J7k3K2j3
9.90541hK8n3K2Rn%jrL0l9J7opoJ9MNqLQNrOj8MkJ2J4j3J4mk8J3Rk8L6k1Rj6J2Tm0K8j6NJ3l2
9.88150c2K8J0k3kK9k5J7nJ0m2M4Kj4OqMnJ4j1nK5k2Omj4RTJk1J5K3j4j6K9nj7LJ0Nk8QJ7l5L8
9.85912A4k1PpK6m1L4j8J2j1L1k8nK4k2K2m7L6j7J6l0L0j1LkmOQpJ1J0k3PK2kl7QJ0jk8J7mK9
9.83775A7j9lj1K3rKpO%LNj9K7l4Rj0QK5k1J7k5K6j6N%J0j4J5rnO%pk1J3K4k5Qj5PJ4J1Nkj6n
9.81435gJ8nk1K5k3RPJj5j3K4KkK9l1J4k5K0k0lL4k3j5oL4lJ5ok5PQJ0l2K5k4M6m6J0MJ2Lk3K2
$$ plain form
9.96747 -1 -27 11 -8 10 -31 -18 -2 8 -13 9 -38 -11 -10 -15 19 -26 -16 3 10 -14 8 -10 11 1 -8 8 13 15 -13 0 -11 0 11 -11 1 4 -19 -19 -5 -8 -11
9.94661 -11 18 3 4 -24 6 -11 4 -3 2 22 -4 11 13 -38 -3 -7 20 4 9 -10 -11 0 -13 31 -17 12 6 11 0 -11 -26 -6 -3 -23 0 -7 -16 9 -8 4 -12 -15
9.92525 -15 6 4 -2 -32 -8 -16 6 -8 8 22 0 -8 -11 7 -7 -19 2 15 -6 -1 -13 6 22 -4 11 -32 7 -7 16 26 2 6 5 -25 -11 6 -17 5 -8
9.90541 -8 20 -33 -11 -2 -7 -7 -8 -17 13 -26 -9 -15 -22 -28 -9 -5 0 -8 -5 3 8 -1 5 -13 -9 -11 1 15 2 16 12 -16 -3 6 -22 14 -7 2 -14 -2 10 -30 -2 -18 -13 0 -32
9.88150 -32 -4 6 -17 -19 10 -15 2 -3 7 -35 9 11 -3 3 -5 -1 -6 8 -3 -8 17 -5 1 -3 -17 -8 1 2 -19 -4 19 5 -11 18 13 -4 -1 9 14 -14 -6 11 -24 14
9.85912 14 -7 0 -7 19 -22 12 -6 6 -5 26 -2 -7 17 -5 17 -30 6 -11 5 -25 5 -6 -3 -5 -9 -3 5 -2 9 19 -4 3 25 23 -14 -6 4 3 -25 -8 -12 17
9.83775 17 -2 -5 -16 7 -2 0 -7 -1 -1 2 7 -12 15 -19 -10 -20 -12 13 -8 9 -16 10 -6 -1 -1 9 -5 10 1 -4 2 2 -5 -26 -13 11 -14 -6 -21 -14 0 11 16 14 -2 -7
9.81435 -7 11 6 -15 10 -13 -4 3 4 -11 -24 0 2 0 29 -2 12 -13 7 -13 -16 18 -5 -20 -26 8 5 20 14 -11 -4 4 14 -18 7 -17 29 -17 -7 -3 9 12 -11 11
9.79248A1l3J3K2k4N0m9nTL7Mk8J2rL0l5K1k7RJ6Pj2Mrj3J3j0J0%kNTk3L9k9jLJ0j2J7l9N2l9
9.77111a4J2j0M3l8K3l3L1m3L7qL5m7J4ojJ3Jm3K2L1qQj1k2J0OqK0ol9K5qj0K7j3pL0k3J7jKl4
9.74974b6J3Tk0K7j7%K5mok7K9k2PJ1j3L4ok5PTj7Oj5L0Mk7OqL7k5j4K8Rrj8LOk1J6pj0J2J4K
9.72736Ij1Rj0oJ6qj3M4k5nK1l6MK7k7J9nJ7k7K9m3M8j8nj5K9j6qk3K4NJ5k9J6j3L4Pm6K6l0Nl
9.70599a8J7j3J3JN%omrK3%oJ2Ol3K9ol3K2Nj9J2J7j6%JpRjj0pmL6k0RnTJ3j6J3nJ0l1K9l4L1
9.68259Ej0lRQkk6J5J0Kj7J4j1J3Om6L9j1k1K0qL1k0qK6J0n1K0JKj9K0%m1L5K0j0pmJ7j4j1TL0
9.66072BJ1j0J7n4M2Lj5%KL4m6L0l8L0k6K2j6J4mTJ3k8J5mOj2QJ7mK2l8J1K1k1mRLmRj3%Qj5K1
9.63834A4o%nk0kJ0Qj2L0l4J6j7J2K1k9J3Qj4QMl%mlOk1%J5TnmJ4J1m5K4j6Lnj3L8j2J4l2L3j5
$$ plain form
9.79248 11 -22 -9 13 -11 39 -10 -15 -20 17 21 -7 5 -4 26 -9 12 -15 -6 10 17 5 9 0 -13 0 -10 0 0 -2 3 8 -15 24 -5 -6 -3 7 -5 12 -27 25 -14
9.77111 -14 -2 -12 31 -7 16 -17 14 -29 8 0 35 -12 2 -4 -5 8 9 -34 -12 19 11 19 8 -14 -4 2 -6 14 8 -31 -6 -14 -24 3 -10 -17 13 -10 7 6 8 -26
9.74974 -26 -13 0 -20 7 -10 -10 15 11 5 -22 7 -15 -8 3 -10 24 18 -7 0 7 -10 -4 -19 11 15 -12 -6 -14 23 -2 -16 12 21 12 -6 -3 3 -18 -2 -9 -19 -7 7 9
9.72736 9 -2 7 -3 -9 7 -1 -14 30 5 0 21 -15 -11 16 -11 8 3 20 -7 22 -21 27 9 4 -11 18 2 -6 -29 -5 0 15 -14 2 -11 23 30 -16 10 -20 -15 -18
9.70599 -18 -1 -14 -1 0 5 5 -1 -5 -14 9 9 3 15 21 -12 17 11 -22 0 5 -14 -2 15 -1 -1 0 -7 2 1 -9 -16 -20 16 -4 5 0 -5 8 -8 5 0 10 -21 8 -26 5
9.68259 5 -5 -8 1 9 7 -19 -4 6 8 -9 5 -6 7 13 -33 6 -5 -26 -6 -14 17 -3 -11 15 25 -26 -6 -5 -3 -22 -2 -2 -43 -8 12 2 -5 -9 8 -6 -17 -28 2
9.66072 2 13 3 20 -34 8 11 -4 -4 -2 32 -14 16 -22 8 -18 4 -12 2 -2 -6 7 -21 -6 -10 -4 -16 -8 9 5 27 -11 0 21 0 -4 5 8 4 13 0 0 8 -7 14
9.63834 14 8 8 3 -17 -19 -9 -1 -13 17 -17 -1 -18 -6 15 -14 -1 7 -7 1 5 2 2 -2 -5 1 -20 -20 -5 10 5 1 15 26 -19 5 -11 -8 -13 -26 12 0 14 -18 15 0
9.61544@LrJ2m7L2J3j4oLkj2K8KJ8k9L8m6nj0M7l4Mj2L2l7M7roj3QJ5j0oJ1j0jJ2jl0M7k5Nmr
9.59306a0J0Pk2J9noqJ5l2M5j6KqJ9mj4J6Pkj3L0k0k1j1QK9l4RNpK6l3J6j7L4k0J3rJ0k1J0pL8
9.57119B8k2K2pj7J0j0Lj6qKK0j0kORj0j5L7j7TOnJ2jJ7j5lMj3J8l3L5pmLj2J2MrQJ0k3J3j0L7
9.54829C0k2j0j1J3NJ5j9TM4l5K6j8Lk4LJ7nlK7j0Ql3K%L2m0L6l4L0j7J3Rk5L9j2l0J6j9J3Mm
9.52744eK5l6K1j4L4k5Ok8K5k7M3k5J0N%k4J3j4J4%M5o9M1qJ4nk4nJ9pJpMLm3N9l1J2k0K8Mk2
9.50607a3L8l0L5l4K2j8Pm9O1k7J8k8K4J4j0k9M2l1NoK1k9J3MPpJ6j7rJ8j2PlKTl9L0j4M0k9J8
9.48521A0k9J4j3K7Kk2K8k8j0K7%Tl5J9oK2j6K4ol1K3rJ1j5MJnJ2mKLnJ8j7MkJ0nlk0K0J4rj4
9.46283ij5K1MLk0RrN0n5L1j7Pmk9K8K5j7lj0OjJ2j6oOK6lj2jmJ6j1oPK0pl2L4l4L8l2%K0k5K8
$$ plain form
9.61544 0 3 -6 6 -41 -9 4 -10 -16 -13 -15 -27 1 3 21 -8 30 -16 -21 -31 16 -18 -14 -26 6 -31 16 7 1 -12 -4 11 1 -5 6 -4 -5 7 6 -24 23 -2 3 -1 -10
9.59306 -10 0 7 -15 4 -1 -7 -15 0 -32 13 -3 -1 -9 10 6 -8 8 15 13 0 30 10 -11 -22 -14 15 -19 -10 -5 -12 14 -19 -3 -20 14 -6 7 -2 8 -13 -3 -10 28
9.57119 28 6 28 21 4 14 4 7 -9 -17 -15 5 -5 -7 -1 8 -2 -17 20 3 -14 -8 -13 -1 -2 15 0 -3 1 -12 6 -27 8 1 -3 0 -12 0 4 -5 3 13 -10 3 -7 30
9.54829 30 8 -2 -13 0 5 20 1 -18 26 -9 17 -1 2 -22 -19 -2 -7 -10 17 7 15 -18 -16 -16 16 -24 12 -22 8 -9 4 13 -12 27 15 -15 1 -18 -5 -1 -5
9.52744 -5 20 -16 5 -9 25 0 6 -22 3 -24 19 -6 4 9 9 -15 -2 -16 -2 -2 43 -26 15 7 21 16 -8 -13 6 -1 0 -7 -3 0 -43 16 -15 -3 -23 5 9 -13
9.50607 -13 25 -5 30 -4 18 0 7 -42 19 -8 10 -18 6 20 10 -19 23 -8 -3 -9 12 -17 -4 0 7 0 16 -1 -10 8 -4 3 0 2 4 -35 -5 -19 21 -8 10
9.48521 10 -19 -5 -18 9 11 -11 17 -11 -21 6 6 6 -29 -10 -16 6 -10 14 8 -23 0 -9 2 -13 -9 -8 -13 -1 -5 -3 0 -5 13 -4 0 -2 8 3 0 -20 0 14 5 -9
9.46283 -9 -24 -3 1 4 -16 -7 -16 34 -21 10 -7 0 -4 -33 -5 20 3 0 -10 -4 -5 7 -9 -15 -9 17 14 2 1 -3 13 2 -4 3 23 16 -16 18 -16 22 -10 -10 10 -15 13
9.43994A3j0j6RqTK7l7K9KPj6K9k0Mj3mRJ6%k1J3j9J4j4J8oj7qJ3L5m0K0%J5k9J5j2PK1mk7L0
9.41857A7k3mJ6Jk7KK3Oj1lk9L5Pj0J6k2Mr%J3j3J0plKRlLpK2k2J0jkNKk1K3rK0l3OMPk7K7j2
9.39466hj9K3j8J3QNqJ0%l6L5j4qJ7Rk3nJ2jJ3%J1m4L2m%oJ0k4K0Lk8L4l4K9l7L3OJ6j8j4J0J4
9.37279A4j3j4J5jpJ5Pk1JOk1MOK2%l2K6pK0l3J3j8QK1k0j2K5k4K1j6J0K6l8lJ1Mk5J9K1j7Pk
9.35142bj7NpM9k0k8J8qQ%mJ3k6K8k9K2j6M0k3pjJj1lK0Lk8j0L1j4L1j9K9k4J1k7K4j4K1j6Oml
9.32955a%Qj2OK4n4K3J0nJonOJ9j0kjj6lOK4k6pK4J0j6mK6k2k1L0nj9K3mjK3l4J7m5K2L2j0lj9
9.30666a7J0j4J2rK6k0J5%MTj1jk2K7j1K1j9J1k7J7Oj2PLL1l5LlNKj4K6%j0k1L0l9J5K2j1kJk
9.28478bK9l0J2j7J3k1J9j9J8J1pk0j0mL5JTk4K0j0KOMj4OJ3rNj9nLK7j5%RrQmlmj6PJ9JmJj3L
$$ plain form
9.43994 13 3 -13 -4 -12 -20 7 -30 -1 1 8 -8 21 1 5 -8 -12 -3 13 13 -8 5 -14 0 -14 4 -2 -19 -27 -14 21 -19 1 1 16 -13 2 -10 -3 18 14 -13 17
9.41857 17 -6 -10 6 7 -20 -18 5 11 0 -3 -32 3 10 0 16 -6 -2 -11 -11 2 -11 -1 -8 -11 -9 0 -3 0 -7 15 -7 3 2 0 5 7 -14 9 0 20 -13 -7 -3 4 -23 4 -8
9.39466 -8 -27 -4 -22 -9 -1 4 -4 6 6 -30 5 -9 -17 0 9 -14 -19 -7 -8 5 5 16 -28 4 0 0 -6 4 -20 0 3 -25 9 -25 4 -33 0 6 22 4 -10 0 14
9.37279 14 1 -13 2 1 -6 9 16 -5 -4 2 -19 -15 -9 13 13 -19 7 0 20 -13 0 -18 -10 11 -9 -21 4 -20 1 -15 -5 21 -17 -20 -9 -5 -30 -11 10 -7 0 -2
9.35142 -2 -19 -14 -21 28 8 -20 -2 -10 -2 -2 -6 7 -19 9 -20 2 -14 26 3 -4 -5 -4 -15 -18 2 5 -23 -33 -2 -16 15 -4 25 1 12 -15 9 -5 16 0 6 2 -1
9.32955 -1 -1 7 -5 1 25 -29 -6 4 -1 0 -6 -11 -5 14 4 2 1 -15 -18 -12 12 -14 -21 3 13 -3 -7 19 -3 -24 6 1 -18 5 1 0 23 -11 6 -39 -17 15 5 2 -17
9.30666 -17 -7 -21 -9 -18 8 -12 3 3 7 11 0 -1 -23 4 -7 14 -5 6 -21 -4 2 -10 -3 0 31 -4 -1 -4 1 3 -11 15 15 5 -16 14 -25 -10 12 1 -1 0 -2
9.28478 -2 27 -3 9 -8 5 -16 3 -16 2 13 6 -14 -24 -28 7 8 9 -15 5 -5 -3 3 7 -7 -1 12 3 8 -11 -16 -13 14 -1 -1 8 -1 7 3 0 -4 -20 -13 6 7 3 4 -9 -6
9.26036fJ4j5kqK7j7L1l9K3j5KJ4J5j7j1Mj6OUjj1K2mMk8J4k1L3Ok9ML2l7J7oJ1j6J0knpnJ5oQ
9.23696@oOrJ5k7J7l1M9n8P2m1K8k0J8j5lj0J1MNk0OlL7l1lPQ%J1k5J5j5QqJ8j0J0oj5J4k6L9
9.21509A6k3JJ5Mk0J0lj4LJ3L1m4K1j5J2k0mNj7K5jqQPJ4k0K3j9J7k1noJ8j3RJ3k0Oj0K1j9J2
9.19372Bj3%J1Lk7J4nJ8jk3J0Pjl7J6M2rJ9k8lKJ6l6K0jNrK7Ol8LJ4kMK1qj8K8k8NTm3K7rL2l3
9.17032a5onJ6KL4k7J5k9K9j2J4k8kL7Jj2m3L5l0N6m3NJ2rj1TL0j6L2rj0j3J7qLpJ6rk0J0J6j5
9.14896a0J3pNj5K4j0k2K2k0J5k3K5j2J0j8L2lj5knJ7kj4J3jJ4j0j6JoLK2ql6L7NJ6l1J2Lqk0
9.12759b5K9k1LK1j8L5l2o%J0qJ3j0KrK7j6J4rJj6K0l2K7j1J9j1%J6k7J9k0Nj1LJ7K1Pm4LL0j0
9.10622FL0l7Oj1j2K9rk9J2MJj1K3j3K5j4K5n9N3m2L2l1J3J2j0Nj1J3j8OJ0Kl0J3K5l2L8k9QK
$$ plain form
9.26036 -6 8 -7 -9 -17 10 -7 24 -15 8 -7 -5 9 24 7 -4 0 -16 -10 -4 2 1 -10 12 8 12 -16 -2 -23 10 16 -13 -9 23 -14 3 -3 8 -8 2 0 -5 -12 -17 -2 -8 0
9.23696 0 -6 0 -9 6 -21 -4 -35 14 -44 28 -13 15 -5 13 -2 -5 -15 -4 0 5 -15 -9 -12 25 -6 -9 -2 6 6 17 -8 7 -8 0 -8 10 0 10 4 -11 3 -23 16
9.21509 16 -7 -6 9 13 -7 3 0 -14 -11 2 33 -11 10 -5 7 -13 -17 -12 -29 -4 -5 -13 -5 2 16 -4 19 0 17 -4 -9 -15 3 -10 -1 12 -8 -2 -12 9 -10 2
9.19372 2 -11 -11 0 3 -24 -10 -15 3 2 -21 -11 -4 -5 -42 -26 16 7 26 -2 -5 -3 13 -23 -3 -4 1 -8 19 25 -13 -10 4 2 6 27 19 1 29 1 6 11 -32 -5 -14 18 -15
9.17032 -15 -21 -26 -10 -8 26 -1 14 -15 14 2 16 -12 -14 23 24 12 -31 4 -26 30 -13 -8 4 -5 -16 -27 3 -13 19 10 0 -13 4 -4 -1 -8 8 -1 -21 -11 5 -10
9.14896 -10 3 -4 1 -14 10 0 -22 0 -20 -5 -28 -3 -15 -5 -23 9 6 -9 -11 -16 1 -1 -15 -2 -3 11 1 -15 -14 -20 -17 5 -3 -39 -2 3 19 -12 0 3 -5 -25
9.12759 -25 4 -17 -14 7 -11 24 -8 -14 -14 -4 -12 1 -9 -7 -16 11 -5 9 0 1 -15 5 -27 0 -11 8 -3 -3 13 -14 5 -15 -10 -21 -18 -1 20 27 -17 -14 16 6
9.10622 6 36 -1 5 -6 -18 11 2 -27 -15 -11 -10 -21 2 -11 14 0 25 -34 19 -23 9 -22 -9 3 -7 -2 -13 0 -18 -12 -2 0 -30 -17 8 -24 14 -15 -7 -5
9.08588eJ2k2K6n2N3k8L2n0N4k0Jk2NL5j9%Oj1NJ0j1k3J9MTk3K5J8l5J3j7J3mLJ1k5J8j4J8pK
9.06502aj2qL0qJ2jok6LK3k8j0M2Kj2n%pK1m1N7m7K7LrPqRk0lK1KrMj8J4j4OTj4OJ7k3J8JrMTl
9.04009cJ0l2K2OJ3k2J2j9kJ5oJ4j9OjqJ5Tj9K4m0N0l6J0mL2l7j4J5Pnj5J1Pk3K3J3j4k2ML4j8
9.01873aJj3qJ2Qm4L7J1kmLl4M1l0M0j5Kj5K9l9QmK8j6jj6j1K7qJ6%LoJlL%Lk8L8q%j2j7L7rj3
8.99482iJ8nj4L4k9RqQJj3KlK2rkj1OPj2k0M2j2Mk8M3j8j0k4M6plk3jMlL0j2j9L5l0kJ4Mq%J6
8.97142A0j4mQ%J5l0Ok6K3oPNK7j4j5OJ7k2pOj5K5K1j9%J4j0j4J2Lj9j1K1Pk3NJ4Ok9K6k2LK9
8.94954A6j9%MKj8K6l2K0k4K6J4m3N4l5Qj4K2l3J7Kj4K5l5K5j1K7j3%kpJ6rNMj5K0rJ1m8N3k7O
8.92817eNj1J2pjL5k5ok0M1k6k0M6j6J3j3K5l2J2Kk7PoK8k0J8Lj2Ppj2K4Oj2k9L1rjQj7k2J4K5
$$ plain form
9.08588 -5 7 -15 11 -41 12 -16 16 -34 20 0 1 -21 -16 19 0 0 6 -5 0 10 -1 -24 -5 -1 3 -20 5 23 -12 1 -16 -3 -7 -4 7 -18 0 -14 4 -3 -1
9.06502 -1 -13 -21 9 1 13 12 6 -20 -17 6 -22 -32 10 12 0 -5 -5 -12 9 -32 25 -22 5 8 -1 6 -2 7 -13 -16 5 7 -2 2 -16 -2 -16 -10 -4 -18 -12 5 -18 0 1 -8 -4 0 -3
9.04009 -3 7 -25 -3 3 16 -6 6 -13 -15 0 -6 8 -11 -5 -6 -14 1 16 -3 21 -19 31 -5 5 1 33 -4 -18 -3 4 -1 -16 -5 2 -21 2 15 1 -21 -17 17 -1
9.01873 -1 0 -13 -21 -9 -1 -45 -8 3 1 -3 0 -34 7 -23 17 2 4 -11 18 -21 -13 -17 11 -5 -6 -22 -33 -6 -14 2 2 5 -1 0 -3 0 0 3 -25 13 5 5 -7 -24 13 4 -9
8.99482 -9 9 4 -10 24 -5 4 -4 4 5 -8 -6 -9 13 4 2 -9 -3 4 -8 -28 14 2 6 -22 21 3 -7 -31 15 8 5 -18 -19 -15 -18 12 0 -19 16 -14 -16 -2 2 -6 -6 10
8.97142 10 -4 -8 0 0 15 -15 -9 -35 -12 -18 -11 -6 21 7 -8 -2 15 -7 -14 -8 -23 2 23 4 4 18 8 -6 6 9 -10 -21 0 7 -16 -11 3 9 -20 6 -16 -13 16
8.94954 16 -3 -3 1 3 -15 11 -21 -1 -25 1 15 -28 26 -9 -1 -15 7 -26 -9 -7 -21 4 -31 -6 -17 10 -3 -3 -5 -12 4 -5 0 4 -11 9 0 11 -37 16 -11 -5
8.92817 -5 0 -11 1 -6 -7 28 3 -3 -23 18 -8 -28 18 2 15 2 27 -5 7 9 -18 -11 -17 11 -9 9 12 0 7 0 -12 12 18 6 -23 8 -1 -2 6 -11 -33 -19 6
8.90630FOj9NlPqOj1L2l7O6o6L4l1J8kpQOJ2lJ1n1K7n3N2j7J2Pj6J7qJ9mlLrJ2pJ5j1J8l0K5k6
8.88341BL6J2rJ0Nm9J3J8j7L0j1j6KqmJ7k2lK0k9J6k3LJ1Oj2lK1k0K3k4K4l6K1k0J1J3j8J3l2K
8.86255b7J5K3%j6rJ6OqJ1l8K7%J5j7lkmnJ6pK4qk3Qk7O7o4M9m0J6j1K5j1J9l4K1mTj0L4l3L5
8.84119B2k1mj1L3m6K7J3k9J0J2qK9k8J5j5J6k4pJ9k0J5j5J4pJ1j8K2k5K8mKj6OJ1nj4J8k9M8
8.82135B5l5K9l1OTLOrMJjTrOj3K6l5K0J0rj3RK2j0l8K6K8k6J%jmk2K2oKK8k3K0k0Mk6L9j4jQ
8.79794Dj3Jk4M6m2PlM5k0j0%JL4m3J0nJ0%K6l2J1j7K6j5qJ8qj0Nk2J8K4k9K1qjpK1l7L2l8O0
8.77658B8l4Q%NJ6m6QL4l1L3l9K9l9K8k2J6MJ2pk5L4k5L2k2JL6k5k8J7j5K0mj5j7M6l7J9JMJ2m
8.75572Hk8K3LomJ9j8KqRl8M1j1mK1j8pJ6j8J7j9J5Qk1J8j2Pj4J3k3M1l2K3Koj0Qj5j9M0j7J5k
$$ plain form
8.90630 6 12 -7 -2 -5 2 -6 0 -11 21 -16 50 -16 18 -13 5 3 -4 4 10 22 19 30 -21 6 -47 5 -12 0 7 -9 8 0 19 15 12 15 6 18 11 26 15 33 3 28 2
8.88341 2 38 50 41 51 56 7 20 38 21 51 40 24 26 18 14 31 9 6 26 -3 13 -10 -7 4 10 -2 -5 16 -4 19 -5 19 -17 4 -16 -5 8 -10 3 -29 -27
8.86255 -27 -12 11 11 -5 -14 2 8 0 11 -27 0 0 15 -2 -5 -7 -11 -16 0 -7 17 9 -14 -6 -33 34 -30 19 -21 -5 -16 9 -2 17 -17 4 0 -4 -14 20 -13 22
8.84119 22 1 -3 -14 19 -27 0 13 -16 -6 6 -2 27 -1 14 -1 15 -9 -16 3 -17 -2 -17 -3 -10 1 -17 5 -20 8 4 6 -10 -4 7 2 -12 6 -23 25
8.82135 25 -10 19 -12 -6 0 3 9 0 4 5 4 3 -6 0 -13 13 -22 -2 8 -1 -14 -5 17 7 -31 -5 23 -3 -2 -2 -3 -7 -29 -7 -13 -11 17 -6 14 -6 -2 -28 11 -3 -4 4
8.79794 4 -9 -8 -32 14 -28 -21 -24 21 1 -9 -9 -8 26 -17 -7 -12 -2 -2 24 -8 3 -14 12 -3 -11 7 -1 -11 -6 -28 -10 14 -15 6 -2 -3 -10 11 -26 6 -32 28
8.77658 28 -6 2 2 7 23 -23 -15 19 -12 21 -18 11 -28 0 -22 -6 -2 10 3 -22 12 -13 19 -3 -2 34 9 -19 -2 -17 3 -1 -16 -33 13 -24 -5 -4 0 12 8
8.75572 8 -20 3 6 0 -4 15 -3 -1 -9 0 -38 3 -8 -12 9 -9 -16 0 -18 -1 -20 -5 3 -18 0 -12 -5 -19 -6 -29 12 -20 3 5 -1 -11 -3 -18 -37 3 -14 1 -1
8.73385aj8K2Ll0M5m1J1oOK7j5o%j5J8J5k5K1l8LM6k2kj9M1k1K1k0J4Nn%o%j7J5k2N3j6k9J9k2
8.71248a1J2Ok6L0jK1n2L7k2RKj6K7j1nk2J9J3oJ4j3rMNj5K0l5K5rOpK8k0J3j1pJ5k6L2j1L2m1
8.69112fj1J2K4pj6OlkJ5j4J4J0j2pnTJJ2rj0K8k5PJTLOqPlnRJm0L5Qj5oJ2j8J0NJ2k8J3pQNk4
8.66619b1L2k2M1m8L7l9N0m9J6jK1k4PTJ0j6J5j3%j4K5j3K6j9koj1J7nPK4k0oJ0j9LoL2k2rJ7
8.64533A2k8K2mK4l0J1pLMRj6jJ3Rj8N%Qk9J8lJ2j4M0n7M8l7OoJ9k2L1j8%K2k1j5L7k2nj9K7pL
8.62295DJ3k6NpL0j3J7Kj8k4O9n7L8o%jK2k7K4j1k0NK0Jk0K1MQj8KnK3qj2J8oj2K9K0j9Nk6L9j
8.60056H2J2qQK7JnOM7RL4j6L5M0POk3K1K7L2N4NJ4j0N2K2Q8Q4Q8J34J88K73L68M54P11P55
8.58276C622J190K224L505P58k363k017p44J72P69J022L16j210j305o53l94k69j95k06k50m63
$$ plain form
8.73385 -1 -19 3 6 -24 21 -20 -9 -15 -9 18 3 -3 -3 -18 0 15 -10 11 -27 -24 22 0 -2 -21 20 -1 20 0 14 19 14 14 8 8 -9 6 -16 37 21 -8 11 -11
8.71248 -11 1 7 -19 11 10 31 -21 16 -6 3 5 -11 16 5 0 -22 -3 10 4 18 5 -4 0 5 -10 10 -25 0 -9 -3 -10 18 -2 11 0 -7 8 -18 14 3 35 -6
8.69112 -6 -17 -5 19 12 -4 2 -1 -3 12 -2 12 22 10 3 -2 -7 -6 6 -3 -13 15 -10 -3 -2 -1 2 8 0 7 4 -1 8 9 -31 4 12 -3 -9 3 -15 -5 0 12 -16 -3 -10 -2 3 -21
8.66619 -21 11 -11 30 -18 19 -20 30 -19 -3 -4 17 -7 0 7 17 1 16 3 3 -11 14 1 27 8 6 0 -11 6 1 8 32 12 6 16 -3 0 -6 26 4 -5 12
8.64533 12 -16 6 2 26 -4 7 0 3 7 16 0 -1 12 21 3 8 8 16 -13 5 2 14 0 40 -17 31 -6 0 -6 13 -9 22 4 4 26 5 -10 27 5 0 -19 8 1 4
8.62295 4 17 -9 -4 -11 19 6 23 25 7 -17 52 -5 33 27 27 26 48 21 45 34 14 19 39 40 20 41 45 53 35 37 32 55 47 35 53 47 35 64 84 65 70 44 83 82
8.60056 82 94 86 94 121 122 117 123 170 179 213 197 232 272 279 285 262 283 310 342 396 401 415 405 457 479 567 651 739 873 1061 1334 1702 2156 2867 3622
8.58276 3622 4812 7036 10541 11299 8936 6919 6175 6347 7116 8138 8454 7244 5939 5286 4892 4623 4428 4222 3972 3509
8.57259C509n37n88o27n13l75k21j66n0o7m4o4k3pl4j3Rj7Ml4K3m6lk3Nj7J8qm3K6j7J8k3QoK4
8.55478G8m7Lj3K8Jj5J0l0jK7nk4L2j5%rqkoL9j5k4L2j6Kn4O8j8rj7L8j4k4K1k8M1k8J7j3LJ1
8.53392A6l0L0j2rJ8nJ3j3j6K2j3mL6l4K7k5MJ9k8J4oMKK5l5M3j0j7OJ5pOlJ6j8J0MJ6nj2J5qn
8.51205D6j8lK1j1J4j5mj0NkL5n8K3k9L0k1lJ2J3j1jK8m5kOK4j1nj6jL1lRl7M5l7K5j3lQK9k9O
8.49017B2j7N0k4KJ4oL8r9N6pJ8l3K2j3Qk6K7l1KTJ3mJ8l1J9qRJ3%pK8Ml8K5Jk5K1K0l1J9k3O
8.46881C4j6LQk1JJ0k4J3jK8n0K1mK2j4j8PmJ5rQl3M0j6J7j0J0Rk5K8l9J7Jk1J6l9K9L1lk7O%
8.44744@J6j7JL0j5J1Ol8L3qJ7m0J0KMlJ1k3KL2j5j2K2lk8K3k3K1l8K9nrQJk8M8k2Ok3J9J0j2J
8.42557Aj2OJ3rK6qj5Lj0J7JplkK4m3rL8rOkj2PK5j8J0KoLK3j9j2mJ7k6K0rmPk0J9Roj3K0Lj1j
$$ plain form
8.57259 3509 2972 2384 1757 1244 869 648 482 432 365 321 257 234 227 193 180 189 172 176 142 165 119 116 93 98 81 99 91 48 74 57 75 52 60 54 78
8.55478 78 31 34 21 49 50 35 45 15 14 41 36 12 44 29 29 20 12 10 4 43 28 4 36 20 22 -32 36 18 9 -8 30 16 -8 13 -15 26 -2 15 2 5 16
8.53392 16 -14 16 4 -5 13 8 21 8 -8 14 1 -3 33 -1 26 1 5 24 -4 10 4 8 10 35 0 43 33 16 22 37 30 36 33 49 31 41 45 61 56 44 59 51 46
8.51205 46 28 25 46 35 49 34 30 20 25 23 58 0 23 -6 24 3 0 12 25 14 13 41 -4 -6 0 24 13 8 -8 -9 22 19 28 -9 36 -1 24 11 8 16 45 16 22
8.49017 22 5 55 31 33 47 41 79 -20 36 29 47 14 36 23 31 5 32 1 3 5 18 14 32 1 20 12 21 34 34 27 55 59 21 46 47 22 43 63 32 51 28 34
8.46881 34 18 21 29 8 9 19 -5 8 7 35 -15 6 2 24 10 -8 -1 -5 10 1 9 -24 16 0 17 7 17 26 1 29 -10 7 8 -13 3 -36 -7 24 21 -6 0 0
8.44744 0 16 -1 0 30 15 26 32 -6 27 19 36 -4 6 8 12 9 20 -3 -1 31 16 4 26 23 -5 18 -5 16 -22 7 2 -7 1 2 -26 22 0 6 -17 2 12 0 1
8.42557 1 -11 -5 8 -1 25 17 2 5 -5 12 13 6 3 1 25 -18 -27 11 2 8 6 -6 1 26 8 18 20 14 17 40 21 9 5 22 -4 16 7 3 10 -10 9 18 12 -1 19 22 11 10
8.40115A0mJ5k5J9Kk0L8l0J3kRk7KkRLJ9j1J5l6j0L4k3K1L3n0J2QjkJ0plk3N3j4%m5L4qj0J9R
8.37928C4k8K4%rJ6j8J2Kj4KJ0j2L4j6jJ9j3L0k7Pk0L1j7L2j8K0JNJ9lK3j2J4TOTJ7j5L1LK8K2
8.35791B39K6J5N3OR9M8J53J40K19K91K96J80J17K06K92L75L07K47R0n0o1O9J10J29j55k33k56
8.34417B952j79j96j44j25k24j61k36j49k07j31j64j10j40q9j01n3r0k8l2l0m4L9l2QTL0ML8K9
8.32942D43M8O1J09J21J57K13K87L56K41J50J56L17L93L44J65P6m7n7K1J37N8j31k96k40k66
8.31670B816j56j66j57k15k08k41k20j45k12j15j80r6j39r3n4j03n3p7nl6jj9Tjk0nNTk0j8K3
8.30093G5j8Ok1Oj2J0J9l2Rn0N9m1J1Tj8J5lRj2lK4nmKpKj7K4k6K8j7J0Qj1J7Kj4qmkj5L7m8M6
8.27855D2KoNK1l6J7K3k8M4k4k2lJ3K4kj4klTqJ2Pk3NjmJ1j4j2K4J0l0L5k3qnK2k1Rj3lJ7k3J6
$$ plain form
8.40115 10 6 21 -4 15 17 -3 35 5 18 16 25 -2 0 -2 7 10 29 18 33 -3 -13 21 -2 19 52 2 14 22 21 19 29 22 19 -4 49 35 35 -10 24 16 6 25 34
8.37928 34 6 30 30 21 37 19 31 33 19 21 31 19 53 37 36 55 42 72 45 52 32 63 46 78 60 80 81 86 105 102 125 113 127 141 147 153 170 155 186 189 217 239
8.35791 239 265 280 333 339 438 486 639 779 998 1289 1585 1765 1882 2088 2380 2755 3062 3309 3399 3349 3288 3357 3467 3596 3441 3208 2952
8.34417 2952 2773 2577 2433 2308 2084 1923 1687 1538 1331 1200 1036 926 786 697 596 543 453 425 393 363 319 358 326 334 342 372 376 414 443
8.32942 443 491 552 661 782 939 1152 1439 1795 2036 2186 2342 2659 3052 3396 3561 3637 3590 3533 3554 3691 3749 3618 3322 3082 2816
8.31670 2816 2660 2494 2337 2122 1914 1673 1453 1308 1096 981 801 705 566 473 419 316 263 186 181 145 144 125 106 105 85 80 85 90 70 52 75
8.30093 75 57 63 42 48 36 46 65 33 42 -8 51 10 21 32 14 29 26 35 23 20 44 39 35 37 30 32 15 39 13 41 24 34 42 31 48 50 36 28 24 22 7 44 -4 42
8.27855 42 44 38 43 64 28 45 68 40 84 60 38 35 48 72 70 56 54 51 48 40 52 59 36 41 40 36 47 33 21 45 55 25 60 37 29 24 46 25 34 21 18 35 12 28
8.25617B8nK4k5kJ9J0l8K1k5J2j2rK8Kk9OLkj0K7k6J3J1j8J4j8ML1kTl7J8J2jPrkj3K1Rj2qJ9K
8.23378C6nj4oJ6k7jRQlj6J3mkRok8qK5J0onLJ9l6K7k8K1Mj4LpJ0L0k4PNpk1J9oJ1Pnoj7J2NK7
8.20937C4j3oj3K5m3L7j2Kj4Pj8OLk0K9J5j9J3k6%Qkj7K9Mk6KMK1k8K1%J4J2j5kj3JRk5J3J7l4
8.18749b0L7j9Pj2POK4j9Ll4K2j0K3mj4nK2qJ3j8QMj3%jKj1K3j3K7k3J2noJ0jk5QJ9l9L3QmKk3
8.16460gK5k1jPj6jM2l6QPl2RN9l7j7Pj2K9j2Nrj0K4k6K3j1J9j0rRPm3K3J9j4j1K4J2k0J4k5J1
8.14323CoL0o7L0j0K3LoTJ0jJnj0j3J6oK9k9M2n4L1Nj0J2nmOrj0J3Lk4K5l4K0J5K1l8n%K2k7J
8.12085a8L6Jk1j8QmRL5rm0M5k0J1l6PnL4m2M3l7K1jJj9K3%Ml0K2k2L2j3PJ3j9NJk2K7rJJ0J1
8.09898B2k7J7k9J3J0j9nJ8j5J4MlRj7J6mJ4j8J3k5K1j1J5j8J0lPjK9n9K8Lj2K7k0J1Mjj1J3J
$$ plain form
8.25617 28 23 47 22 20 39 49 11 32 7 19 7 -2 26 28 -1 5 8 6 -4 23 -3 10 21 3 17 -1 3 34 32 30 -7 11 23 22 29 20 18 5 26 35 23 15 34 36
8.23378 36 31 17 11 27 0 -1 8 16 13 -3 10 6 4 13 7 -21 -29 -4 6 0 -5 -2 17 -19 8 -20 1 5 -9 -6 -13 -3 27 3 10 15 8 -13 6 0 11 18 13 7 -10 2 7 34
8.20937 34 21 15 2 27 -16 21 9 11 -3 4 -14 -8 -5 -25 4 19 0 13 -13 -13 -5 -7 -24 5 9 -17 -15 -11 10 -18 3 3 17 29 14 12 -1 0 9 -16 -3 14 -20
8.18749 -20 17 -2 5 -7 0 6 30 11 14 -20 2 -8 15 11 -3 -8 14 6 19 1 9 13 0 0 -1 1 -10 13 0 27 4 16 11 5 15 14 -11 -3 16 -23 10 18 14 16 -7
8.16460 -7 18 -3 -4 3 -13 -14 28 -8 0 7 -25 -16 43 6 -11 -4 -16 13 1 6 -3 -13 11 -15 8 -3 16 6 -3 6 13 -30 -7 12 -2 -13 11 23 3 17 -8 3
8.14323 3 -3 27 -40 -10 -20 3 6 0 -6 4 3 4 -1 -11 -24 -8 -14 15 -14 28 -26 5 10 0 12 7 3 9 0 -10 3 6 -18 7 -27 -7 8 29 -9 -14 -14 8 -19 -18
8.12085 -18 18 19 -2 -20 -12 -16 -7 28 19 -21 24 4 15 -21 -14 -19 15 -27 16 -21 0 -1 0 -19 4 4 8 -22 0 -22 10 -3 4 17 -2 3 4 -18 9 0 1 11 22
8.09898 22 -5 12 -17 -4 6 -13 -18 0 -15 -1 3 0 9 -8 8 4 18 0 13 -12 9 -2 13 -5 5 2 9 8 37 -22 6 9 -3 24 4 15 19 18 7 20 21
8.07812B1J6j1j9J7k8K5k5L5kj3kPj0Kj7J4J1j9kJ2jj0Roj3L1m6J1Rj2J6j5M2j3jj1OJ8k6j5K5
8.05726A0J5l2J6l0J4L6K6l2Pj6qj3K7j2krJ0PRJ8j8mJ0l5NL5l8kJ8lpj0K8k5Pk2K0j8Nk2L8j2
8.03589iMk0J2J0Mjj0j1K1l4L0j3L3j2Nk8K2j9L0mk2J2k2K8k7J8J6l8M2l8J4j4K5Njlkj8pK8k5
8.01504a9LJ9LlMonL1l5K9k5K6l2RqJ1Kj0pk3J3L0j1nJJ2ql0M4k4K2oMj9L6l4K1l0L5m0K2oJ6
7.99316Gj8M%J8j1K2j8Rnk3QJ0oJ0k%jj3K2pmJ5m2J0Jj0L2rJ7k2J3j5ONj2J7k7j1J9MKk6J9L7
7.97078B5l4jqMlJ3J1oOj3j1QJ2lqklK1l5L2k2J9J0j6mQJ8k1j0J2k2K3j0Rk1J8Lk1K1J0k6L7k9
7.94891iM%KJ0k5J7j0J3j7J9k7OL2k0J3Qj8qK2N%j1Jj3Pj4pJ8mJ1K8l7L3j0m3K0J0Nj1K3l2R%k
7.92652bJ0MJ1n0L4nqQkLK%P%jj4mK5j1pJ6m8M8j5Jk3J4J5J3pjj2QL2m9M0j8J4l0J5j1jj0K4o
$$ plain form
8.07812 21 37 26 7 24 -4 21 -4 31 29 16 14 21 11 13 -4 10 21 2 0 12 11 1 10 4 -9 22 -24 -13 -4 -16 0 -15 27 14 13 2 8 26 0 -15 10
8.05726 10 25 -7 9 -21 -7 29 55 23 30 14 6 -7 20 8 6 -3 7 14 23 41 23 19 29 -6 -1 34 -4 -6 12 9 2 -8 20 -5 2 -20 0 -18 -13 -35 3 -9
8.03589 -9 -5 -25 -13 -3 1 0 -10 -21 0 -34 -4 -17 16 4 9 -19 3 -16 14 10 -12 0 -22 6 -21 -3 13 -25 17 -21 -7 -21 4 9 8 5 3 -15 -22 6 -19
8.01504 -19 -16 3 6 3 7 1 -4 27 -8 21 -4 22 -10 -1 -9 2 4 -6 -13 -36 -23 7 -4 -9 -8 4 -4 -34 10 -14 8 2 6 -13 23 -11 10 -20 15 -25 -3 -9 7
7.99316 7 -11 -7 -7 11 0 22 4 13 8 -15 -7 3 -3 7 5 5 4 -9 13 6 2 17 -25 -15 -14 -24 8 -1 16 -6 7 -8 -2 3 -9 8 -19 -30 -11 -7 -5 -31 -12 25
7.97078 25 -9 -10 -18 -14 -17 -4 7 1 7 -6 -17 -9 3 0 -8 -10 -13 8 -27 5 -17 2 12 -4 -8 0 18 -3 -13 -1 -23 0 -10 -1 -22 -4 -1 -22 -1 9 -17 20 -9
7.94891 -9 -5 -5 -3 7 -18 -1 -11 2 -15 4 -23 -17 15 -5 8 16 -2 -10 12 17 17 6 7 -6 1 -13 -20 -2 -6 5 33 -4 29 19 -24 -4 6 11 0 23 -9 0 0 -2
7.92652 -2 8 12 23 -27 7 2 -6 2 0 3 5 5 12 12 11 -3 -7 18 7 0 16 -32 16 1 2 -21 -7 8 21 14 13 1 9 41 -8 32 14 28 -2 13 2 1 -9 15 9
7.90363IJ4j8JPp%Tpj7L5k2K3j2Ol5K5J7rj0J0j5J9k2K9k6%NrK6j7R%J0k3J7j8K2k9J4K9j8L7
7.88226E0l6j3K3j5j1K5nk2J5NM%k8K1j3J9m8L0J1k5mlK3kjKj3J4J3m0K6J1k5pK3OQm8K9OK2l3
7.86090fk3K6J2j5N%Jj6nM5k4J0j3L2m7K0j7J0lJ1k9N9l5Qk8L3l1MJ8JlKnKK1l3J3k1N3j8j9K
7.83953cJ0TJJ4k9NRkk7L2j4rpJ0%Tk1K1mK5k7KJ7k3J3rJ5Rj9J7k8M2m3L0j8%Jj8J8k1PM4j8kl
7.81664GkK2okTPk5K1lk3L3nLOomkj8k1L7Pnk6L1ll2lM6l5J5k6JJ7K0l4M1k6K3m2L4l6L4nk1PT
7.79324FmoJ3N%j4Pj4J7j1%J7k1K0j0K3j8MJ0j4Nl0RJ7J8k6rJJ0rJ7j2JPk2J4QMk0%mJ9qJ3k3
7.77035a0J3j5K2k6J1LJ0jQj9KJ5j6NJ0K4n5M5j7NLqk5L3j5J4j7Qpj4K3l4L7jkj8%K6k4KL0l2
7.74898gK2qLj2J4j5J5l5L3j1oPj5K4l0K8nrJ1k2nM1qj0mK2j0J3j1OK3l8J7k2J2j3NK1l4K8j2J
$$ plain form
7.90363 9 23 5 6 13 6 6 6 -1 -18 17 -5 18 6 12 -23 2 19 10 0 10 -5 14 -8 21 -5 -5 0 -9 17 0 9 9 19 -4 13 -5 17 -12 2 31 13 50
7.88226 50 14 1 24 9 -2 23 18 -4 11 16 20 20 -8 13 0 19 -29 1 12 -13 -17 -20 3 1 0 2 -11 3 16 -24 2 13 -12 -19 4 10 18 -30 -1 5 27 -6
7.86090 -6 -29 -3 9 -6 -1 -1 0 -16 -21 24 0 10 -3 29 -18 2 -15 -5 -8 3 -26 33 -2 6 -22 11 -20 -16 2 3 0 2 -3 -1 20 -13 0 -21 32 14 -5 -3
7.83953 -3 7 17 18 32 3 8 17 15 -12 20 6 -3 -10 0 0 0 -21 0 -4 21 -6 -4 13 -10 3 -6 9 18 -1 16 -12 30 -13 17 -1 -1 0 -18 0 -21 -14 30 12 10 7
7.81664 7 5 27 21 19 17 24 -1 20 17 -6 27 22 25 31 25 21 19 1 -20 17 24 19 -7 24 21 -11 -14 32 -3 12 -14 -13 4 24 -10 31 5 28 -14 20 -16 18 13 -8 -1 6
7.79324 6 2 -4 9 14 14 0 7 -7 10 -1 -1 16 -5 15 5 28 10 14 24 10 15 -15 -6 11 29 3 -6 -5 5 -4 13 1 2 9 -13 1 9 13 -7 -7 -11 8 0 13 -10
7.77035 -10 3 -12 10 -16 -5 -2 8 7 15 -4 -2 13 -3 2 12 36 -19 26 9 14 17 9 -16 17 2 16 -1 7 0 -14 9 -25 12 11 9 -9 -9 17 -7 -5 25 -7
7.74898 -7 15 7 10 -2 12 -3 12 -23 10 -1 -7 0 -15 9 -21 7 2 -7 4 -18 -23 18 10 0 -4 18 8 21 10 16 39 1 18 -4 8 -5 0 21 -13 15 3 4
7.72762DMkK3j4TlpoK6rj0J7k7PK4j1J5Pj5LmKTj6j0KLnJ6j0jRJ7j7nmL2m5J6Mj3K3j3NRloJ7
7.70320A7k4M2l3K5l9L7m1J5J8%Tj9J5Pql6J8K3l2L1k7OKoJ0j3Qk0L0k7N2o1N3k4L3ok2Jk1N0
7.68285C4k0%nQMLk1J7%k4pJ2K3k7J0J5p%MK0nk1OjJ2l3K4l0P1n2J2mJ1k2K5j7M0k7J0j4J6pO
7.66097C9J1qKJ8KmNnJL3k5M1K1j6MJ1nJL0M4PO1N3O5J08J42K30K99J16K6J16K45K63J73J63
7.64317B267K37j2j20mJ64J31j02k23j76Tj31o2j08j18j43j83j19j21j10j17p7j11m9n8r1l8m1
7.62943C09l2M1k8J3j0J9OK8l0Q1K9M5Q9N4J53J99K42L71O21M15Q0N4L83O74M53R7K53J73j79
7.61468D603q8K06K83l4m01m12k79k97k10j84k06k85l52k70k71k46k24j52j94j28j43j57o0j38
7.60247C61m9o3rn2Qm2K9k4l5J1j1jPj9Lj9J6m4J0k%NnqnMJ7j4J3KjLK3j4J7nTOJ6j0K0lN3p0
$$ plain form
7.72762 4 8 6 29 15 1 -2 -9 -15 11 2 -8 9 -18 -11 13 2 17 24 9 12 8 10 12 -4 -14 -12 -9 -14 2 -8 -9 0 17 0 -5 -9 23 -22 -6 -2 -15 8 -5 0 9 6 0 17
7.70320 17 -7 35 2 27 -12 25 -16 -1 17 17 17 -2 13 20 12 -24 -6 17 -15 16 -11 -5 -3 -9 1 -12 -4 -24 6 -21 31 -30 23 -1 32 26 4 5 -16 34
7.68285 34 14 14 9 17 21 24 3 20 20 -4 -11 1 24 -3 7 22 15 15 19 39 34 13 19 18 30 -3 21 -9 62 10 22 18 29 7 32 15 55 28 38 24 40 33 39
7.66097 39 50 42 44 62 64 60 65 60 61 94 69 110 131 115 119 130 125 126 156 200 207 268 321 386 494 636 866 1165 1281 1307 1423 1668 1931 2104 2267
7.64317 2267 2504 2492 2372 2368 2532 2663 2561 2338 2162 1986 1855 1793 1685 1567 1424 1241 1122 1001 891 774 697 586 537 479 388 350 309
7.62943 309 277 318 290 303 293 312 318 346 316 397 426 471 560 614 767 966 1208 1579 2200 2615 2695 2749 3132 3806 4259 4356 4609 4782 4603
7.61468 4603 4515 4721 5004 4970 4569 4157 3878 3581 3371 3187 2981 2696 2344 2074 1803 1557 1333 1181 987 859 716 559 499 361
7.60247 361 312 249 240 188 196 154 183 159 124 135 124 123 130 111 114 95 111 67 77 75 75 80 75 67 62 66 83 69 82 84 83 86 109 95 112 107 102 108 124 114 134 131 184 114
7.58009A14N9%N2l7N6K8M2O7Q1P3J83K22L15M22K03j30q1J1J71L41M89L09k34m26l08q5J8P1P
7.56534B033p0k46j88j82j16j37p3q6q9q3q6j19p9o7l0k0k1K%K6NK8M8M1O1R7J19J88K33L56
7.55008A545N50K88j06j30M9K49M25O13N02j59m66l56r8P7K33K44n1m14m21k73j94j06j07Tj81
7.53736A606j93k03j93j25j37p2q9p4o7o4m4m1m0l3MqJkL2l0L7PK3J7N2J07P4J76K66K89j7j15
7.52108A144q1N6J48K74K78Q4k52k91r7p5L4J3Rj37j27j12j44n8p9l4q0o3m7p4l7n9m3k0j9k3N
7.50531I3nl1J5K2l4j7j0L6k6J7j5J4l3J6J7j0j4RQk1k9NrK2J8qjk7L7k7K5l7J7qLTPMJ1j6oOJ
7.48343B2J0Pj6J9k0Nk5K7%J0rRll0K7rj8K1Mkk1Mj2K3qQj4K1k5K6Kk3nT%J9j2noL0k6K3jk3J%
7.46003@K4k6OJ7Ok3J2j6L3k0j7K0%J5l2K0j0mJJ9j4PJ2k9mJ1J9pj6mK2j3K1kk5NJ5k3Nj3J8J5
$$ plain form
7.58009 114 173 173 225 188 244 272 314 381 462 535 718 940 1255 1677 1880 1750 1669 1680 1851 2192 2681 2990 2756 2330 2022 1937 1955 2026 2033
7.56534 2033 1963 1717 1529 1347 1231 1094 1021 935 846 763 677 558 479 412 382 362 341 343 343 369 374 402 450 491 552 649 768 956 1189 1545
7.55008 1545 2095 2383 2277 2147 2196 2445 2870 3483 3985 3826 3360 3004 2906 2983 3216 3460 3409 2995 2574 2301 2107 2001 1894 1787 1606
7.53736 1606 1413 1210 1017 892 755 683 594 520 453 389 345 304 264 231 235 227 228 226 258 228 265 272 295 312 364 471 545 721 987 1276 1259 1144
7.52108 1144 1063 1119 1267 1541 1819 1903 1651 1360 1263 1188 1222 1235 1244 1107 980 868 724 666 587 553 473 410 363 289 252 193 150 130 111 88 93
7.50531 93 88 57 72 94 60 43 33 69 43 60 45 59 26 42 59 49 35 44 52 31 2 7 -2 20 38 30 29 2 39 12 37 0 17 9 12 15 22 26 37 21 15 21 22
7.48343 22 32 39 23 42 22 27 2 29 29 39 30 39 36 6 33 24 6 27 31 29 8 12 0 23 15 23 9 30 5 31 33 10 5 0 0 19 7 2 -4 26 0 23 22 -1 0 0
7.46003 0 24 -2 4 21 27 4 16 0 33 13 -4 16 16 31 -1 19 9 5 6 25 11 18 30 1 -3 8 27 20 4 0 22 9 30 28 3 8 23 0 5 -8 10 25
7.43867B5j9j1lM4l7LjrL0j4J0k7L1m8M3k9M5l2K0k4lLrK0mJ0j3Kj6QM0k6JK0j6j3pJ7RjqLPmQ
7.41578B5j9K0j9Lj0J9m1K7J4j2rJ0kJ0nKnMLTk4K1j4nlM3k2Oj7J6j1J8J5m2J8pj0PLK3j5oLP
7.39339B2k9L0k6KMqK2k7L9k3%k2L0j3OlnL4l3%j2J9k1QTJ6mjJ4j4lj5nlJ1L1j9NqNMj2M3m9J8
7.37050A6MOk1K9j3J6k3L8k9lqJ9k6J2T%Mk8K1j0Rl8M2j4qrL5l2LTj2L6k2J1j8Jj3L7l3K3j1kM
7.34863HJ2Mk0N6n0Rpk2L4j7L6rj8L0k5J4j8J6j4J1j2j9N5l3J5m8O1j9j6NJ0j6J9k0jJ9k3nJ6
7.32879A8J3kTK0j9k8J2%RLk1NKP4o3L9l2Mk0K9QMJ5k0K6k4J6QJ2J1mK0j9QJ3J7J3k1K7kM4J1
7.30742B04K8N8Q5Q6R0J62K36L38L08Lj43q1O2J74K65L88L06j53m12k19r6RK4L3m8k10k16j22
7.29318A159j16j03p0n7m5r2o7p5p4n0p6K6m2J2J4NlL4L3L1O8N7J34J09K28L61L39N6m8L5K09
$$ plain form
7.43867 25 6 -5 -8 36 -1 2 1 -8 22 8 18 -9 22 -26 17 -12 33 1 21 -3 -6 -3 -12 8 4 14 1 3 -13 -5 35 9 10 30 14 1 -6 11 20 19 11 14 21 17 25
7.41578 25 6 26 7 10 0 19 -22 5 19 7 -2 8 6 16 11 13 8 12 15 18 -6 15 1 -4 -7 36 14 20 3 19 8 26 41 -1 17 10 0 7 10 33 18 12 15 22
7.39339 22 -7 23 -3 -1 3 -5 17 -10 29 6 6 -16 14 1 7 4 -1 33 0 0 -12 7 -14 -6 2 18 14 13 27 13 10 -5 -10 -13 -2 29 10 15 7 12 16 4 47 -2 16
7.37050 16 20 26 5 34 21 37 14 52 23 20 12 31 5 17 29 29 33 5 26 16 25 -13 29 15 7 -2 33 1 4 7 -5 31 9 20 2 3 -10 27 -6 17 6 4 8
7.34863 8 20 24 4 60 10 19 12 -10 24 7 43 34 16 46 21 35 17 33 19 30 18 -1 54 21 36 -12 49 30 14 19 29 13 32 12 11 30 7 2 18
7.32879 18 31 29 27 47 28 0 12 12 21 24 3 8 10 84 21 60 28 32 12 41 49 53 68 48 74 50 66 74 86 97 93 113 94 102 115 132 145 124 151 149 193 204
7.30742 204 232 290 375 461 551 713 949 1287 1595 1598 1455 1374 1436 1610 1875 2263 2569 2416 2004 1785 1689 1698 1722 1755 1707 1497 1281 1159
7.29318 1159 1043 940 870 813 768 676 609 534 460 410 334 360 318 330 344 349 346 380 413 444 512 569 703 812 1040 1401 1740 1796 1748 1783 1992
7.27741A992M30M96N10J11k14l29m9O5L06L90K00m37m81l24j97o8n2n8k05k59k21k02j72j73r5
7.26469I64j14q4p0r9j16m9p8l7k9k3K6l5K1j9P1l1N0N2Q2O2J26K40L38J95j03j58j5P3J57K65
7.24943A662L05J17k44l04j40r3K2K5Pr7j77j50j28r7r9m1l8m7q3m9q8m3o9k7TRk3lj2Mk8L6j3
7.23264F7j0%j5pK1j6J4k2LRk1J8l0M0k7qj2K5mj5Jj0J4j8K5k9L1j6RoK2l4L9l0J6j3Qj5M9m4
7.21229IM3l6mKJ3J9k3j4M0l1jJ1k4J5Qk7L5kj7k3K7j3OJjK2m2QJ2J9l2J1j2J8k0j5M8n3L9j5N
7.19143FkJm%J5j6K3l6K0j0J6mJ5%qOjrpK3m7L7k1J5k6K3kRLRk8NpK9j1j4J1j2RlK0kk4j0RMO
7.16752A0k1OJ8jnlJ3J1k7lK2kjnJ2k2J6qJ1k0PmMNnKj9K8l6J8j4JJ9noJ9joqL1k9L6k1J0m3K3
7.14412GoJ9j3pLkpK7Ok4Rlj1K1k0J7l6L7j8J5j3j7J1J7j8L0k0jl3O0l1L6ll2J1ok2J7l1N4l0k
$$ plain form
7.27741 1992 2422 2918 3428 3539 3325 2996 2947 3012 3318 3708 3908 3471 2990 2666 2469 2401 2349 2291 2086 1827 1606 1404 1232 1059 964
7.26469 964 850 766 696 597 481 432 354 317 288 265 291 256 277 258 329 298 348 400 482 544 670 910 1248 1443 1340 1182 1167 1240 1397 1662
7.24943 1662 1967 2084 1840 1536 1396 1303 1325 1350 1357 1260 1083 933 805 708 609 568 530 483 400 351 263 220 151 124 97 106 83 80 68 72 44 80 67
7.23264 67 57 57 42 35 56 40 54 32 35 44 23 41 11 51 24 16 4 29 25 10 11 1 15 -3 22 -7 24 8 17 11 33 -1 38 8 24 11 19 4 53 9
7.21229 9 52 16 12 14 27 46 23 9 49 18 17 28 4 19 27 0 35 33 16 -7 20 7 13 14 13 35 -7 1 13 32 0 11 -1 17 -3 -18 30 -23 16 1 6
7.19143 6 4 5 1 1 16 0 23 -13 7 -3 13 9 24 24 16 22 21 12 5 28 -19 18 -3 12 -14 9 7 16 19 28 0 5 -2 27 16 2 13 1 10 7 27 25 1 -9 0 4 10
7.16752 10 -11 -5 13 12 7 4 17 28 1 -2 20 18 17 12 24 2 18 10 21 1 8 4 8 13 8 10 -9 19 -17 1 -13 -12 7 2 -4 15 14 8 0 31 2 38 17 27 -16 7
7.14412 7 1 20 7 0 3 1 -6 21 27 3 12 9 -2 19 -1 16 -20 17 -1 14 1 -16 -5 12 -6 24 4 3 -30 30 -1 35 32 0 11 5 -17 0 -31 23 -7 -9
7.12276ilK6j0K3m0JJ2RJ0kk9K4oOj5k8M1j3L8m4QK3j3l6N7k8K2r%lJ9k4k6K5Kj4J6j0QqNpJ4l
7.10037Ik6L3j5K0k2Pol1K0L2m8J9QJ8k5J1j6J6lJj0K0lTj1NrK4j5mj3J8lmJ6qJ0J2k3kj3L7j6
7.07850GPMqpoK9j7qnmjqL7kJj5L2m0K4n8N7k3K0j3Rj7jK1k4K7l3L4n2L5k9RQj7N1k2jj1L3l4
7.05612a1J8j6J2mj2J3J9kk7J0NnNJ3j5J2j8Jk1J1RJ7j5jj0J9Rj2nJ1j4K1k1QjJ5j5J2k3QRk8
7.03475a9J9pPnP%kJ9Jj6MRqPRj7JrJ6j6J2nTLRj2rK4j8L1m4NQm%jJ0OJ1Mk0pJ8kj4rJ6J9j6Mj
7.00881A3qmL0k2NJ3l3J4K7k2OoNRk1mjJ9k9J9j1K4k1J0lj0RjmLJRk9K4l0M1k3L5m1J0J8j0k3
6.98693a2J6j3RJ4%j0OrJ5j4MoJ4Kj2J5j4Qj2J1ml2M9k5J3k2M4m8NOJ2Mk8K3mJ0k8K9o0L5J2pJ
6.96506cJ8Kk4PnJ8m1L3KPj3j1j3K4jj0J6J8l6K2Mrj3J0NPj7K2l3kTK0k1oN4l9J8ql2L3J2j5N
$$ plain form
7.12276 -9 -12 14 4 27 -13 -12 0 9 19 17 -12 12 6 12 -3 -31 10 -3 35 -9 -1 22 9 -27 30 2 24 15 15 12 31 7 -19 6 8 -6 10 0 8 0 5 -2 12 9
7.10037 9 -17 16 1 21 -1 6 0 -31 -11 21 -27 -8 0 18 -7 4 -12 4 1 2 -8 12 9 6 -5 0 -9 15 0 -4 -17 1 -2 -6 10 2 12 24 1 -1 -14 23 7
7.07850 7 14 18 10 3 -3 26 9 1 -4 -8 -9 -17 20 18 19 4 36 -4 20 -38 19 -4 16 3 12 -5 -6 15 -9 18 -15 19 -33 2 -27 -18 -10 -27 24 2 1 -10 23 -11
7.05612 -11 7 -9 3 -1 -13 0 19 17 -10 0 5 0 5 18 3 15 -3 -2 -23 -12 -3 14 -1 -2 -12 7 16 4 -1 10 -4 17 -4 4 3 18 3 15 -8 0 9 -19
7.03475 -19 0 -7 0 -5 2 2 0 19 20 4 8 17 9 16 25 8 9 0 16 0 12 7 2 5 14 2 -7 17 -1 30 -14 -9 -1 -5 -5 -6 4 10 21 25 5 -2 16 14 0 -9 7 26 10 14 13
7.00881 13 5 1 31 9 14 27 -6 8 35 13 19 13 18 27 6 2 1 20 -9 10 -1 23 2 12 9 -1 8 7 3 6 7 16 -13 11 -19 22 -1 34 -7 3 21 11 -12
6.98693 -12 4 -9 0 14 14 4 10 1 16 2 6 0 14 16 4 19 5 13 1 12 8 -24 25 0 13 -9 35 -13 -8 -2 10 14 -14 9 5 15 -13 16 -44 -9 3 -4 -3
6.96506 -3 15 17 -7 0 -5 13 -28 5 7 14 1 -10 -23 1 0 -10 6 24 -12 10 14 5 -8 2 7 14 -3 19 -14 -16 -18 2 -19 -25 29 -10 8 0 -32 1 13 -2 3
6.94318Ck0J0K1ll9J3kJ7Kk3J4J5ojNJ1j4lPjk6OPTln%J2njKroLNqLJ2nJJ6l9K4Tj6j2J3j5j0
6.91826a9K5j9J3J4npJk7M4ok7RM%oJKJ8k7J1mMJ2l4RK2Rk9K0Mlrj6KTPJ3J6m7K8oOJj4kJ3mj6
6.89384a7N0l9jj0K0j2lLJ1j4J4j6LKOKLJ5ql6K4L0k7oKMJ0j1Pj8K5j3j0K5k0K8l0J3l0L7k2K5
6.87247A6l5J4lj3K3jpQmKj1J3k3RK1k5K0j5J8j4mPqj5L6kj3pJ1Pj1LkK1k6JTKLoJJ6qTkJ5ok
6.84805ck2K1PqjPTJ0k6l4L3PRj8K2k8K5k2K8j5J9Kl7J3J6mk3K4j8KLOj7OPKTk0ONkRqJ0j6K8o
6.82414HMj2J2nj8NTJ0Ml8L4J4l3OMmJJ7pj9L7k5j4K2jj5J9j9KLnjkOJ8Ml7L3j0j5K1m1P4n8L1
6.80125A5l0J5Mj1K9m6M0jrj0J2j7J3oNjk5K5oK4l5K0nKK0j1rOj7kJ1J5j1J4j2j6LTmJ2rLj5L
6.77887a4K0K1k6KoTlTL0j4rK3k8%K0j8KJ9k7N3m6J0pJ6Kk0PJ9m3L3nj0K3k3J8Qj7Lj2KJ5j1j5
$$ plain form
6.94318 3 -17 -7 14 11 -28 -15 -17 0 2 -21 -7 8 2 1 6 17 3 0 7 6 -20 -14 -7 0 -3 -8 -8 4 -1 -2 0 -9 -15 -12 -7 -15 -12 0 -5 -4 12 -27 -3 21 5 -7 6 -9 -19
6.91826 -19 6 -13 0 14 9 2 3 -24 20 14 -13 -4 0 0 -6 -5 -3 15 -12 -1 -5 -1 11 -23 -14 8 17 -12 8 12 9 0 -16 -14 -12 -5 8 24 -23 5 -1 5 6 -8 -10 3 -1 -17
6.89384 -17 33 -6 -7 -17 3 -9 -12 -9 2 -12 2 -14 -11 -9 -3 -1 2 17 9 -27 -3 27 0 -6 -4 0 10 -1 6 -12 13 0 -10 15 -5 23 -7 6 -24 13 -9 16
6.87247 16 -19 -5 -8 -21 2 1 -6 2 -2 0 -11 2 -21 -12 9 -16 4 -11 7 -7 -11 -4 -12 -27 9 7 -6 -13 -2 5 -6 -3 -5 16 -10 -9 -8 -6 -3 -9 -8 8 0 -8 -10 5 -1 -3
6.84805 -3 -25 -4 3 -5 -6 1 8 18 -8 -42 -9 -2 7 -11 11 -17 8 -14 14 -1 18 20 -17 -4 12 8 -15 9 -9 -7 -4 2 -15 -9 -2 0 2 -18 -12 -7 -9 0 -8 2 -14 14 8
6.82414 8 12 0 12 7 -11 -6 -1 9 13 -25 9 23 -10 -4 0 -4 -3 14 7 -12 25 0 -14 8 7 -8 11 -8 -6 -3 -8 -9 -11 -5 13 17 -20 13 3 -12 9 -32 42 -16 15
6.80125 15 -15 0 4 -7 22 -24 16 15 6 -4 8 -9 4 -2 3 2 -23 2 -4 20 -15 5 0 2 22 11 2 8 -9 -11 0 15 4 18 6 -10 -7 -4 -8 4 -5 -2 -17 -14
6.77887 -14 6 27 1 3 -3 -9 -12 -15 15 1 -8 15 -13 -13 7 -11 -9 10 -17 36 -10 0 -7 9 11 -9 -2 17 -26 7 2 -8 15 -8 10 18 1 4 -8 -6 9 -2 -17
6.75699a7K0j8NQoK1rj2NTRj5rJ1RQrMj4J8k8K2J1k9K8j1Nj2K6k9qN0l8npMoK2l7M1l3J9mK0P
6.73410B2j7oQp%lNJ6nj3lJ6J7m3J9qKk6L5KpmJ0qkK7k2mj2K5j4MLKrj0jJ3jmJ8k2NKlL%MLl3
6.70867b6K6oOJ3kpj7K0j5J5oTkJ1jqrNrJ8lrL1k3J4j6J3lrj8J3J8j3j0J2QJ1j5Qj3Ooj3J7oO%
6.68476@LKoQj1J6k4J9j3pqK0%K1j6LOj3rM3m0J1l6M7j9K0m0L0pk3K3k0OjL6m0K1j3J0%K5k1T
6.66288a8J7J1j9Kq%M5m2QJJ1k5K2j1L%qM3o1M9Km7JJ3OJ4j8mJ7QLk8PJ7%lk0J5l1L3j4J3mnM
6.63999aj3NJ1mrJ2K7j2k2L0k6J3j6K8k5j4PJ0nNk0K8j3K0j5j3jJ4K1k2J2k6J4J9l7K4k0J4Nm
6.61964Aj6MK2oKk9K8j0j7K6njk2mK8lmj6K2Jj1j2J0Rj7K7j5pJ6jj5J4rL3l9jJ5%j3mJ2K7j8j2
6.59726a0QJ3j9k0J9J2mJ8j4rQqlK3k8M5l7K2j6J5Jq%k0J4j3J5J8l3L8j6lj3J4lK%j1mqOJ0j0L
$$ plain form
6.75699 -17 3 -15 -10 -2 -8 13 4 -8 -3 2 11 -4 -13 -2 7 15 6 10 -4 14 -14 8 19 -10 18 7 12 0 26 -3 -11 39 1 -4 -11 -7 -13 9 -28 13 -20 -1 -5 15 22
6.73410 22 5 -1 7 0 0 -3 2 18 13 0 -3 13 30 -13 6 -2 0 -26 9 11 4 0 10 2 0 27 5 1 -11 14 0 4 7 9 0 -10 -11 2 1 -3 15 -7 -2 0 -3 0 0 4 7 -26
6.70867 -26 0 -6 0 13 11 4 -13 7 -8 7 1 -5 -7 4 3 -5 -14 -9 -18 0 -3 -12 19 -4 10 -6 7 4 -5 -23 -10 8 -5 -15 -3 5 16 1 9 -4 2 -4 -17 0 -6 0 0
6.68476 0 3 5 -1 7 -4 12 -12 7 -6 -13 -21 -1 -1 20 4 7 13 0 -9 34 -6 5 -31 16 -3 17 -23 7 0 -23 0 -20 -14 -15 21 -19 2 -11 -1 -1 24 3 -18
6.66288 -18 -1 10 -9 -7 -15 -15 30 -12 -4 -3 8 -17 5 -6 -3 -3 -11 32 -29 20 22 -25 -24 -11 -5 9 -9 -13 4 12 15 -13 -6 11 11 8 -12 3 -28 5 -9 4 0 -5 -1
6.63999 -1 -14 -9 2 -2 -11 1 28 16 -6 24 -2 11 -5 23 -2 -16 -9 1 -4 1 -19 9 -4 16 1 -12 -13 1 22 0 12 -14 0 19 -18 6 -14 0 5 1
6.61964 1 -15 -11 11 5 7 -22 6 -4 -21 5 0 -1 -23 -27 1 -2 -6 -22 0 1 -10 -22 -12 -3 -20 7 -8 -15 1 0 -15 -1 -10 23 -16 -17 -2 -2 -15 -19 -7 20 2 -10
6.59726 -10 -2 11 -8 -28 -9 3 -1 17 3 -6 2 -6 -9 14 -14 31 -6 16 0 15 16 8 8 -12 2 -11 4 22 -11 27 11 8 -5 9 6 8 8 -3 -7 -15 -9 1 -9 -6
6.57488fmK2kk4pK7K2j8Ppl0L7j9M3l1j0TK1j9Qj6L7j3j1qJ1j2K0j0lqJ7j1J1qK9m2M3l4QklN
6.55300@k1K1j1K0j7PjLJ2m2M4k0J1j9J9pTJ2k5K9k4K9oJ3k9M%jK0k3K5m0M2j8nNnJ4l2L0oJ1
6.53164A2k0oJ4LOj3LpQJ2Rj7oLNknjkMNTj0J2j3oJJ9j3jTJ4j6QJ6l2N%K7k2J2Ok5K4k0mJ7l1
6.50722b3J6J9k2L5l5j1NjRJ1Rpj0qK3l3L0j4OrJKK0l7J8rKjLK9j6k9J1%K5j3JJ0Ok2J1LpJ0k7
6.48433a9L8moj8k0M0rj7J1J9k4J2Nq%j4J9j6QJk%Mj9QrJ5K7rj9J4lj2lJ8m5O0l7K7k6%K7qj1
6.46194eJ9j0rmNj9J2J1J0j6J3j1PK1j6MrKj0Noj5J3kJ0Qrk4K5%j6K1%j1mrK4Nk3K8k2QJ9k4Qm
6.43854@j2J8qrK6k0Nj3J0OjKJ2j6klnK3k5K9k3kMmOJJ6J1m1L0k1Njj4K4qJ3lj4J1Qk3J0pJ5l1
6.41514b1J8Rl3L8k5QJJ5k9K5J2pj9J7j3T%K2Rl9K5qJLOJJ5m8L7kOm3L0QpJ4lJj2PJ3l9L9j7%
$$ plain form
6.57488 -6 -10 12 10 -14 -21 6 28 10 17 10 -20 17 -2 41 10 0 -10 11 -8 0 -16 21 8 -3 -11 0 -12 8 -2 -5 -13 4 -7 4 -4 25 -17 26 -8 0 -2 -5 0
6.55300 0 -21 0 -11 9 -8 -1 -2 1 13 -29 15 -5 6 -13 6 -1 -8 4 -21 8 -16 13 7 20 -9 -5 -5 -6 14 -9 16 -24 18 0 -5 0 -5 9 -23 7 1 12
6.53164 12 -8 -14 0 3 9 -4 -1 -8 0 12 21 4 -2 1 6 4 -1 -2 -4 0 5 10 0 12 -1 -7 -6 13 0 -1 -2 12 -4 4 20 -12 -7 -7 20 -2 10 16 -9 15 -5 -9 8 -23
6.50722 -23 -7 12 -10 25 -10 -21 -16 -17 -8 3 12 5 -5 -13 10 -23 7 -7 -1 -10 -9 -7 13 -24 -6 -15 -13 -14 -11 18 2 -27 -16 -16 9 -4 -3 7 13 -9 2 5 -2 8 -19
6.48433 -19 19 15 9 -9 -29 11 2 -15 -4 15 -9 3 8 0 0 -14 5 -11 -3 -2 -4 -4 0 -19 -11 -20 -5 22 13 -6 8 5 -7 -10 8 -37 23 -14 13 -13 -13 14 6 -5
6.46194 -5 14 4 -5 -9 -4 -23 -11 0 10 -6 7 -4 3 24 8 12 3 5 -5 0 -6 -21 -8 -10 0 8 -1 -25 0 0 -16 5 5 -6 -10 -19 5 10 -13 15 -7 1 20 -4 4 0
6.43854 0 -12 6 -2 -11 15 -5 0 -13 -3 3 2 4 16 0 -2 -5 -10 13 -12 17 -6 -8 -4 -8 -2 -1 15 26 -15 15 -6 -1 -2 -16 8 0 13 10 -4 7 15 -8 2 -5 10 -21
6.41514 -21 -3 6 -27 11 -14 -6 -5 10 -19 6 18 11 -8 9 -4 -17 -17 5 14 -25 0 -8 -7 -4 2 3 18 -30 7 5 11 -32 -2 6 -1 13 10 11 -1 6 19 -20 19 2 2
6.39225Bk8M2lj8J2oLpkJK6j1nj2Jj0J5L0m4J0RJ1k2K0j3nJ6k2J0j5J0Mk7K8KJ6k5PJj5oJ1rO
6.36987a2J8Jk3PJ4jk9K5%rTJ7J0l2L4omj8K7oJ5k0Qjqj2kJ2pLJ5j9K0ljj2J7Kj9J2j8J7k3QJ5
6.34697CK6l9K7k9J4j3jj4NjK6j7J3J5k6J2jkj1J1PJKl0L6k4J1Kj0NK3k2j5M9m3J2k4L0k3K5j9
6.32612iNK2k3J2LRj6pQLlj6J3J4Ok8lK6k0nJ3j7jK3j1mJNj1J2j7L2k2J3rNQk0L1j2Mk2J4j3j4
6.30322b1L3j8L2j2k3J3J0Kj9pOjO%lK2l1LlK0k2J5k0K0JJ7l3K0OJ1k8k3K9Lj2Qj5JOK1m4M4j8
6.28135dM%k4K0jJ6j4mjRmrK2J6k9J7rPk4K6l7J6%K9j0j1rTJ1MJ6l6L9j5mj3K9l1J8LJ3k2J6l5
6.25897b4L7k8J6k0K8k1OlJ1j6%J0J5k0K6lnOj9J6j5pK1l0J9j1J1KL1m1lJ8p%jJ7k2K0k6oJ4l0
6.23760c4M6k7L9n0M4m0M1k5K0l5J5PK3n2L7k8M1j9Pj0j1Rk0L8k5jJ0j4J0J2k7M7l2K2m4L4k8
$$ plain form
6.39225 2 -26 16 13 -5 7 1 4 -3 -5 -4 22 11 6 -6 -5 -15 0 30 -14 -4 5 16 -6 14 1 -4 12 -10 0 -15 -5 -1 -28 0 2 18 -7 0 1 -14 -20 -9 -18 -12
6.36987 -12 6 7 -16 -9 5 4 -25 0 0 -9 -18 -1 9 -23 11 5 1 -17 10 4 19 -1 7 6 -2 -14 -16 -4 -11 -8 7 -12 8 5 4 -8 9 11 -8 4 -14 3 -20 -12 3
6.34697 3 29 -10 17 -12 2 -11 -12 -26 -21 -22 4 -13 0 15 -11 1 0 -2 -13 -2 5 6 8 -22 14 -10 1 3 -7 -2 21 -1 -16 33 -10 2 -22 8 -15 10 -9
6.32612 -9 -4 18 -5 7 10 19 3 -4 4 7 4 -12 1 15 21 -7 -10 16 -4 -9 4 -13 -14 9 -2 -6 -5 0 -11 1 -16 16 -6 7 -2 3 11 -9 22 10 14 -8 6 -7 -21
6.30322 -21 12 -6 26 14 -9 4 14 16 -3 -10 -4 -5 1 1 -2 20 -11 -8 -11 9 -13 2 -18 2 3 20 -13 7 13 24 -4 -27 2 5 -7 1 -14 -13 -7 14 -30 14 -4
6.28135 -4 0 0 -24 -4 -5 11 -3 -7 -8 1 -3 -12 10 26 -3 14 5 12 -12 14 -23 -7 -7 22 12 1 -8 -17 -6 -2 14 -22 17 2 -2 -15 14 -17 1 4 17 -5 11 -24
6.25897 -24 13 -15 1 -19 9 -12 -6 -9 2 -14 -14 -4 11 -9 17 14 9 15 -4 12 -3 -10 11 -19 0 -11 0 2 33 -8 -11 7 0 0 -1 16 -6 14 -12 -18 -4 -34
6.23760 -34 12 -15 24 -26 18 -22 19 -6 14 -21 -6 1 24 -28 9 -19 22 3 10 0 -11 -2 -22 16 -9 -10 0 -14 -4 8 -19 28 -4 18 -26 8 -20
6.21878b0K1mJ4j7J3mk3K9k4K5k0J8k8M2l6J6j5J1j2K4j0j8L6j3k0J3qJ0Lj5K0qJ0jj2NK8k4k
6.19894DJ6j8J5k9Mj6K4roJ5qoTjJ7J1%j0J3j1L%rj5M2k5k8M4j2J0k2QJjRk4K3J0roKj5PQoOrP
6.17452b%Lpj0L4j4j7QK4j6nJ7j4Kl2L0J0k2J4qJ0qJ5%j5oRJ2lj7L%ROLj1mJ9j3o%L3l0Nk7L1
6.15112A0j5%lROj7MK5k8PRkj0J5j6K6k5J8Kk2Oj4K7j3l2PJ9J1K9l8RqpRK5k9J3k0J5nOj9L1Jr
6.12823GpJNnJ8k7J7pj2J%Rj2l3N2j1kjj1QoK7k0K2k3ML6l0Lj7J4k2K7oK0l8K8nK8l2MrK4k4j1
6.10534a6nK2OJ0j9j5J8mQOmJ1m2J6mJ8l4L2kj5J5J9k5j7M4k2Nk9L5k4K4j0L6m2rJ0LrJ7k4J8r
6.08397gL1k1qjpJ1lTJ7j6RK0k2JrK6k5K8k1j1J1j0NOrNLlLpkMPkj2J4j0J5pj4K4k0K1l8M1j1R
6.06006A2k8J6j3J3Qj5qK2qkmJ3j5jJ0nJ9oqMmK0j0j6OqMJ2j2MJ3k7J9j5RqRoOPLlPj4nmL0l3
$$ plain form
6.21878 -20 1 -3 11 -6 7 3 -20 9 -15 10 -10 8 -20 22 -14 2 -13 -2 -14 10 0 -18 18 5 -15 -2 -10 0 3 -12 8 0 10 9 -3 2 30 6 4
6.19894 4 20 2 17 -12 -8 -24 0 -9 -15 0 -8 -14 -20 -21 -4 7 7 -3 10 -1 2 2 -7 -22 20 -5 -33 11 -1 9 -13 -5 -4 -5 4 -20 3 13 4 -2 0 -15 -8 0 -6 0 -9 -2
6.17452 -2 -2 1 -6 -16 18 4 -13 -5 19 3 -2 15 1 3 -29 1 11 -11 3 -5 5 -3 12 12 -3 -9 0 12 9 -8 -5 -5 4 10 13 2 -2 17 4 -2 -2 31 1 6 -21 10
6.15112 10 -5 -5 -8 1 7 -10 -6 19 -9 -2 7 5 -5 10 -6 20 -5 13 15 -7 -1 -15 12 -1 -33 -26 -7 4 33 -5 4 -4 -11 -2 23 -6 7 -13 2 -3 3 -16 15 16 7
6.12823 7 0 1 6 1 19 -8 9 2 -10 -9 -9 0 -12 -45 7 -4 -6 -7 -18 -10 -16 11 -9 13 -10 -6 30 0 3 -14 0 -22 5 -1 19 -19 9 4 32 0 4 -5 19 -5 -16
6.10534 -16 -21 1 7 17 -2 -17 1 -3 5 11 7 18 -24 -8 -12 6 -28 4 2 -13 2 21 -4 -21 23 1 6 -23 12 -12 12 2 38 -4 -13 -3 0 -9 8 -16 2 -7
6.08397 -7 24 3 -5 -6 -13 -2 -5 -8 9 -7 2 22 0 1 -8 18 -7 21 0 -11 0 -10 -5 1 -8 -3 0 -3 0 -7 -9 -5 2 0 -12 2 -8 7 0 -14 10 -10 11 -27 14 3 12
6.06006 12 -16 0 -13 0 8 -7 -15 7 -1 -3 -7 6 -9 -10 0 -5 14 8 0 4 0 20 10 -6 0 -8 -4 8 -4 0 13 -14 5 -10 -1 -9 0 -6 0 7 10 7 14 0 -5 -9 21 -12
6.03564a2J4j5M0k1j1k5L6qJJ6k7L1k6J9j2nj9L7j6k2%L3qJ1J2j8j2Pk7K2P%NJ3l2J8lKnPpNmo
6.01326e%jJ0J1j0mNJ8k8Lj9J9jTMmm2O2l1L3J0m4KK2roKjJ3j5jK1rJ5l5K7j3MN%j9J4rJ8j0P
5.98986Hj8K0j3K%J9l4J6%k1OkJ8j8OJ5J2pqNj0oJ0Tj2k8J9RJ5j0Rj1pJ7k8kK5Om1J8J2L6l9q
5.96747a0J4Nrkj2Rj1K5jLk9N4m0K7k7J2k5J3K6k5NJ7l6M0l5J5mJ1j3jJqK7m1M0j3j2K4k4K2m
5.94662Hl7K2J4lJ8m6K7Opj2J1KK3n7L1Nk3L0J1j9J5mj0jk2L8l4K6j6MlmnJ0J4j4K3j5Rk6J2l
5.92525bj8Qj1L8Jj5Mj3pJ6j7K0J8jj6Rj6k0L8oK0l5j0J0NnPJ3nTJopoj6L5j4J4njk3K8nqPTl
5.90134Cj4J7k6J6MJ4mj6J3oMk7M6k5qK9k0j5J0M%J5Kk9J9k0L8k4%TL8n2J8k0L3m0M2k2J5j6J4
5.88049A0k2J3QnK3l3K6k6oJ0l3K8pM%L4l8L3k4krMJ6lnj9L3oRk4J1MNk1O0m3J9m3L7%j9rJ2Jk
$$ plain form
6.03564 -12 2 -13 27 6 -5 -30 6 -2 -1 15 -12 19 -7 12 0 -5 -24 13 -3 -25 -25 8 0 11 23 5 -7 0 -27 -5 2 2 7 20 -12 6 3 5 0 7 0 5 1 -5
6.01326 -5 -5 -6 4 15 5 1 6 24 -4 -1 -20 -1 -2 -3 1 -3 -45 17 -14 19 29 -15 -13 9 0 -6 -4 -5 8 -7 -8 13 4 19 -16 11 -2 2 7 7 -12 2 -7 11 1 8
5.98986 8 -10 10 -3 -1 -1 18 -16 0 0 -21 -15 -17 1 -17 -11 4 16 9 1 6 -4 -10 0 10 -2 -30 -11 -2 13 3 12 1 -6 11 -17 -19 6 12 -29 -11 1 37 -2 -10
5.96747 -10 4 9 0 -2 -14 -5 -16 9 8 11 -18 36 -4 23 -4 8 -17 -4 22 -3 2 19 -17 23 -12 3 -1 10 -3 -4 -3 -11 16 -25 15 2 -10 14 -10 12 8
5.94662 8 -29 -7 7 4 22 -24 3 9 2 -10 1 3 26 -31 0 5 -18 12 23 4 19 15 5 4 -18 20 -14 12 -4 0 -3 -7 -12 -2 12 -2 21 6 15 -11 1 -2
5.92525 -2 -20 -12 -23 15 16 1 5 -8 -15 1 -16 4 22 21 5 14 -2 -22 16 10 30 -5 -15 -5 0 -5 2 15 10 5 6 0 -7 -13 -29 6 -8 6 1 0 -23 5 0 -8 -1 6 3
5.90134 3 -11 6 -20 -4 0 14 10 -6 7 1 5 -22 24 -1 -9 20 0 -15 -5 -1 -1 14 16 -13 6 -14 24 0 0 0 38 -14 4 -16 17 -23 19 -3 12 -4 10
5.88049 10 -12 1 9 4 27 -6 20 -6 -12 -2 -35 -7 -14 -10 -10 24 -14 19 -5 -7 -16 -12 4 1 -4 -23 10 4 13 -11 0 4 9 -12 48 5 24 -19 18 18 -1 -10 2 3 1
5.85759AKj4K0r%omJ6nj2RKk3J9Rk3K4k8NMJ6J0rqj6M1l5ROorkQ%j0M2l5J7KlJ0nk1J5qLTJ3k1
5.83267fOkQRk3OrJ9l5L5Rk9nkL0k5mK7Qrj8J6mpKNolJ2j3qK7j6L3m5NKQqJ4mj0J5Mk2J8LQj7
5.80774aj5J7nMJ0lmJ3k0J7j7J%LnNj7L3k5K7lj2K1k1Mj5QMTj9Qj0K3qJ3k6J3rL9l0k5L8l2K4
5.78536Gm3M0k1K7j0rK5j7JKnL4m2L2%ol1lK1Jmj3L3l4L2l9L9k3J3moRj0%J1j2Rj1MKJ7l6K7p
5.76297@J0k7K2j3QNlk5PNJ9m2M3l3K9j6K7k6PJ8k1RTqojJ6j9J3k2K4rRj9NJ4j6PrK6j3kpj4M5
5.74008B6m6K0J%jnRj6nqL0j0L4m1J4PLJ2l3JkM6m0MjTM4m5k2L4qj3K1Lk6K2j2J2j2PnK%Kj4O
5.71668fJ7oOk6J7NJ7l5J0oPrj7K1J6j7j1K3Qj4noKK7m7L7oj6K2k4K3njj8OJ5rMjk9M5j2J6lk2
5.69379gj9L3Rl7K4QJj9J8l7K8K1k7LJkpNkL2j2j7LKoNnPjK0j2k5OTJNk1rM2k7J2J9k3KRJ5k2p
$$ plain form
5.85759 1 3 -11 9 0 0 -6 -10 6 1 -11 -2 0 -23 -4 5 -18 6 -22 -17 -13 3 13 4 -4 -20 21 -14 -5 1 -5 -14 -16 -8 -8 -18 24 -11 6 8 5 15 10 -11 4 -4 -1 2 15 -6
5.83267 -6 0 -2 6 15 -8 -2 -11 8 -27 8 17 -12 -17 -19 11 -14 -18 9 17 8 -10 6 2 -5 -3 2 -4 -7 5 -8 -16 11 -5 28 -17 -12 -10 -2 -10 4 0 -10 5 9 -13 5 8 16 -1
5.80774 -1 -16 1 -4 0 10 7 3 16 -4 13 -4 -3 -3 0 -5 0 -17 16 -9 18 15 3 24 3 7 -8 0 4 8 -11 -3 -13 10 2 15 -11 2 -7 32 2 -23 15 -17 7
5.78536 7 -36 4 -17 10 0 -9 16 -1 0 2 -3 31 -11 21 21 15 -16 -19 2 3 -1 -14 19 -15 17 -22 17 -6 7 3 -3 6 -4 -4 7 -5 4 -7 -3 -1 16 -20 7 0
5.76297 0 10 -17 5 -8 0 5 2 -23 -16 -11 8 -34 9 -24 5 -11 16 -10 -3 15 -6 3 12 4 -2 -3 13 -6 7 -15 9 0 9 -10 -5 9 -7 0 -9 17 4 2 -5 -19 26
5.74008 26 -20 0 1 1 0 -5 4 -12 -17 -25 5 -5 29 -12 2 9 12 24 -9 -8 -10 36 -4 0 -1 -2 42 -3 -25 9 1 -12 9 12 -14 8 -4 8 -4 3 -2 0 0 2 -12 -6
5.71668 -6 11 5 11 -15 2 7 24 -11 -1 -7 0 -9 -26 -5 11 -6 -17 6 14 0 -5 -11 -9 18 -29 8 2 -14 8 -16 7 2 1 -17 -11 4 -5 -1 -2 -31 14 2 18 15 -7
5.69379 -7 -26 7 16 -21 3 11 12 -7 11 -26 2 23 -4 -1 0 -2 -9 -4 -6 26 14 -3 0 2 -4 1 -4 3 2 22 10 -15 -9 -3 -2 3 -18 -27 15 -12 0 19 -4 -2 7 22 0 -7
5.66937gJ1j1k3J5RJ8rkk3L4j4k4N1j0mRm4K5Opj7LKL4k4NL1l8j5L2kjmk4J4%mJ8MpKj5Rk7M0
5.64648A6j5Lm0L0Mkj1K2lk3%j0L0J6k3LOlk0K8K5l5KJ0J4l6K2J5k1J1j6J7j7Pl4J6K6k3jlKJ7
5.62511FOj9M%jK6rqNKl3J8mJ1l0L2k0J9j2lJ8k3M3k7lMJ4qln%J5Kj9qJ1%j4J2j7J9j0PJ2kJ5
5.60171B3k8Oj3j1L0j7J0%j8J9j9mJ0J2J1Lk1QK6k5J4k3LJ7j4LK2l4K7j1lJ1j4K4l6nRKmTJ4P
5.58035Gj1mkJ4Pk8J7j0L0l2J4Nj4nJ6l0J6k0%TK6lRjMk7L4j0TlOqL0pQk4lK8omk3J6K%Qk5j8
5.55644c1K0pJ9J0j3mnJ4J8j9K4l1j5K0QOj5J4l4L1j9NrK7m5J3K4kpNMlmJ2ql8L1Jpj0MJ1NJ7kT
5.53304A3j5j8J4Lk9M4j1K4k4J1k0LQ%k3L2j2JK6j9l1K6K1nk2j5J9J3Nm6K8J0Nk8K7l0K9k9J6%
5.51269AOkj5jJ2j3ljj7K3J5mrK1k8J9k2K4nj2J1jnLj2j5K5j8J0M0l1Rk7K2j8%J4kK4k9PK5J4
$$ plain form
5.66937 -7 4 -7 -30 -15 -6 12 3 1 -22 12 -2 -26 25 15 11 20 -24 1 7 0 -17 -14 -12 22 -2 3 34 -4 -19 13 11 10 6 -18 -4 -4 -8 10 14 7 9 -6 3 -24 16
5.64648 16 1 4 -36 -6 -2 -4 -15 7 4 -19 -19 -29 1 17 -6 -3 3 0 -20 8 33 -2 0 10 24 -12 10 25 4 15 -1 16 -1 6 -28 -12 14 -9 -10 -13 -11 6
5.62511 6 12 -7 -3 -3 -4 22 13 5 10 12 -21 -3 -7 4 -26 6 -14 5 -7 -10 8 -15 28 1 -2 2 16 8 5 0 0 15 17 -2 -10 1 1 -13 -1 -18 1 -9 -2 10 8 23
5.60171 23 -5 1 -12 -23 7 -10 0 0 -18 1 -18 -22 -12 0 11 14 -7 1 27 2 16 -7 -4 13 -1 2 24 -10 17 6 3 14 0 24 -12 -17 -8 -6 -10 -14 0 7
5.58035 7 -4 -8 -10 4 11 -17 0 -10 20 -12 2 7 -7 -12 4 -26 -10 -30 -30 -30 -4 -7 2 1 5 -22 12 2 -8 -11 -5 -13 17 10 18 -6 -9 19 13 9 -14 2 4 4 12 -13 -31
5.55644 -31 -11 -18 1 11 -2 -6 -11 3 21 2 26 -5 -20 0 8 14 -1 13 -21 10 -9 -4 -13 14 -31 -18 6 4 -3 2 6 3 -1 11 3 -35 -4 -3 -10 -20 -16 -5 0 17 15 13
5.53304 13 -2 -20 -6 -3 -32 12 1 25 1 12 -8 -5 3 3 -20 12 0 1 27 8 -23 3 24 19 -3 -18 1 14 19 -27 1 11 16 -12 15 -15 14 -15 1 1
5.51269 1 7 5 -10 -11 1 -12 -15 -16 -33 -10 5 1 -8 13 -15 4 -18 6 1 -11 0 -1 -6 -3 -15 -30 -5 -23 -13 27 -4 5 -22 0 -18 -18 -4 -6 18 -11 -4 21 35
5.49081C5l5K7k2%k3K8Qk1J0MJ4k8J2j2J0Rk7K0J7l6K5j2J1nj6QmJ7J2k4JJ1k0JMm%rK1k3RjJ0
5.46894BoRkj9QK3l6L3m3L1J9j5lPKkNj7qLJ7qJ6k0j6K0%jj5MTmL2k0J0k8K7k2J2J8j0J8m2N2
5.44655C5j9Nk9J7k7K6j2Pj1Mjk6K6J8j1qj8N3m6J6Pqkk1J5K8j9Q%J3k9K5j1lmJK0l2J1NQj7n
5.42468a1J0rJ6j8J7nJ5k4QkK1l5L3pJ1k6Oj5L9l0J3rlMJJ5k0nJ0J9Jj7k1J4J6oTmTQj2Rj1lK1
5.40179DKJ2l5%K7l1K5oK8m0J8J7j1Mk0OpJ9Jj4j9NJ6J5mLj3j7L2j8NjJ2j5j0jK5nj0mkj5K2J6
5.37940A6k1j9PJ6J1l4J3J0J7rqTRrK7l7J9jTJ5jj9J9k5K5k5L2l1NJJ9j6Mj6J0Pj4K7nT%kljj0
5.35651a1J5j4Pj2J5K1n0K5pJ2k4L5m1L6j7LloJ9nMLJ0l0NPMKpj6J3J4JqJPJ3k9PTk2K2pLMj7N
5.33260fJ0j7K6k8K3J6ok6qJ1j4L7j8QqjPJ3k4J2J8j4lj9J6j1J8Mj4pJ2klkTRMk4K4l2K7j7J6
$$ plain form
5.49081 35 0 27 5 5 -18 10 18 -3 7 11 25 -3 9 -3 7 16 -11 9 26 -10 15 3 14 9 -7 1 -3 14 26 2 3 14 -6 -5 -1 -5 -5 -14 7 -16 -7 -8 2
5.46894 2 -4 5 3 -16 -8 15 -21 12 -31 0 19 4 1 8 10 8 13 -4 -12 -9 8 0 16 -4 -20 0 0 -1 -16 -12 -8 -12 20 0 10 -18 9 -13 -1 17 7 25 -17 35
5.44655 35 16 21 -8 9 -18 8 -4 3 -8 -4 -5 -31 -5 13 2 -6 -24 29 -17 -1 6 -2 -4 -25 -10 18 -1 7 7 20 -9 16 5 2 -2 -1 19 -13 -2 3 11 -6 -11
5.42468 -11 -1 -10 6 -12 5 0 15 -9 -1 -3 18 -17 16 9 20 -6 0 -15 24 -6 7 -2 -5 -1 0 15 -5 -10 0 19 20 3 -18 -4 12 6 0 -4 -8 0 -12 -3 -14 -17 4
5.40179 4 6 18 -17 -17 10 -21 4 -2 26 -14 4 21 10 14 -6 0 -7 12 13 -1 -20 -15 1 16 12 15 2 -15 17 -1 4 3 15 0 -10 -11 14 9 -1 -5 -7 -22 0 16
5.37940 16 -5 -24 -17 -1 10 -24 -11 -1 16 7 -1 -9 0 -9 18 -19 0 -1 -2 13 12 -7 12 -13 12 -13 19 -12 -7 -6 13 -3 1 -15 -5 2 -12 15 10 5 5 3 0 -1 -11
5.35651 -11 4 -10 -3 -15 0 21 -29 -4 -11 1 -23 12 -29 7 -10 -7 -10 -16 3 -2 2 5 15 -15 -10 -3 1 3 -4 -20 -7 7 8 0 1 8 21 -8 -1 6 -16 6 -1 2 6 -11 -6
5.33260 -6 4 -13 13 -15 8 24 18 -8 -16 -5 -19 18 0 8 0 -1 6 19 -5 7 25 11 8 -11 5 -6 12 16 2 -5 7 5 2 0 -2 7 11 -13 11 -21 6 -11 5
5.31073Ej8R%QmJ0k3J3JJ9j4L0m2J8LKk5NJ%LmjKJ7qOk1Oj4M8l4J4j8OolK1J3l7J6K0k0J1Lk0
5.28733bK8k0%LPpj0J3k5L3j6k2J5J9nQl0J7j8LpJ2nK7Kl0K4j1K1j8Qj4mJ6j8j0J4k9M8j5%lJ1
5.26545A0k4J1MRp%J4j7ok2K0nK7pJ%LnTjnPk0J1J6j9LmJ3lK2qk8L9k4J7Rm6OK1Oj2%QrpnK0j1
5.24053cL2l3kL2j4JKpJ8k8mk7M7k9J3K6m0OTK1J3qm2K2Pj2lJ6k7K7pjM%kk8M4k6J3k3PL8l5K4
5.21814A8l4K2l3L1mNpj7O1o4L9j0jUJ8j4J9k1opMQoJ9j4Nm2L2K0l0j2L1j0%L5l2K7l5J2rTpL6
5.19576A6k5M2m1Lk3M7l3K4oRk2J8Oj8L6l5rK5k5J6oJj1J0KK7k9K4l8QK2k0K3l6K4k8K3OJ0Mj1
5.17490A0j0kK1j3J2j4K4k2%k5K6L1l4mqOnLL7m2RQjpJ3j1j0QLk4L2krj8L0j5j6J0QnNkK1k5lM
5.15150fK1k6NOlLk1L4k5N2m9L4k3lmK3j6k3M7k4Rk0K3j4rJQMjnK7j2k1j1J2K8Jj0jj9QnJ2j1P
$$ plain form
5.31073 5 -13 -4 -4 4 0 10 -13 0 1 20 6 36 -6 12 15 17 -8 -3 -2 -2 1 -3 -4 -2 15 7 13 -8 -2 -16 32 -2 12 -6 0 -6 -9 12 25 -12 4 24 4 15 18 -2
5.28733 -2 26 6 6 9 16 9 -1 12 -13 20 4 -18 -3 16 11 19 -11 6 -12 -9 -16 -4 -9 18 20 -10 14 3 24 6 14 0 -4 12 -6 -16 -2 -31 17 2 2 -1 10
5.26545 10 -14 -3 1 10 3 3 17 0 -6 -28 -8 -13 14 7 8 8 11 6 1 0 -5 2 -18 -7 9 -10 -7 -11 2 -1 21 13 -15 24 0 17 26 -20 -14 7 13 1 1 9 0 -7 -12 8 -3
5.24053 -3 29 -4 -6 26 12 13 15 8 26 -2 -6 -33 14 -15 -2 24 -16 -10 -4 17 30 22 -20 2 9 -3 -6 10 -17 10 3 2 6 6 4 -24 20 -6 7 -16 -9 29 -6 18
5.21814 18 -16 6 -27 4 0 5 -2 -19 42 -22 17 7 6 5 4 22 8 27 6 0 -7 -3 5 -1 18 4 9 -33 -1 19 -11 -23 8 -2 -2 33 1 28 -7 5 -4 -13 -20 16
5.19576 16 -9 33 -8 -5 -28 19 -14 10 4 13 -9 9 15 -3 33 -2 -11 14 -11 5 -1 0 -11 -1 1 28 -1 23 -15 -7 15 -5 18 -18 6 -22 1 7 17 21 10
5.17490 10 0 -2 19 6 18 4 28 6 6 -19 7 38 4 0 -8 -2 -7 -4 33 -9 0 8 7 0 13 2 -8 0 3 -21 11 9 0 -18 12 -3 -19 -9 -1 -6 -1 -3 18 -7 -10 -6
5.15150 -6 15 -11 -6 0 -3 0 -21 13 -12 40 -9 25 2 -1 -5 18 2 -21 26 2 11 -9 14 0 -9 -8 0 4 3 -2 25 13 -8 -19 -7 21 22 12 11 -8 0 -5 7 -4 3
5.12861CRnrKJk3M2j9mqKlJMJ2pjLj1J3j0J2J0j0Pk7J6j4J2%J1k4K3j4J3j9K7l1J9J1Lk5j5N0
5.10623B7m8L7j8ok3M1J4l8J8j1M8l2Mj3rJ6k6K2j6K9l7L4j2Qj3QTk3J1Pj3TJ8mlJ9k4K0Mm2M1
5.08537A0k5K0mK0k4Nj6J0K7l7J%M0k4jk1K8qJ6j2Nj3J1mrLK3Qlm4M4k0klj5OjK4JnRqk4nOKJ6
5.06146GpORqJ0j9mnJ1%J3k3L3l4kQ%K2j6J0rK%K0nk4J6lj4J0MopJ0L2m3%j3M6k5K7l8K6k4pOR
5.03755ApJ9Ol1jOoK6j7Jj5M9k1jm%NrOprqL6J1k5j2JnJPmJ2%TMrqL7k7jj2PJ2rK0j2j6J5jj8
5.01211a3K5j0Lj2J4j9L1k4J1Kj0J3k2L1oj4K0k6kJJ8%k1J2kpJ0Jk4J1Tkk3M1j3TKO%Pj3qJLq%
4.98871a8RTlJ3k5L7l3K0j4K1j4J2l2M4l6mPOJ7k1Rl7M5j0pNj7%J1Oj0%K5k5K9jm0K3r%LJ3j3
4.96684eJ7k4L3Lk1J4k9J4PK1m5K8k1J2%mJ0qJ6Ok9j2L4j8J9k3Lj0KLJ9rk2J5qJ4qmJ1k5K6J3
$$ plain form
5.12861 3 12 7 -2 0 1 -22 20 1 -3 -11 -9 -12 -11 -7 5 -2 -3 0 -11 2 -8 4 14 4 11 -16 0 -14 -2 -2 9 -15 8 -6 7 -12 15 -16 3 14 17 -8 -23 27
5.10623 27 -21 16 -2 -8 -31 10 24 -14 4 -7 41 9 13 0 -9 7 -19 3 -13 16 -21 13 1 9 -4 4 12 -11 0 7 -6 -19 -1 -5 -8 11 -13 7 11 -31 10
5.08537 10 -15 5 1 21 -3 2 -14 -4 23 -14 -13 -13 27 3 2 -19 9 1 17 5 10 -3 8 4 -5 -2 21 29 26 -18 26 6 4 1 -14 -8 -9 15 16 11 20 12 -12 -17 -11 -9 7
5.06146 7 0 6 15 7 17 -2 -6 -11 0 0 13 -10 23 -11 -13 -5 -5 17 1 11 2 4 4 24 19 -5 11 8 -6 4 8 2 -5 5 37 -6 -6 -19 27 2 29 -9 17 -7 -14 -8 1
5.03755 1 -6 13 19 -12 -13 -7 -13 13 -4 -3 -18 31 10 9 5 5 10 1 7 0 -9 -17 19 30 5 -7 -6 -11 -10 -3 -7 5 5 5 9 0 -8 29 2 1 -11 -4 8 -1 19 7 -9 6 5 -13
5.01211 -13 12 2 5 -7 7 -12 19 -5 6 8 -2 11 -11 20 14 0 20 -6 -8 -7 11 11 -10 2 0 -7 3 4 -20 -9 2 0 -23 18 5 -8 -6 0 0 7 -6 -14 -13 -10 -18 -18
4.98871 -18 -9 0 -3 10 -15 22 -11 9 -5 16 2 14 -18 26 -10 -14 -7 -1 16 -5 4 -33 12 2 -5 0 -17 -17 -6 0 -10 -10 15 -10 19 18 -22 1 -8 -8 -5 8 -5
4.96684 -5 12 -12 21 24 3 17 -12 2 9 30 -15 13 -8 4 4 0 10 2 18 24 -5 -17 17 -1 18 -5 -2 -12 -10 -7 12 3 -19 -4 -12 2 -6 -10 1 -24 2 15
4.94547A5j7j3L0k7J9Pj7Pj7L0k7J7PmNj9NmJ1Kj7J0Qj8LqlM1j4lj9J6JJ0j2j4K4pl6L2kk5K7
4.92360Dk2O%L3ok9jJ5J9l3J4TK2k1j9MqK5j9Kk5L7kj6J3j2J7j7NPN%p%pk8K6oK5k2J2j3Oj3L8
4.90071B3l1kJmJ9MJ6k6Jj2M7k9J4k1L4j3lk4QkLJ7m2M0k7K0k6K2Oj3krJQKloMJ4k0M3l4mJ1j3
4.87781hK1Mk0J5rkj9K0NJTpLk5L5m2M1j9M6m2J7j5L1qm7K1J4j1jK3pJ3k2J5k0jKTqj2NK5j8PJ
4.85492EmJ1j3mJ1Ol8L8j7Oj%J5oJ0j0rnRjTj0PK4l0j3K6j3%K0jk2J0%kQl2L0k6M9m2L2Mrj4j3
4.83152a5K7j2K7l7L0j8lj0J2MKj7J5Qj9J3m2L1JJ5k9K6k0L0l8L2mj6Oj9L9k0J0rQoNj0qJ6j5
4.81067a0K1nk0L2nTm1O1l4L4k8omJ5mJ3j3J8j2k1J4mMJ0rK1k4J4j6KmJ1k1K6MkJ5k2okMK0m4
4.78879b3K8J5m4N9k9j3nj2K4K1j1lqJJ2ojqQnj1K3k4J0kJ2JqOk5PkL5l4J7nJ2k3oJ9j3K4l2L1
$$ plain form
4.94547 15 -2 -15 15 -12 7 14 -3 4 -13 17 -10 7 14 10 15 -4 1 -3 8 10 -7 3 11 -7 -4 -12 -15 26 12 9 -10 6 7 17 5 -9 15 8 -28 4 2 -23 4
4.92360 4 -18 -12 -12 21 15 -14 -15 0 19 -14 0 14 36 15 -4 0 -8 17 -2 0 -25 12 10 -6 7 -5 12 -5 0 7 12 12 5 5 -2 -30 -4 -10 15 -7 5 -8 -2 -15 23
4.90071 23 -8 -10 -9 -13 6 10 26 0 1 -11 36 7 21 0 34 21 18 -6 2 0 3 20 -22 18 -9 11 -15 7 13 0 -2 -11 -10 -2 0 -3 -9 -5 9 -11 32 -2 -6 5 -8
4.87781 -8 13 17 -3 12 3 1 -18 2 7 8 9 2 5 -20 15 -27 14 -5 41 -1 16 1 32 24 -23 -2 12 1 0 23 16 29 7 22 2 1 3 5 -3 -15 -10 15 -3 4 5
4.85492 5 1 12 -1 -5 6 12 -26 12 -5 1 0 0 15 9 19 9 0 -5 4 3 2 -8 -1 23 -7 -20 6 -7 -7 13 12 -10 0 0 -2 6 -26 4 -22 27 -15 17 21 12 -2 -15
4.83152 -15 12 0 27 -10 20 2 -1 -11 1 5 7 -10 5 13 -6 7 -35 -4 -3 12 -17 9 -11 19 -19 13 9 -7 -1 -20 19 -1 9 0 8 2 7 -3 -11 5 -10
4.81067 -10 11 6 -14 18 13 8 -33 28 -6 28 0 -6 -10 5 1 14 1 19 7 -14 0 -4 0 10 1 22 -2 12 -4 -2 -6 5 -16 10 14 12 27 5 -1 -3 1 21 -23
4.78879 -23 5 20 -24 35 6 -7 -12 -24 0 21 10 7 -1 0 12 6 5 -3 5 0 -11 12 -12 -2 -4 8 9 1 7 -18 -11 -13 22 -12 5 0 12 -11 -17 2 -11 13 -19 12
4.76641A2l4L2KJ1k1QqnmJ6l5M0j8K4j6Jj5%OQnj2L0j7J6j0nL%J2LJ3k1Pmm1K8j8J7J5mj7J1om
4.74352elQJJ3j6LjJ5j3j4K6K2k1j3J9k7PqJ6k0%Rj4J1QlK0k1J2Nk4L4l3Mj8L5k5M2k9ml2M4q
4.72164BK2j6j9J2jJ1j7QL7k7j0OnlJ7j5Nj5K8k7J8j2JJ5nj1mK1%k6K3qJ3m0J8K6qkk0Qj2OQj5
4.69926a3J8Rj2qJ9j3J7l2K6J2k4OJQMm4K8k1L7pj0KlK2l7K0rkK0l1J4PJ4m8M6l1L0j5J1j9PJ3
4.67789A2oPqJ6j5J6k0lK1k8J2K1j0j3Mk1NJ2PMj0Lj3RKJ0k2J7l0K1k5L7k0K8pmJ3k6OQj5QOj2
4.65551cK0m6L1nJ7nrj0L3j0l2L2JopK7l1J8mnJ3qpQj2PqJ7k3L1m9M1l2M3k7k3pJ1J7%l3M2j1
4.63363dK2k7J2jK2k7L0l5lJ1j4L1nMk5PLk3L8j9K3j2mJ3Kj4nK4k1J4j0lrNJ5l5L3k6K5nL8m6k
4.61176cNknLPlOk0K1l1J8J4j4K8kok8K7km1L3K1j7k8K0J3Rk1K9k6lnRJ8j2l4K9j2K9l0J1oJJ9
$$ plain form
4.76641 12 -22 10 12 23 2 10 2 -3 -7 9 -26 14 -4 20 4 5 -10 -10 -4 4 -1 -13 17 0 16 6 1 4 4 16 19 32 11 18 14 -27 1 -17 0 15 11 -6 5 -1 -5
4.74352 -5 -8 0 1 14 -2 1 0 15 2 -12 14 36 15 2 21 -6 1 -7 9 -11 -11 -2 -16 -5 3 0 20 -1 11 16 -8 26 -7 -3 -21 14 -11 31 2 -2 -34 10 2
4.72164 2 24 8 -11 1 0 11 -6 2 39 12 2 8 3 0 17 2 7 -8 20 -7 11 -1 0 15 10 -1 -5 16 16 -10 13 5 18 -22 -4 22 14 12 -8 0 -12 -6 2 -13
4.69926 -13 5 14 2 -6 13 0 17 -15 11 23 -1 5 6 14 18 -26 2 -19 18 11 1 3 0 22 -15 5 -4 -6 14 -17 -3 4 18 -30 16 -15 15 0 11 -8 -1 12
4.67789 12 6 13 5 21 6 22 2 -1 20 -8 4 25 15 2 6 -15 -10 2 9 13 3 6 -7 2 4 14 -8 9 -21 0 -25 12 -8 20 13 9 22 -4 2 10 -5 3 9 -3
4.65551 -3 17 -29 2 -3 14 9 0 -10 23 13 -19 13 14 8 1 28 -3 15 11 6 19 11 4 12 0 7 -1 16 -7 24 -25 16 -16 27 0 -23 -30 -19 -2 -2 -35 7 -4
4.63363 -4 18 -9 3 2 24 -3 27 -8 -11 0 -14 17 12 16 -9 -2 1 -22 16 -3 20 8 4 17 19 5 0 24 3 17 7 4 -5 0 15 -20 13 -13 12 7 45 -1 -3
4.61176 -3 2 0 -5 -2 5 2 8 -12 9 -22 -4 10 -4 24 22 16 -12 15 13 -28 5 26 9 -19 1 14 23 2 31 5 2 -3 6 24 12 -22 7 -5 24 -6 5 -1 0 19
4.58938A9k2J6jQj4J4j4j5L1qj7mM2%j8k3N%OmQJj0JJ7k7K5j7J3pk3J6pJ1k2NK2nOj2Pk6L9m0
4.56699b4K5OJ7l3pJ0%kK8j9J1k7L9l8K0k1L9j3j9K0J7j7KLj7jljlK1J6k5mKJ6j8OKJ0nKk7K3
4.54512A1j1J2Nj1J5l1J0nNTnOlJ2k4J2L5n2J2J3J1k8OjOM%rJ6nk5K6j2mJ6pKOlj1kk1L3kmKJ8
4.52121B3j1MTl0OojJ6JKj5J9LJ2l4J4j9K3j0K1m2M4nqmpJ6j4J2j7lJ6J0nj0moJ6%J4j8qM6k9m
4.49832A2j9K5j2rjRrK3k1LOJ1j5J7k9RJ8l6J8KMqK1j5J3qj8J3Rjoj5J1J6l2M5m8RK7k8L0Qn9
4.47644c0L6%JmoK4k6pkK3kpTJ5K1rOl6J3K6k0pJQj2k1J4J1j4L0k9J0Nj7J2jPTk3J8k2J4OQoQ
4.45304A6j1J8Pl8lL1k3qL0j7J3J0j8k0J2KJ6Rk6J2RJm3J8QJ1Lk4K7k2kqJ1k3L0q%L2k9oPNj0o
4.43066gJ5KokTMPJ1l7J5J1pjKpJ1RpMQl1QJ1J3ok6J9k3K7J0m5L3rj1K4k4PJ8k1J6k5N5j7J0n1
$$ plain form
4.58938 19 -3 13 12 20 6 20 6 -9 22 14 -3 -7 35 35 17 -6 -1 -1 5 1 9 10 0 1 18 -9 16 -1 12 5 -18 -2 -9 2 -20 -15 7 2 8 -4 3 -23 16 -24
4.56699 -24 1 7 24 -9 -16 -6 -6 -8 20 1 12 -15 24 -14 6 -15 24 11 -8 12 29 12 14 17 0 -1 -4 -5 -8 13 29 4 0 2 18 0 6 8 18 13 15 -12 11
4.54512 11 0 12 17 6 21 -10 0 -5 0 5 0 6 3 15 -9 3 38 -14 -2 11 22 -6 0 -1 5 9 9 0 16 11 -14 12 0 -4 12 5 7 13 10 -1 -3 -24 9 7 3 5 23
4.52121 23 12 16 20 -10 -4 -10 -11 5 6 8 -7 12 15 27 -7 7 -12 11 1 22 -20 24 19 11 7 0 16 2 14 -3 -6 10 20 15 5 1 -5 11 11 25 7 -1 45 16 12
4.49832 12 -7 18 6 -3 -4 5 -4 19 -2 1 7 18 3 20 -9 0 18 -18 0 2 6 -2 19 4 17 9 -9 4 13 12 6 -9 2 18 -14 31 -17 -8 19 -9 21 29 -30
4.47644 -30 6 6 7 3 -3 21 -5 -12 -14 9 7 0 -7 8 29 20 26 -10 3 29 9 2 3 11 -1 -22 -8 3 -11 19 -10 0 5 -12 0 -1 6 13 -10 8 -14 0 6 14 8 16
4.45304 16 5 23 30 -8 -11 20 -3 -11 19 2 15 25 7 -13 -1 1 17 26 0 12 21 22 -21 -3 5 16 19 -5 22 0 -2 -10 1 -22 8 0 0 32 3 -3 4 9 -1 -7
4.43066 -7 8 10 4 2 0 4 11 22 -15 0 11 4 3 5 -2 9 18 11 15 23 -8 0 11 24 18 -8 11 -12 15 25 -20 13 4 -7 17 -7 0 18 -3 13 -12 43 26 36 -15
4.40777a5NL3j7J6ojk4J4Jj1lk1K8kJ0J3k6J8Qjk1j0M7l9J5k8L7j6JoJ5k9N2l6OJjk2L2k1lJ0q
4.38589ePj7J1K0j9NpJ5j7K2j8Lj5L1j4J7j4j8OJ4lJj0K3j7K9k2rK7l1M0l5J6J1k7K4k5J4pJ1
4.36554A7k1KmJ0pj2K9m1M5j8%Nj9L5k1j2L3l3J0pJ6j7J6j5KJ2K%j8L8k0J2l9K2J6l0K5k1J4r
4.34519cJ0koLJ4k3J4J0j6j8K8pkOlJJ4k5K7k8lL5k8RrJ2J6j3Jj3NLpJ8j1Mj3pK7qoKpmk5O2m9
4.32128a5K4j1K2l0L5lnj3J1J0Rj8j4mRk2J1LPrj0L7l3OlPkQJ3l9M2k0J8l6M8l0J3k7K4K3l3J3
4.29992A6nj4joK1k6M8m3M0n1N3k8qJ2jqkJ8l7M3nj8nMJ4k8J9Nk0J7Oj4LJ9l8L2nKj2k1M8m0M2
4.27804B6n4J8j3M0k1J0Pk5K7Lj1J7j2TJ4ponK1k4NK2Lk4JK0nk0J0J8rnMlJ1k5rK2Mjon%QoQJ9
4.25413C0k6mJL8m6Nj0jJ0J1nQToJ0k1LQlJ6k4Rj1J4Mj0K0jl8RL2j4k2J6j4oJ5j1J0mK9%k1k6
$$ plain form
4.40777 -15 -10 23 6 22 16 15 -9 5 6 -5 -8 -29 -1 -3 7 20 -6 12 20 19 -2 -12 35 -4 11 -17 20 4 5 -1 14 -15 37 1 7 8 7 -15 17 -4 -7 3 -5
4.38589 -5 2 -15 -4 16 -3 2 -5 10 -7 15 -3 0 -15 16 2 19 5 -13 -7 7 4 5 -5 18 1 30 8 -1 26 -5 35 0 16 27 0 24 -1 13 6 17
4.36554 17 -4 -2 -6 4 -3 -15 14 -27 18 0 0 5 -14 21 0 -12 21 -12 -2 -9 7 -10 6 -9 -7 5 7 7 -11 27 7 19 -20 2 18 -12 13 -8 6 -3
4.34519 -3 7 5 -1 2 16 -7 7 17 1 -17 11 4 2 8 5 6 20 -5 22 -6 -9 26 -2 7 -2 10 26 13 14 1 6 9 2 20 9 13 0 -7 20 12 6 8 1 -3 -28 34 -15
4.32128 -15 9 -2 20 -10 25 22 17 4 15 25 34 16 2 -2 7 -15 -4 -1 6 -3 -13 24 -9 -3 -6 1 -1 7 20 -19 23 3 21 -15 33 3 16 -11 13 36 3 16
4.29992 16 11 -3 -4 -10 11 -15 33 -10 30 -21 32 4 -4 8 7 -1 -3 15 -22 21 16 -2 -7 -3 11 -17 2 7 -13 4 10 -4 -1 18 -20 12 7 9 -3 -24 24 -16 26
4.27804 26 -28 -10 -23 17 -4 6 13 -12 15 18 7 24 12 0 14 7 1 -4 17 -7 -2 20 23 -1 0 20 15 -5 5 23 14 9 13 10 21 -4 -13 9 13 12 6 1 1 9 3 11 30
4.25413 30 4 0 1 39 -7 -2 -12 -13 -3 8 3 11 19 13 23 2 5 13 10 26 2 11 0 14 18 8 28 27 -11 -2 30 16 -6 10 -4 -10 5 -6 4 0 29 29 8 -18
4.23175a8J8J7lmj2Jj0J5Kj1RkK1j5knL6m1KL2j4k6OJ0J2j0J0l0M1k7K2Ok0Qj5J3j2Qk0J5J7j5
4.21039Ij7J2Rj6QrnqJ7lJ7j4J1oJ7k2RPjj5J7lj4K3k1OrJ2l1K8J7l5K4nl7M1ok1M2k6k1M7k1
4.18851GL6n7J4J0Mk5J0K8l0K3qmJj9K2j2k3L6k5K9lLk9L7l1j8J9J7Oj7NnmJ1j2O%J3%j0Qkq%O
4.16562IkqNK1k0nNJ8k3MKMjj5J6mK1j1j6J6%k4PoJ1J2pj8L1qk2K1Kj1ML3n7J9kK7j5%j3J3JLT
4.14171B0nmk6M2k6J5nTJ0k7K7j8K6kUrK3j8PmKl2K1J1l0K1NqL0l5K1l7K3pJ8j5KLj6J3Oqj0J7
4.11882A2pj7L2k0J9j0TqM2ql0K3j2j1K2rLJ3Mm1M8k7J9k3LpRJ2qjj2Q%OJ5qj0K%OTj8Pj1j4K8
4.09542A7k2J1L2l5j1OPJ2Tk8pj5L1j3K4jj4j8RMJ6j8j6J9K0k5J3Kk1J5kNJ7omk9M7p0P0l8K4
4.07456B0l1K0J4knormM8k7Pj4OPpk2K6j4K3j0Mnj7JLJ4k1L7k8K8l6RjpJ3NPMoJ8K3l2MoJ0J1o
$$ plain form
4.23175 -18 0 17 14 10 -2 -1 -11 4 6 -5 4 2 23 8 6 1 37 -4 -2 30 16 -10 -4 6 18 8 18 -12 29 2 24 30 10 18 3 16 4 12 -8 7 24 9
4.21039 9 -8 4 13 -3 5 -4 -9 -17 0 -3 14 0 11 5 22 0 9 16 15 0 17 14 0 23 2 8 -1 11 -20 8 25 -10 14 9 -28 13 7 -14 28 2 -19 28 7
4.18851 7 43 -14 0 10 14 -11 -1 27 -3 20 12 8 9 -10 12 0 -23 13 -12 17 14 17 -12 25 -6 -24 -5 12 18 1 6 1 -3 8 -4 2 2 15 15 5 13 11 3 3 9
4.16562 9 7 -1 4 25 5 0 5 23 0 4 6 10 9 -6 10 6 27 16 0 16 16 -8 -1 -7 4 16 9 -9 22 14 -8 13 15 4 8 41 -16 3 1 28 13 13 0 13 14 17 20
4.14171 20 15 11 -15 27 1 16 11 6 16 -11 16 -2 24 22 20 18 9 32 14 21 17 19 -13 8 19 -11 10 15 7 37 2 23 -14 9 2 20 5 7 10 -6 7 13 5 -5 12
4.11882 12 5 -12 20 0 19 9 -1 -9 33 25 -5 18 6 -5 17 8 11 24 28 -13 35 8 27 4 7 0 9 21 13 12 0 8 8 14 29 21 11 13 13 19 25 7 14 3 -11 17
4.09542 17 -5 6 38 3 -8 -2 5 17 29 1 -6 -21 10 -3 21 20 6 -12 -3 1 17 -1 -17 2 22 -3 10 12 -9 6 4 9 26 20 16 -13 34 -36 34 -4 20
4.07456 20 -11 9 23 21 16 10 1 -3 45 18 25 11 17 24 17 -5 21 7 30 20 24 19 2 3 6 20 -1 36 8 36 0 9 8 1 14 19 26 30 24 42 65 33 37 31 41 52 46
4.05065D6j2Oj1L3m4J0oJ1PLj6j1J0l0OK3j0PLj6PJ0J7k4j3L3l5j3K9j2L3ql8K9kJ2L1J5N9J7
4.03030A56j2n6J9n0K4nL0j5J4m5K2nlk6J1n%k6MJ4Km4J9Pj0J0j6K7l2Kj2PLkpJ8jJ6j5J2J6pJ
4.00843D0ON9PL6k3j2m0K9kMPj5k%n1L0Nj9j3J5k2rJ3k7jj7K6J0k9J9k6M5j0k1K2%j3l2K6PMj8
3.98706HM3k5Nj8J1J4K5l1L3l0K3k5K9k7L8k8Mk4L7n2K6K7m9K0j0J5k2k%TqJ1%OqOrOj2QK6k8
3.96570A3j8J0J8lrMkqjK6lj4l3L9j5lPkK3Jl6K6m0M8j4j6K9rk1MPk2M6l9PRrJ5j9L6k9LNTkj2
3.94229BJ1J6lJ6l7J9J4j1Rj5lmjK4l7RNKoL4m3K4l8N8k4J4k4K0j6j4JPj2J5J1L%k9oJ9K1k3J7
3.92042B5J2k9kmJKnN0m1Rj8J4LMk3J8KOpJj1J3pK1%K5n0%K9k3J7pjl0J4L2k1j9L1Rk2jj1J3q
3.89753A1J6NTrj2rK1J8k9Pk1J5PnK1j8lJ5J0LnK2KL6%K4Pj9L0k8J3k7L9k0Mm6L6k2nK1l5Mj4P
$$ plain form
4.05065 46 34 40 29 62 18 28 22 33 40 43 27 16 26 -4 2 25 15 22 25 9 16 26 43 19 6 39 4 -9 20 8 41 33 -5 24 22 34 65 80 139 156
4.03030 156 144 88 107 57 81 76 106 91 105 60 82 77 74 48 59 54 54 28 32 46 48 4 23 30 20 30 14 41 9 11 -1 6 9 7 0 18 17 33 18 30 46 39 40
4.00843 40 46 105 112 148 125 113 73 102 100 104 111 96 94 94 43 73 78 59 46 61 39 30 43 16 15 -2 24 34 5 24 -2 43 33 12 34 34 21 -11 15 22 26 8
3.98706 8 51 26 31 13 24 38 63 32 65 35 58 33 62 35 73 45 49 25 62 10 36 63 14 34 24 39 17 15 15 15 7 18 18 24 16 22 13 19 7 15 41 13
3.96570 13 -5 5 23 20 11 15 13 5 4 30 27 13 -20 19 4 1 8 6 29 30 -6 20 -20 28 14 -2 27 18 -3 1 8 -14 32 -7 0 9 0 15 -4 32 3 6 11 16 14 2
3.94229 2 13 29 26 42 5 24 38 27 36 21 18 14 13 37 0 9 14 16 10 44 1 25 -13 45 21 35 11 31 15 1 2 9 -3 12 23 26 26 -3 -9 10 31 8 25
3.92042 25 37 8 6 2 3 5 0 50 9 18 0 14 17 21 -2 16 18 24 17 18 7 20 13 34 34 59 9 9 38 15 32 25 24 -6 8 40 19 0 31 40 18 17 6 19 11
3.89753 11 27 32 37 28 16 7 28 46 17 24 3 18 25 20 41 23 20 35 45 48 43 65 67 103 103 127 134 115 145 117 130 103 142 122 126 80 116 94 89 110 75 79 65 72
3.87514G2m2K3l2J8pMl7K6J0qj2Qj3%M2l8jJ6l0J9J3j1J4l1KK7l0K4j8J2rK5k2NmJ3k7K4qKJj8
3.85378BJ8JoOKk2K5j3MJ4j4jmK7qj5QJ8j6Rj2kj6L8k9jQJ8nk2J8j5KjJ1qTL1k3%RJk3J5J2rqT
3.82936HK3j7J1k6K3j4J9Kk9LMRMJ2k8K7pMk0PNk0K2lJ1k3J4j2J0J2lk0J8j6NqK6l1J7J5j8K1
3.80800C7k9J1NJ3j7J6k2K4j6m%J9Rrjk9Qk2L9k6L9k5J7k3L2l4J5J3MKk2J9k3rL5k6%P%nM2m0
3.78663B4L0jk2K6j6npjJ7m1M5k6J3QJ3m0L5k2oJ2k4K9j2RkJ8k3Qj6MrK2Jk3K4k2J8jj9QORjl6
3.76425DK2OjrMj9M6l3RK%j2L9l8J9k4QnRJ2Tj6mj1RJ6k9jL7j3k0Mj8K7j6OJ5j7K6j8K7m9J5r
3.74186A2K3j2J4KlJ7k0NL%j0Rj0J7Ok0mTL8k1lJ1%l5QJ5J6j2J5jrJ0k1K6RopJ1jrJ7%Nrj0j3
3.71846D9j0M4j5K9n7M0kj%k3J5j2JqNPmJ7Mj9K6j2k5J3%Qj2L5j2TJ3Ml0M1k9J4j1KjL%K1l0K5
$$ plain form
3.87514 72 30 53 21 39 32 36 -1 25 35 27 15 23 10 10 52 14 13 29 -1 18 31 20 34 3 5 32 2 26 8 20 11 36 14 19 15 28 1 25 17 19 20 2
3.85378 2 20 21 15 21 23 1 26 13 17 31 17 16 12 39 31 16 24 42 26 35 23 21 5 43 14 13 21 39 34 12 30 15 17 16 27 19 11 42 19 19 28 29 6 21 33 24 16 8
3.82936 8 31 14 25 -1 22 8 27 29 0 3 7 16 20 32 4 31 24 28 8 15 20 0 22 19 30 7 21 9 19 31 28 8 26 10 15 7 33 2 19 34 16 37
3.80800 37 8 19 24 37 20 36 14 38 22 18 18 37 46 37 36 7 15 -7 32 6 45 20 37 14 46 12 27 40 44 46 24 43 20 11 46 20 20 27 27 22 64 24
3.78663 24 54 53 31 57 41 36 29 28 45 4 49 23 36 44 57 17 52 30 24 36 12 41 29 38 36 54 31 39 23 27 18 40 41 18 42 20 38 37 18 26 32 41 40 4
3.76425 4 26 32 31 22 26 7 53 20 29 31 31 19 58 20 39 15 23 18 27 39 51 35 31 20 29 45 16 15 52 39 19 23 5 32 16 22 37 20 46 28 55 6 21 12
3.74186 12 35 23 37 39 36 53 33 38 41 41 31 40 30 47 53 33 29 25 63 42 39 50 50 15 23 38 54 42 57 56 47 57 36 62 71 65 58 69 68 59 76 76 81 72 62 49
3.71846 49 39 83 68 97 40 80 78 77 77 54 69 57 58 50 55 62 58 75 79 60 86 74 49 62 62 70 58 93 81 69 82 86 56 97 68 82 71 73 72 75 75 96 66 91
3.69608I1k3J9rJ0k3M6j9j7rL6jj7NK4k8K5j0QMK6k3Oj0M5j5KJmjN1k7RTJ6pjL7rJ4J5J1lK3J5
3.67370B92M7J3M0RM3J6J8L8K7J6M7K9M5N3O7O8K5Q5N7Q2Q3J26J20J26J03J81J37K16K45L55
3.65843B809M50N77P84J028J332J740K318K965M134N849N594j409m024k364q50k2K88K03o07
3.64877B0795k496k165j439j143j092r44q73r43j233j344j356j267j045q24n15m44k72k21j57
3.63910A022j30j13q5o8l4o6m3k3k4k6k3l3m6Qj3k9Qk1j5k7J9k5j2k4L3k6oPk1j6lK1l0k4L4J
3.62079A47J4l9plrlp%J8PmJ3l5RJ6j3lk8lJ3kj7J4Pj9L0kl1J4moK3lJ6k2j5J5rL0k2k1K1j5l
3.59841F2K4Oj0J0j7J3mj3K6j3NJ5qJ3J4kK4J0TK2mJK7l1lpl%k8npK9m2J2m9N4j2rMj6rK6k9m
3.57602H2J7Lk4J3J9j6m1J6l0K5KpKj0J9j6K4j7J2l6K9j5K4l4J7j2jj8K7J2j2lJ4ml0L8k2K5P
$$ plain form
3.69608 91 68 87 78 88 65 111 92 75 66 102 101 84 89 113 85 110 100 108 112 138 115 121 111 156 141 143 144 140 139 190 163 172 181 197 190 189 226 217 231 246 257 254 277 292
3.67370 292 339 352 392 401 444 460 478 516 543 559 606 635 680 733 800 868 893 978 1035 1117 1200 1326 1446 1572 1675 1856 1993 2209 2454 2809
3.65843 2809 3259 3836 4620 5648 6980 8720 11038 14003 18137 23986 29580 28171 24147 21783 20933 20911 21199 21402 20795
3.64877 20795 18299 16134 14695 13552 12460 11516 10643 9700 8467 7123 5767 4500 3455 2631 2116 1672 1400 1179 1022
3.63910 1022 892 779 694 626 592 526 483 460 436 410 387 354 308 316 303 274 282 261 246 219 238 213 201 177 210 184 178 185 164 148 145 166 136 112 146 147
3.62079 147 161 122 115 112 103 100 93 93 111 118 114 127 92 101 117 104 101 73 70 83 81 64 78 85 66 96 94 63 77 73 67 90 87 103 81 66 81 72 102 80 59 80 65 62
3.59841 62 86 92 82 92 75 88 84 71 97 84 89 104 96 109 123 121 145 155 165 187 183 184 211 180 177 170 167 167 139 134 127 156 114 126 77 131 119 110 114 98 89 115 86 82
3.57602 82 99 102 78 91 110 94 53 69 39 64 66 59 61 51 70 54 78 61 73 37 66 51 75 41 58 46 45 27 54 66 54 51 65 61 31 69 47 72 79
3.55618G9m1J9KrnP%PMJ1k4j2L1l7L2l7M7k9J6j0K2lk5NQ%kOMj7pPrOnJ2%j1J9mRJ0k8L0l6NK4
3.53227G1j2j3L3j7Jj3K7J0Jk9L1m3K4K8k8nL5l6Nj4J3J1nK8m5J4Oj5J8r%J9j9J1J6k1j5J8j1
3.51243G0M0k6j1pJ1Tj6L1m3L0k4jj0J8j0QK7k3k1K2PJqMj8L0l1K4j9K3l2J8j2NJ2jnoJ8j4kJ0
3.49107H0Lj4omK5J6j2j5PNmJ4Qj2lk6J7kJ2j%rJ8j5qK3Roqj0KQ%jJ3jJk9L1oj4kj6K6j8L0k6
3.46716H0K6j9J1j2J4RK3l2OrLJ5lMj2J3j0K5pPj5rK4k2J3J8j0MTQl2L3l4K6Nl3L2k3K4j9QlK6
3.44528A57K4k0J0j2L3jJ0JJ6J1J6%N%Tlj1j9kJTj5J2k8L6k9j7k8L2k1K7k4K1rNlk0J4%oNJ4l9
3.42341A44L4J2j6Kj1N0j9K3K2J8K0Jj3j5J3J1MM6p2L7j4ml8RKMk0J6j3l2K4%Lk9J6mJ2j7J5J
3.40306B22J2Kk1K2j3kKK1KRl3L0j9NL0j7J2qRJ5nJ0p%oO4n2M8l5L6k1nL0PJ7K%qJ5j3K2k8M7
$$ plain form
3.55618 79 38 57 59 50 45 52 52 59 63 74 50 38 69 32 64 27 74 45 61 51 73 70 45 50 58 58 56 62 66 49 42 49 40 46 41 53 53 42 61 57 66 76 48 78 42 47 71
3.53227 71 59 46 79 62 63 50 77 87 88 59 90 47 71 99 71 66 101 65 70 56 69 80 75 103 58 72 78 63 81 72 72 91 72 83 99 78 63 81 70
3.51243 70 110 84 73 66 77 88 72 103 60 90 66 65 55 73 63 71 98 75 54 76 83 84 76 80 62 92 61 85 66 89 57 75 63 68 80 79 74 68 86 72 70 80
3.49107 80 83 69 63 59 84 100 88 73 80 85 81 95 103 91 88 62 79 77 89 88 88 79 97 82 74 97 106 100 92 82 84 92 92 91 104 103 104 75 106 100 86 84 68 94 76 106 80
3.46716 80 106 87 98 86 100 109 132 100 106 97 100 115 112 116 104 117 107 132 125 132 117 108 132 110 123 141 131 135 139 147 115 148 114 140 145 112 144 121 145 126 134 131 157
3.44528 157 181 161 171 159 192 191 201 202 218 229 245 245 250 250 250 247 236 217 215 216 217 202 214 186 222 193 176 148 180 159 186 162 183 174 179 176 156 170 170 164 169 183 144
3.42341 144 178 190 174 176 165 215 196 219 241 259 279 280 267 252 265 276 280 326 254 291 277 273 235 244 246 250 230 246 233 201 225 225 228 199 215 211 223 206 221 222
3.40306 222 234 236 215 237 224 222 224 245 247 256 223 253 234 239 269 252 264 256 265 280 275 285 278 278 272 336 284 332 297 333 312 307 337 344 361 363 363 355 370 357 379 351 398
3.38119C98k6O%L7j7k0L5J0j2J6L7l3%J3jK1pJ8J6QLj7J0J2k4M2K4l2K6L8mJ4J5k5N0j7RK5RJ3
3.36084F70L8l7K9%N3k0J8TK0K1OM5J7K5L7PM6j2PN2L3K7J2Q0k0Q8mP1J4N8L2M3P1J9R6K4O6O8
3.34151A818O7Q2O6R7O1J03Q9J07J02J17J48J26J63J39J70J76J82K37K06K38K61K71L17K91L70
3.32879F004M15L67M73N03N73O07O76P15P94Q56J015J061J151J263J332J425J462J568J536
3.31912B3796J542J438J359J200J012Q53O31M79K83J73l8r8k39l65m13n71o70p22p98r06r82
3.30844B6964j012j055j135j129j205j192j213j147j171j082j054j000r56q61q43p50p22o78
3.29928H759o18n44Tm42m57l68l73l44k94k71k61k57j95j94j88j99j48j51j27r8j24j17r1j02
3.28707B252j01p5q8o1q5o7n5n6o7o3n0Tn7j8m1l1n6l4m7qk1k9l2l8j9n1Ml0Ol9k3Lm2Rpl5Mj
$$ plain form
3.38119 398 372 378 378 415 398 378 413 423 411 427 464 431 431 444 443 464 457 475 491 499 502 485 495 507 483 525 549 517 543 581 577 591 606 581 631 614 623 648 657 670
3.36084 670 708 671 700 700 753 733 751 769 789 810 816 861 878 903 940 947 993 981 988 1040 1073 1100 1112 1192 1172 1260 1256 1327 1341 1399 1431 1474 1545 1564 1660 1684 1750 1818
3.34151 1818 1885 1967 2033 2130 2191 2294 2383 2490 2592 2709 2857 2983 3146 3285 3455 3631 3813 4050 4256 4494 4755 5026 5343 5634 6004
3.32879 6004 6419 6786 7259 7762 8335 8942 9618 10333 11127 11983 12998 14059 15210 16473 17805 19230 20692 22260 23796
3.31912 23796 25338 26776 28135 29335 30347 31200 31831 32310 32593 32766 32728 32630 32391 32026 31613 31042 30372 29650 28852 27946 26964
3.30844 26964 25952 24897 23762 22633 21428 20236 19023 17876 16705 15623 14569 13569 12613 11752 10909 10159 9437 8759
3.29928 8759 8141 7597 7053 6611 6154 5786 5413 5069 4775 4504 4243 3986 3791 3597 3409 3210 3062 2911 2784 2686 2562 2445 2354 2252
3.28707 2252 2151 2076 1988 1927 1842 1775 1720 1664 1597 1534 1484 1434 1377 1359 1318 1287 1231 1197 1150 1142 1121 1092 1060 1022 1003 952 956 926 932 893 870 873 831 840 833 798 802 801
3.26774H01k2OrmPjk5J7k2L6m8K4n4L2m2Mnj4TOl1JOnj5J4k4KLRj2k4%J7k1j0k9kk0L8m3j0qk7
3.24536D82J4qk2j9J2j2Lj2l2K0k9ll4J8k4Rl1%qJ0l4K5m8L5j8l0J4nj2%Rl1Rl0L0PKk5o%J2m0
3.22399A98K9k3Qj8J9l4L9k9J9pJ2k6LJ0k7K3m6M7l9K3J6k2kPkl7N2pmk0K2l6L1l1L0rj9pK7k6
3.20365A44K8j1J6k0J0j8NJ1J9oj7pJ6k5K7j4jJ5j4J3pMrJ9j9j7K4pK2jKk8J6N%JKPk8J2j7K0K
3.18177A74rJ3j1mrK3Rm1J5J9J4l1J9j4J4m9M7Lk4j3L1j1Mj7NJ5j0j4J8j1Lolj6QqJ6j6NkNqL0
3.15990A63j7j5NpK7j5K0l7J6J5jk2K7ol2K7j0K2j4Lk5N2k2J7oL4QK5JJ0J7J3j4RKTl4rK6k1R
3.13904B43k0kTnJ9ll8N3j6j0pRj5Qj7L1kL7m9L1j4L5J4K0J4kK6J6L3JJ6L5J4K5L6L3K2L4K7M8
3.11869F78M7O4K3Q0OJ25N4P7N7J20Q9J20J46J55J76K20K71L29M49N33P40R17J180J489J785
$$ plain form
3.26774 801 779 785 776 772 779 778 753 770 748 784 736 760 706 738 696 700 695 681 667 673 642 643 649 644 629 643 619 621 624 633 621 597 597 614 593 583 554 552 532 570 527 517 509 482
3.24536 482 496 488 466 447 459 447 450 438 406 426 397 394 360 378 354 363 332 332 324 334 300 325 277 312 294 264 278 273 261 261 270 239 248 218 248 255 257 232 226 226 238 198
3.22399 198 227 204 212 194 213 179 218 189 208 201 213 187 190 200 173 196 150 197 158 181 197 175 173 180 178 141 193 186 182 162 184 148 179 148 178 169 150 143 170 144
3.20365 144 172 161 177 157 167 149 154 165 184 178 161 154 170 145 172 158 157 172 158 171 164 168 159 178 159 142 166 159 181 180 182 154 170 175 175 176 178 185 157 169 152 172 174
3.18177 174 165 178 167 163 154 177 186 145 160 179 193 162 181 167 181 132 179 182 158 145 176 165 169 152 157 172 162 148 166 155 158 152 149 133 141 133 149 133 138 136 141 133 163
3.15990 163 146 131 136 129 156 141 161 124 140 155 154 132 159 153 121 148 138 160 146 149 124 176 154 171 165 199 207 232 233 243 260 273 259 268 270 272 238 229 255 234 243
3.13904 243 223 221 219 214 233 230 192 245 229 219 212 221 206 214 197 228 226 263 214 245 231 266 280 300 314 312 338 354 387 388 404 439 453 478 514 547 569 603 630 678
3.11869 678 725 789 812 892 898 1023 1077 1154 1211 1331 1420 1540 1686 1841 2017 2237 2508 2837 3286 3819 4559 5476 6656 8145 9930
3.10597I930K067K351K575J918J086J252J423N58n04p14o83r14r87r33q83j202j332j197j151
3.09631A2660j169j142j105j071j069j017r20q62p53o06n03m04l29k16k00j48j31p7p1r0o1j9
3.08512F97n9k0n5k8m8L1l8K0m4J7n6J0nJ7j3%L7j3NLJ4JL5J9jK8J7L6J8M4M3K0N5K8N1N3N0
3.06629I69J01M7J05Q1R2J18J40J36J99J45K67K77L34M41N68P12Q76J203J401J731J971K159
3.05510A4073K341J990J247R23J051P35L0n20o45q79r72j011r51j056j223j185j189j148j154
3.04544A0457j075j101j027r75r19q70o88o42n27m06l07k50k14j54j28j29q0o3j22j9p9n8k5n2
3.03323E47j7o7j2m8ok0k9Nl2Mk1j1k0j5Lk2rm9L3k4kj1oj6j0K3l9nMrK0j6rNK7l6K1j4Nk8L0
3.01237A24l7L3pj7%J7m6L6Ok7jJ5K0l2Nj6L8m2J0pPM3n2J7j1LMKk5M6l8NJ2NTRoN%L0J6j8K7
$$ plain form
3.10597 9930 11997 14348 16923 18841 19927 21179 22602 23160 22656 21942 21259 20345 19358 18425 17542 16340 15008 13811 12660
3.09631 12660 11491 10349 9244 8173 7104 6087 5167 4305 3552 2946 2443 2039 1710 1494 1294 1146 1015 938 867 777 716 697
3.08512 697 638 618 563 535 487 518 480 500 456 473 417 427 422 439 426 426 463 450 455 458 472 473 508 527 526 554 571 607 625 669 712 732 787 815 866 919 969
3.06629 969 1070 1117 1222 1303 1395 1513 1653 1789 1988 2133 2400 2677 3011 3452 4020 4732 5608 6811 8212 9943 11914 14073
3.05510 14073 16414 18404 19651 20574 21625 22360 22390 21870 21225 20346 19374 18363 17412 16356 15133 13948 12759 11611 10457
3.04544 10457 9382 8281 7254 6279 5360 4490 3802 3160 2633 2227 1920 1670 1456 1302 1174 1045 965 902 780 761 682 624 599 547
3.03323 547 530 463 451 403 397 377 348 353 321 325 304 293 273 258 261 239 230 181 214 190 188 177 171 155 145 168 129 124 128 119 139 123 114 119 146 110 131 117 122 94 124
3.01237 124 87 120 113 96 96 113 67 103 109 82 81 96 116 84 89 73 111 69 79 72 79 122 70 87 76 79 83 85 60 106 68 73 85 90 95 104 98 103 103 133 149 131 158
2.99050A58m0M5j1J2Tk4J9j1K0j3k8L4l8J7k4K3k7j5oK1l5L4j0j8kJ5j9j2K6om9K4J9l5K8k4K2
2.97167H2k7Mj1L2j4%J2l0J9qj2J3k0K2kPj8J6j1mLMj7j0K0Rj8J2j0K5k1k8J0J9j7Rk3K0Nq%M
2.95031C8j1PJPk6K7kl8N0pj1OLJpj4J4K0Jnkl0RnJ1LRlj1J5j9Oj1K6l2J7pK0mQj9j4L7Jl0K4Q
2.92640F1Nk4J7j3%j8K1rKTL3l6MjqJ6Qk6K2k8J3NJ0l6K6j7K7Mk3Rj7J1rjKJ1mJ4k9J7%J0k2Ml
2.90351C0K9m0L6l9J4mk1L5j3j9jJ5M1l1J1k3K3j4K3J0k8j0K3RjJ3TlJ3K3QKk%J5Oj5j3Nkk3K1
2.88214A16Nnk8K3j6j7oj6jrK3l6J2K5k5j3j6L3k6OnqJ6rprJ4qJ5k4K4J0k3JJ2qNj1K0k9L9l1
2.86077A3J8Jj2qLK6k5J1k9K1j2nM6l7J7j8L0j4Ljqj2J7J3j4J8k4K0j2J4J3l0L7MqjK5j5K4%K1
2.83992A10OoL1qj6L4l0MJ3j6k7j8N6n3oMPmm9J5nK8k8j3kJj4Pk5N0l4Pk9M7k3Nk1K1J0j5Nmk0
$$ plain form
2.99050 158 118 163 152 164 176 152 171 160 180 167 139 173 135 152 128 151 124 109 103 124 89 123 113 95 93 108 89 77 103 97 48 72 91 56 84 60 82
2.97167 82 55 59 48 80 66 66 78 48 67 59 47 60 40 62 60 67 49 65 54 50 53 57 40 30 50 59 41 53 43 68 47 19 29 48 31 40 17 37 42 34 34 38
2.95031 38 27 34 35 42 16 43 41 3 53 46 35 41 44 45 38 24 38 58 59 54 52 22 31 26 37 40 49 46 35 50 31 37 26 52 20 37 30 50 46 54 35 21 58 59 29 53 61
2.92640 61 66 42 59 46 46 28 49 40 42 44 77 41 45 44 36 52 60 34 56 28 41 46 56 20 46 29 56 60 37 46 29 40 31 30 32 43 39 53 24 41 41 51 29 33 30
2.90351 30 59 19 55 16 30 26 5 40 27 8 7 22 63 32 43 20 43 29 52 62 34 24 47 56 55 68 81 78 91 114 122 124 122 122 137 143 128 115 120 118 95 116
2.88214 116 121 116 88 111 95 78 72 56 55 46 69 33 45 70 45 32 16 49 23 29 24 16 32 23 16 7 21 13 28 4 28 38 15 16 28 20 25 14 34 5 44 13
2.86077 13 31 32 20 12 15 41 16 27 -2 19 7 2 48 11 28 10 40 26 29 28 20 8 25 38 24 42 18 38 26 40 53 23 60 64 56 55 80 65 89 89 110
2.83992 110 116 110 141 133 117 151 121 125 138 122 95 77 133 80 74 78 85 81 32 47 42 70 42 29 27 28 14 21 -4 46 12 19 -10 37 14 19 -2 19 29 14 19 15 -5
2.81804ePL0j1nk6J9J0Kj7J2qJ7rmj2pTK4rOPrJ3j0Mk0K2j1K1k2J2j4JK1k0J0mK1kJ1k2j4J4j2
2.79566DL0j7K1k3oK1j7Pk3K4k4K1k3J2J6j2l1K5J5j1oMJ3J8k9MK1ll4K2J3j0oMj6J5Pk6K9k0j
2.77480HJ7j5J9Lk0J0kmoK4lk2K4J5rJ5K4k3kM3J7l1J4MJ2jj0J1k7J2l1K4%J4m6J8j7j5k9K3kL
2.75344C9j4J3k5J8%rk3LNK9j3j0lRlTL2m4J5k1NM4l1Nk7J3KnJ5j0J0Tkk4K4J7j7Ok6K4rK6m7
2.73156bM6l2J3lk6M6m1K7%L3m1POj8J6k0N1j6L0l7J4k2K6j8L6j8J3rTmJ1Olj1j2k2M3j5J3OQ
2.71070G2m4L3pk1j9J6K4k4Pk6K6k0Qk8M5j1qjklj3nL0l6L4j8NJoK8m2L2l2nJ7j9M1k9K1Jj1J7
2.68934B8j8j4NTmK4k6J3rJ3pQk3M6j3k1qJ0J1j4J2k3J3kOJ3mJ4k4j1%K7l5K1l2J9J5Oljl6J0
2.66797iK0Rqjl0N0l4L1j6oj8K6pJMJ1J0j0mRk0mK9l3MLJ5j4J2k6M4m4K0j9J4mRJ4k9Jj4M3j5
$$ plain form
2.81804 -5 2 32 21 16 -10 9 19 21 4 16 8 25 16 12 0 -7 -14 10 1 7 14 5 18 8 12 -8 14 3 24 2 14 0 1 22 2 12 8 29 27 38 16 2 16 4
2.79566 4 34 17 38 15 9 30 13 20 -3 21 -3 18 -5 7 23 11 -20 5 20 9 3 7 20 38 9 13 34 31 -3 19 32 22 16 20 4 19 26 0 29 9 8
2.77480 8 25 10 29 32 12 22 20 16 10 34 31 9 33 48 39 54 78 55 53 96 113 82 96 100 112 111 101 112 85 97 66 90 90 104 58 76 59 44 15 38 36 39
2.75344 39 25 38 13 31 31 22 -1 2 7 36 23 13 10 19 16 13 45 1 16 -5 0 44 13 18 -9 4 6 1 16 6 16 26 24 0 24 41 24 30 4 28 19 45 -2
2.73156 -2 44 12 25 22 -4 42 1 28 28 61 20 27 33 15 31 11 62 46 76 39 53 31 57 39 75 57 70 61 52 48 59 65 62 51 39 17 60 45 58 64 72
2.71070 72 28 61 54 33 14 30 54 30 37 11 37 17 25 -3 42 31 23 22 20 17 4 -1 29 -7 27 9 14 15 9 37 -5 27 -5 -10 7 -12 29 0 21 22 11 28
2.68934 28 10 -4 1 6 2 26 0 13 4 17 10 18 -5 41 28 7 -1 9 20 6 18 -5 8 6 12 25 21 35 11 0 0 27 -8 13 -19 0 15 21 18 17 -19 -9
2.66797 -9 11 20 12 11 -19 31 -3 28 12 6 -12 14 7 8 12 23 33 23 19 28 8 4 33 0 4 7 22 8 20 -6 38 -6 14 -5 9 5 14 28 -1 0 -14 29 14
2.64610A4k1J3jL%J7k7Pj0K9k1L1k7%j6L0k1L4k2j2pL8m2M6k1J9j7Mj3JQj5Rj0J2j8J7KJ6j1k
2.62524A6j7K7j1j9M2k1j1Rj2K5k8L1j8%plJ9jOJ5l3mOPpPj1j2J0jQJ6m2J0RJ3jK6l7K9jk1pM
2.60286A0J1j3Pj6Oj5NJ7k4M8k8J9j6NrRJj7J8k6L2Nk9J0PTlTj2JPN%j1J1oJpPJj7lPM0k7mTJ2
2.57844A9l4L9j3PqK9k0mrK2j0jTKOjk0KK6k4J9qL6l4L3k9jTJ3k2K0oj3%QLTKk1K9j6pK3qMNPk
2.55402D4jj7j5L0l0J0lL1k7OJ0Ml7K3j5K1j0J2Ql6J9Mpj6J2Qj6K4k5lOj4K0lMj3J0k1L7l8L1
2.53316B7j4K6k7J5JmqL8k6j2L4qlj6L3j0rnk3L7k1K9J2j6MmM0j5K0QrJ5J4J1ML8l2K8RM4qK2
2.51180B39M4L4J2K9O8P6Q7J15J82J86K47L01K55J01o5k2M5J45K31K70K52K87L84O10N45J83
2.49857D841k52k78j15R8L21K90L64J88L36N46P61L00l77o35m09j24J09J80J34r0j10L1K53J63
$$ plain form
2.64610 14 -7 6 5 8 8 25 -2 5 -5 24 3 34 7 7 -9 21 0 34 12 0 -7 31 -11 35 14 33 16 20 7 8 16 1 10 0 12 -6 11 13 29 18 16
2.62524 16 -1 26 15 -4 38 17 6 15 3 28 0 31 13 13 6 3 22 21 27 42 9 5 11 18 11 18 7 -5 5 4 12 28 -14 -4 5 18 17 43 6 35 34 13 6 10
2.60286 10 21 8 15 -1 5 -10 -5 12 -12 36 8 27 11 16 7 16 17 0 18 -8 24 29 0 10 17 24 21 18 6 7 14 19 19 8 19 13 14 7 14 15 -2 -5 2 42 15 11 7 19
2.57844 19 -15 24 11 18 10 39 19 15 6 28 18 17 16 18 24 23 3 5 31 7 26 18 54 20 53 24 23 22 35 13 33 27 14 14 22 25 28 30 9 38 22 15 38 30 34 39 46 44
2.55402 44 43 26 11 41 11 21 18 49 22 28 38 42 5 28 13 34 24 36 44 8 27 31 24 8 20 28 12 36 11 8 14 0 20 17 21 8 18 -3 34 -4 27
2.53316 27 13 39 12 27 28 24 16 54 28 16 50 42 39 23 56 46 37 32 9 46 25 54 66 50 54 50 90 75 95 103 94 109 123 134 138 176 144 172 181 225 217 239
2.51180 239 283 317 329 358 426 502 589 704 886 1072 1319 1620 1875 1976 1911 1889 1934 2079 2310 2580 2832 3119 3503 4113 4658 4841
2.49857 4841 4589 4311 4196 4294 4615 4905 5269 5457 5793 6339 7100 7400 7023 6388 5979 5855 5964 6144 6278 6188 6078 6109 6362 6525
2.48636F525k70n80m76l04j68p4q9k52l10k27j14l7j54k98l30k39k02j59k14j81k54k47j80j40
2.47415A026j08j01p5n3r6r1j28n2p7o6n3Jo0Qj7j5oNj2J4Ql9J7Mrj3J0pRJpJ1j1J1m2J7J4Oj0
2.45431A4Jj8K8k5K4k6L1rj6nMlK5k2J0l0K0J7l5L7rmoL1nj4qJ6k4J0K3k4J0K2rNJOk1OJ1Qj2
2.43244C5J2QMj7J0J8k5NkmnmpL5k0NMmOJ4k2Qnj4K9ol9K9npPJJ2j7J1j3Okk6J5J9ql8L0l5M1
2.40904C9j4TMlJ5k7K9m3K1Pk5L0mKk6J8K1Kk7J8j5J5Pl7M0j1nj3K3rJoJ4oj8RK0k3mk2K6jMlP
2.38615A6l1L3l5M8k8J4lJ6l0J7%LKj2PmKQl3K7Lj2jmLJ7k3K4j9J%QKNmJmj7PJ4qJ9j8K0m7K9M
2.36224A7Pl7K8jJ7Lj5J5j1J0k3oK9j9K9l3K3mqQLj4j5K3Kl0J7Qj4J4j2JNjoj0j6L3mpK1k1Nr
2.33985Bj0J9j9J4pjkQJ9j3j7oJ9K3jj9j3K9n3L8j0rJ9J8k6K1l1QnJ1KnJ0Nk7RJ1j1JJ5j8J0%K
$$ plain form
2.48636 6525 6255 5675 5199 4895 4727 4653 4564 4312 4002 3775 3661 3624 3470 3172 2842 2603 2401 2242 2028 1847 1593 1346 1166 1026
2.47415 1026 918 817 742 689 593 502 374 322 245 179 126 127 67 75 58 43 37 42 30 44 52 13 30 34 25 12 22 15 24 25 18 29 18 29 -13 4 18 24 14
2.45431 14 15 -3 25 0 24 -2 29 20 4 -1 3 0 25 3 13 -17 3 20 -15 22 13 9 3 34 29 15 7 23 -1 9 32 8 18 40 31 36 37 43 22 28 39 47 35
2.43244 35 47 55 59 42 52 70 45 50 48 44 39 35 28 63 43 48 52 48 54 68 46 54 49 35 64 58 19 48 43 36 43 44 56 39 50 37 43 41 15 30 49 41 3 33 -2 39
2.40904 39 25 11 15 12 27 0 29 -14 7 14 -11 19 15 17 -9 9 30 32 5 23 8 23 30 -7 33 22 17 4 27 18 19 13 27 21 3 12 32 9 5 -17 9 8 12 9 16
2.38615 16 -15 18 -17 31 3 17 14 30 0 17 17 20 22 10 17 13 15 23 -10 17 20 8 7 3 6 23 0 24 5 6 6 14 16 21 17 18 14 -3 4 18 10 29 11 31 -16 13 17
2.36224 17 24 -13 15 14 31 34 19 34 23 33 10 4 33 14 43 10 33 29 21 29 32 18 3 26 28 -2 15 23 9 23 11 12 17 16 10 0 -16 17 13 6 27 6 11 2
2.33985 2 -8 11 -8 6 -1 -2 -4 4 23 10 -7 -13 6 29 28 9 -4 25 -28 10 0 -9 10 28 2 23 -8 0 -5 6 8 3 13 18 -9 0 11 0 1 16 -2 8 8 10
2.31747A0Qlk3OlJ2J0k6jJ6nK8m2K6mQrj3K5m8K4QTj4J8%j7jJ1lKpMJ1k1NPJ2j9RoJ4j5J5J0j
2.29407B6j5k6J8J5pLpK0k8J0k1K0j0K8mj3lPj3J7J1j9N%nNj4J2j5OJ3p%oKlqJ8QK2n4M5l0K9
2.27169C2l4J7QJ6j2OklK0k5L7l9K2rK3m7K3M0j9oProQOnLj3j8M2k8KkJ0J2l0K6j1mj6K5l7K9
2.24981C9j3TqK3kJ2rl5K0kMNj4nRl7M4k1J6j6Ok3K6l2L8j9PL2l6L6j4J6m2L2k7J7pMpk3K3J0L
2.22794A7J9k1KlTj8J3kNJ4k9OJ6koJ1j5mLj6K6KpnjJ0lJ%mOJ1l5L4J7l1rmJ1nK9m3K2lJ6k7MN
2.20352DJ5n6L1nK2Pj0pjPk5K3pQNjk6L3k6L7m2K2j5K8j8K4j4MKj5OLRk1K4l8J5%lJ3k3J7k4J9
2.18114ALlKnKj3K4j1PqQOj6NJ9k0rK7k8J9j2K3k1P%OTj3%k3K6j7J3MRk2kK2k6kJ3j4J0J8Nl2M
2.15723hJ2jk4M1k0%Mr%KOqK0k8K7j8kOqL4k1K8l1K3k5lPk7K6J3j5jOJnjJ3k2kjMjPJ2k6J6K%
$$ plain form
2.31747 10 18 15 -8 -2 -5 7 17 -9 -10 6 1 29 -13 13 9 17 8 -5 20 -28 -4 4 12 -2 16 16 -1 -2 9 6 8 1 5 16 -5 0 7 19 0 9 3 17 2 17 27 26
2.29407 26 11 -15 3 18 11 14 7 27 -1 9 -12 8 -2 26 22 9 6 13 0 17 28 9 14 14 9 14 0 12 -3 3 16 9 9 3 5 2 -6 12 20 42 -12 33 3 32
2.27169 32 -2 15 23 39 27 33 31 28 48 23 60 21 43 34 57 10 33 73 54 48 55 46 40 48 54 49 52 39 21 63 35 37 35 45 57 27 53 42 38 22 47 10 39
2.24981 39 26 13 5 28 26 38 29 -6 14 12 16 21 7 2 11 -26 18 -3 13 -3 3 -20 6 -26 12 -7 0 32 -4 32 18 34 -8 24 -3 14 7 11 4 -19 4 14 17
2.22794 17 36 15 17 14 11 -7 6 4 9 23 -6 0 16 14 8 19 4 0 3 -13 13 15 8 3 2 12 9 10 10 6 12 23 -12 22 39 8 -1 -5 6 1 30 -13 9 6 22 -5 -1 4
2.20352 4 19 -37 -6 -11 11 18 8 1 0 7 -18 5 -2 6 11 10 -16 17 -9 28 -14 8 -7 21 3 27 13 17 19 4 10 13 22 1 25 -13 2 2 -1 12 -11 6 -18 1
2.18114 1 4 1 3 -2 0 -13 11 0 7 -1 7 13 -3 2 21 1 -8 19 -9 10 -2 21 0 7 7 13 19 6 6 -17 9 -8 5 9 18 -4 -6 16 -10 -12 1 -13 -3 15 20 -12 -8
2.15723 -8 4 3 -21 20 0 0 4 -5 -5 -3 3 -5 15 -13 14 -4 -6 0 -8 26 5 33 2 25 0 -3 4 -23 3 16 1 0 6 7 2 1 14 -8 -10 -11 -7 -8 -1 11 -15 1 3 3
2.13281Cj1L5l3kK3Ok5LjPnPj5QLO%jj4KOK3l5jK9k4j5J3J1K5m5M4j5k5M%Pj7N0l2Pj9J8NoO%M
2.10839A4j7J6k3J5jk6M6k2J8j8J9j6qj9K2j1L6m1M2k6L0o0N2l3K5k0MNJ0nj5PK5lk4nK4J6nl2
2.08804dJ6kqk9L9j7NJ1kj3PJ8k3%K0j6j9J6PlmPKoPKJ0k1J1Qk5K6pJ2k2jRk1NRJ8j9JKqJ6j7J
2.06362bK0Pj2j3J3k4K9k5J2j0K7k8OnoK8l7K9j0LJ3Pj7KPj6Qk5RL5m2L3k1KM1m1J9Qk5J9k3J
2.04226dK5k3j2LJ0J9j5mNqkK3qk4M7m3J4K1pj7mJ7j0j2lJ5J0Omj6J2rQqJ2Jnk3K4j5mJ9j6nL1
2.01937B1k6QjnKJNPmk9N0k9J2k7M2k8KoJ7oOLTqMj7K0j4L5l5Mj3J4jqL4l1OJ5j6j4oL%M7l2J3
1.99546A8k8J1Pk6M3l8M5l6L3l8QM0l6J1L%OQl4L7j9lj2J5J7nJ1OM1j5M1K2N0J28J93J53j36
1.97663E21j50j14j7P6P0N7l8q2p9J4o9J7j9J5J1n8l9k2l5k0l9RK2l9M0j8TL9l9K2l0J7j9J3PO
$$ plain form
2.13281 3 -8 27 -6 -8 15 21 -4 -1 -2 5 0 7 -8 0 3 9 9 8 -6 -4 2 25 -10 -11 18 -6 -21 -8 3 28 -17 27 12 -13 -9 -9 -2 -19 31 -1 6 -13 5 10 4 10 10 14
2.10839 14 -3 13 -10 5 4 -22 24 2 20 2 21 5 -3 -22 0 -11 25 -16 26 0 30 -30 22 -11 14 -6 -2 3 13 8 -7 0 25 22 -2 -7 17 33 28 -4
2.08804 -4 12 10 2 -27 12 -5 0 11 9 -4 3 21 -2 -2 18 2 -17 -1 6 3 -1 6 8 2 9 11 21 0 11 19 -6 20 13 25 3 2 11 -10 -5 4 22 3 4 6 -2 14 -3 -2
2.06362 -2 18 25 13 0 13 -11 18 -7 5 -5 22 -6 0 -5 -11 17 -20 9 -1 2 15 22 5 7 14 -2 6 -19 -10 25 -17 16 -5 -3 38 -3 16 24 -1 18 -5 -4
2.04226 -4 21 -2 -14 -11 -1 18 3 -1 4 -4 -6 17 9 -15 32 -11 3 24 17 0 -4 13 3 -9 -12 3 13 19 15 -1 11 2 10 2 14 15 10 -13 11 -4 -8 11 -5 -10 21
2.01937 21 -5 3 2 -3 -1 0 5 12 8 -21 29 0 12 -15 27 -1 1 -5 12 6 12 15 18 10 14 -3 17 3 38 3 7 -6 8 7 -1 33 2 8 23 7 -7 -13 -10 -10 37 5 18
1.99546 18 -10 1 8 -18 25 -13 32 -4 29 -9 -1 39 3 14 17 17 23 31 -3 34 15 12 0 15 32 27 38 44 85 70 111 133 183 311 504 657 521
1.97663 521 371 257 240 316 386 443 405 323 244 258 189 206 187 202 213 155 116 94 59 39 0 9 31 -8 32 14 -4 35 -4 18 -12 5 -14 -1 6 12
1.95832A2K2k6KJ0JJ2k0%J7k0j7K0Lpl9L9KrTOlK8k4j0L9jl9M1l0K1rK1l3QK1k2%j2MOj1J9j3Q
1.93594Hj4Pl%j3K2lqJ7k7QJ3Rj2j6K6j7J0Lj2j5J8rK2j3k2K9l1L1J2j8j4K2J7k4Pj7P%J5Oj0J3
1.91406B4l2NOjkK7m7K2J2j5Ok1M2k4J7j1J0k9J9J2j9K2k5kJ2Nkk2K6k1J1jPjLk4M4k2oMJ5m0N8
1.89219D2p5N8m5M6jol4J2jJmJ8oqK0l0jPJJ4J1%k3J8k6M0j7PJ4m1K5k9QRpJJ6rkj7L5j7RJnmR
1.86828A4K1m0OJ7k0J5j1kK0j4k1J9pnPJ3rqK2jj6Mqmj0J2K7l6J7J9k7K4pLk3J5K9k6J3j8Qj7K6
1.84640B1jj1J7l9QOK3k1Oj0J7Pm0PK6j8RMKTk9PL1l4K4pJj3L2l1J9k0J5k4QkLJ8k4J2JK7l2K1
1.82402A8l3OJ1K8qlJ3n3M4Nk4kpOJ6k1%PpJ1J6l8M8rj6k8J9J4j9%K6j2j4J3rj6M5k2nJ1pKmRq
1.80113CL6l8OqLj5RL4j4mloK4j1oj9J8k4J9j4K1k9K4jKk1K0j7L6l6L4m5L1j0J1jrJ1mJLkk0K9
$$ plain form
1.95832 12 34 8 10 20 21 33 13 13 30 10 -7 13 16 9 -30 9 11 2 -7 -1 -4 24 0 -10 29 28 -11 30 0 21 12 33 0 8 29 7 7 -5 -1 5 -6 13 0 8
1.93594 8 -6 1 -2 -2 -15 7 4 -4 13 -14 -6 7 16 4 -12 14 -3 7 10 -2 -17 1 -8 14 1 -21 8 -23 8 20 2 -12 10 27 3 10 -7 0 0 15 21 11 24
1.91406 24 -8 -3 3 2 0 27 -20 2 14 -1 5 -16 26 2 19 8 18 -11 8 20 1 23 -2 -4 8 13 11 -11 15 -6 5 4 11 10 13 -11 33 11 5 9 24 -16 42
1.89219 42 -33 25 -20 26 25 19 -15 -3 -4 -3 -7 11 5 -3 17 -13 -14 -7 -6 8 19 19 -4 14 -12 28 11 18 32 -9 16 -13 -5 4 -3 -2 14 5 3 -14 21 4 13 14 9 5 14
1.86828 14 35 -5 1 18 -2 13 2 0 20 6 -15 4 -3 -8 -1 12 3 -5 17 16 0 4 -4 -8 -18 -6 21 -15 2 21 -6 18 11 14 -9 6 35 9 22 4 12 -5 21
1.84640 21 20 9 26 -13 -5 1 24 3 9 -1 16 23 -17 -10 16 -2 7 11 13 15 -14 -7 24 -10 14 7 8 -5 27 -4 15 -5 10 -14 -6 -8 -5 13 -11 1 2 29 -3 18
1.82402 18 -15 -9 2 30 22 19 32 -21 23 28 4 2 -5 1 17 -4 -4 3 -4 7 23 -15 33 24 8 -20 -1 13 -6 -6 20 8 -6 7 -2 -18 27 5 0 11 4 6 2 11 3
1.80113 3 39 1 7 -1 2 -13 -4 30 16 12 9 3 27 16 10 -9 9 -15 4 -10 11 -18 6 5 7 -14 6 -11 25 -11 23 -22 9 -1 10 9 0 11 7 8 11 9 -11 18
1.77875A8j5J7rqQk2J0MP%j2K0j7L9l1Rj8rJ5J0Jk8OJ7Mj0Mj1TK8j1pkj2K2k5J9lNJ1rMj3K2j2
1.75585EJ9j2k5L3k1JJ7ll3K7rJ2JmpJ2j8K4k5RlL4l9L5j3j6J8j7NMl1J9J2j3K6j1k6kL6pj5qQ
1.73398aJ4Mj7j0j3QK4j5L1k3KQNj5Oj1K1Lk5K4jj5mnkK0oj1L1k7J2MjlJ1j4k2M0k4L8k0J2l1lT
1.71109dNJ7jj8Qj5jJ5Qk0L0j8J%mNJlQj0j2J3Qk2J8kJ8j9J0k4J5rK1k9L0j9K2l9J1TRj7J6J%j5
1.68769@J9k7%j0L7k6J4pj6K6oJ8j6J1j7JL%LJj3QmOJJ3j7J0pl1N6nqjJ1k5J4j6J1LJ6k2Mj3j9
1.66479b0M1k8L8k4ROPk7qOoJ7J0MOl8%JKJ2JqJ0j1J9qLk0j0K5jJ2koj2NQjj5j6J8J2OpMk5J4l
1.64038@j3J8j1K7l6M0l7lPJRK2k7J5k5N2m0L7n2L4jRk8J0j3K1j8PMrJ1%k6L3J3l6RKj4K3j2Rkm
1.61799FQqJKL6n1QjTmK0j8OJ5j4klKK3k6PNoLqK0k4J8oM2o2L3Pk3K2j8k3J1KL1l3LTNpRk1J6Lo
$$ plain form
1.77875 18 3 20 11 3 11 -11 -1 3 10 10 -2 18 1 40 9 18 0 -9 6 16 17 -11 -5 12 16 6 10 -1 -12 16 5 -2 -4 -16 6 -19 0 -3 2 13 4 8 -5 17 5
1.75585 5 24 12 -13 20 -1 0 17 14 -19 8 -1 11 12 8 1 13 -5 19 -6 3 0 34 -5 30 17 1 19 2 7 11 -20 -1 11 -2 24 13 -13 -15 21 14 -1 -9 -1
1.73398 -1 13 17 0 -10 -23 -15 9 -6 25 2 4 12 17 2 8 -3 18 21 -4 20 19 4 0 -5 -7 13 7 -4 27 0 12 16 15 12 23 9 -13 27 3 41 21 33 2 -1 -4
1.71109 -4 1 18 17 -1 7 -8 -9 6 14 -6 24 6 7 7 3 8 9 6 14 4 -8 5 13 -9 9 7 25 6 16 -8 7 -2 19 -10 20 1 23 -16 -5 6 15 -2 14 15 15 0
1.68769 0 19 -8 -8 -18 19 -7 7 0 -16 10 4 22 6 17 0 1 4 4 7 8 -5 3 -1 5 6 19 2 12 5 -26 30 25 17 16 27 2 16 0 11 14 30 8 12 -1 -20
1.66479 -20 21 -7 31 7 16 22 29 2 -6 0 -6 11 21 25 31 -7 -7 -6 -4 8 9 1 11 0 19 11 14 -6 -16 9 8 20 18 12 0 5 13 12 -3 -19 -1 11 17 10 14 -11 3 0
1.64038 0 -13 5 -6 21 -15 25 -12 -15 -8 -7 2 24 -3 12 -13 39 -1 36 -16 18 17 26 -2 8 -5 16 -2 5 9 0 11 11 -15 18 31 -5 4 6 -8 15 3 12 10 6
1.61799 6 14 6 7 9 45 -6 2 1 0 -4 16 -2 4 19 5 3 0 2 25 -1 6 11 5 8 0 20 -4 14 8 50 -12 21 28 5 27 9 -14 -3 -1 30 -3 0 3 8 1 10 -11 5 8 2
1.59256BKK2j3rkK1Nl0QpQl4N2oKj6MrK6l1J2K1l4NK7m1J5J9k6K1k6oJ9MQRk9ML%K4k0%PTj3KR
1.56814A6k0K8k4Nj3J8MnTj3J8JlJ8k1K1m1J8L2k7j6L4k6lTPK7j3j7nJ8nj1K0k6J7k8OJ4J2j7L
1.54677eJ4NJk5K2k0J7l2L4j5PnOlJ3kj2QTKjj8oPJ2J4j9j8K1k0K0kpqjL1j0qjJ5j6RoTK6k5jJ2
1.52236A2ROm4L0j0JnRlJ4j6j1J3k2J6kK5j4Nj3J3Rj2Qrl5L7%K3m2J3mj3J7jOMno%J6k4J5k1J9q
1.49895@J0j6K4k6j5L7j9K5j8K3k2J5l2L1Rj1j8J5l1L2Kk%j3k3M2jNj4LTRj1%Rk8RnJ5j3pL6l0L
1.47657BRJJ8l3OPknOJ0k0NJ5Rl9J6k3L2%Tj6lJ0qJ0pK3k2J0k8L8j2kK2j8j0J5k5J3mK7j5k2L0N
1.45368B5l4J5j9J5k4M6l2J7ONk0K7k7j0J8LkOj1J6j2lMTk9M4j7K1l7OKPj0JJ9j0jq%NMl0K8Rj9
1.43079bj5M0k5RJ1LKPl1kNJ5qJ9j9K3l2K9qlk7L7j6mQk3L5j6K6m7J2LL3l2pj0NJ3PnJ7k8L1j2m
$$ plain form
1.59256 2 4 26 13 4 2 23 28 -2 6 -1 7 -27 25 19 21 5 9 0 26 -5 7 28 -6 -1 26 -15 0 19 -7 14 -12 -18 1 5 13 22 -7 -3 0 0 24 4 4 11 18 5 7 16
1.56814 16 -4 24 0 5 -8 10 14 9 4 -9 9 10 7 25 4 25 -16 2 34 7 -9 25 -1 -4 -7 0 27 14 -3 -8 10 5 -6 14 -12 5 -23 -17 -3 9 -8 -5
1.54677 -5 9 14 15 -10 12 -8 9 -23 11 -4 3 -2 4 1 14 12 0 8 16 18 17 -1 -7 0 12 26 7 -11 10 -10 10 8 1 -7 -8 23 13 5 4 19 3 12 6 0 26 1 0 12
1.52236 12 21 27 -17 13 3 4 -1 8 5 19 3 -8 5 -17 -1 -3 22 8 13 0 13 22 10 18 9 -26 11 11 34 -8 5 1 -12 5 4 10 14 9 3 3 19 -5 10 -11 8 0
1.49895 0 10 -6 18 -8 -23 14 -5 20 2 25 3 18 -14 17 26 15 -3 12 -19 13 15 13 13 0 -23 19 18 23 9 12 15 24 13 13 22 -6 3 -2 13 0 -7 29 -1 2
1.47657 2 11 12 30 -3 3 10 8 3 9 19 -1 4 19 28 -11 5 -18 14 14 14 -2 -5 5 -3 7 0 23 1 11 -17 21 9 7 29 11 1 16 -9 4 0 27 12 -10 20 25
1.45368 25 -9 6 -13 2 -22 24 -8 9 15 20 0 27 0 -10 8 11 9 15 4 20 8 5 9 13 -16 28 11 32 -5 1 3 10 0 1 20 10 9 1 1 6 10 -20 8 17 -2
1.43079 -2 -17 23 -2 7 18 21 23 30 -1 -3 2 17 9 28 9 32 0 29 21 18 -9 28 12 8 16 -7 28 12 38 -9 3 6 39 7 0 -10 -5 8 15 10 27 -1 30 18 14
1.40789A4J5j2j5mJ1Jj4K0j6J2j2MLJ1j6J1J5k8J0jnTkJ3j0JJ0Lk2L5k5mP%pmL0j7PmJ0rJ4j6j9
1.38500a0K3j3J8Orj1MJKj9J2RJ0Nk3QPLk7K0l4J2K4k0%JnL9j2j9j3L2lqK5l1J3nj2OokJ5j5Lj%
1.36109@K4k3Rj1JJ3J2jk4J2lpK5k7kL5j7Pj1J9j7%jNk3L5k6KmJ1pNK9j8j6RnJ5j0j8J2rJ6j2j0
1.33820fOJ4J6n2M6l9K9j5M%j0J8k1K3n%LK1m0jOJ7Nlj6L0k0Jj1K5j7KJ9j2k9J1K6k8J5J1k4%Jp
1.31582gK7l9K6K7j6j3J1m%k8M7k6j1K1%k3K0j2K3k0L0j6j4oL5m4K6J0j5Nk6N1o3N7m1J5k7M6k9
1.29598cmqL8k1JoJK2lm0L8p%J4k8L0l1M1m8K9j8J4Ok2ONJ5k6M2k3J8l1RoOPj6MJ3rk%J0qJ6qo%
1.27156A1J1k4M6k6KpJj9PJ0PkK2j5jTj0K3j1Nj3j6M5m4J6Jj0K4k3KJ7j6j0J0j2PJ3j3kK2k9L4
1.25019C2j4k1K0lJoM7k4kk8J7MJ5km5J4TJk2K5j9K4j0J2l1K6k2L5k5ONJj1lJ7J6j3mk5K4j9L1o
$$ plain form
1.40789 14 29 17 2 -2 9 10 -4 16 0 12 0 4 7 18 2 13 28 0 10 9 4 -1 -3 10 0 1 11 14 -8 27 2 -2 5 5 -2 -6 24 7 14 10 20 11 25 9 -10
1.38500 -10 13 0 18 24 15 4 8 9 11 -8 4 13 23 28 5 13 20 23 -4 16 -18 -6 18 -2 -2 -1 -6 33 21 2 -11 21 18 10 35 4 17 12 0 6 0 -2 13 -2 1 0 0
1.36109 0 24 1 10 -1 0 13 25 24 0 12 9 2 27 0 -2 33 16 23 12 31 14 14 13 18 -5 30 4 6 2 13 6 11 40 22 6 15 10 25 15 -3 9 0 16 4 -6
1.33820 -6 0 14 30 -22 24 -15 14 -1 3 3 -7 11 -10 13 8 8 11 32 -8 -9 -3 14 19 16 0 30 10 11 0 25 8 10 29 17 -12 -1 25 -3 12 23 -1 -1 0 -7
1.31582 -7 20 -19 7 34 18 5 16 12 12 -16 31 5 -6 15 15 -8 12 0 23 3 33 17 3 -3 32 -12 14 24 9 14 -12 39 -24 33 -8 7 -20 26 -3
1.29598 -3 -7 -15 23 2 3 -3 -2 20 17 -23 15 8 8 22 -6 24 -7 34 -14 15 -3 11 17 -5 1 6 21 -5 37 14 32 1 10 4 10 17 1 5 18 9 7 7 17 9 25 17 11 11
1.27156 11 22 -2 44 18 20 13 14 -5 2 12 19 17 39 24 23 22 12 35 24 29 16 0 45 1 17 18 8 32 9 11 28 12 2 12 0 7 20 7 5 27 -2 32
1.25019 32 18 -3 17 14 15 9 56 32 30 2 19 23 38 36 -9 5 19 20 -2 23 4 28 18 30 -1 25 3 38 13 19 24 25 14 11 28 44 31 27 2 26 7 38 32
1.22832C2Kk9K2%kNkoJ1j7J8j7J2JNlJ0rk0K6k7K3mk2M7l1J4JNPj7J7k3Rj4K6l3L0l7K6k1K8Oo
1.20594D3J7pj2lMLkj2JkNL2k2L7l8R%Tj4K0l6J4rKL2j0j9J6jPrTM6l2L5M9R5o3p1KmLlK1j4Kk6
1.18203G7J1Mqj5RLj3Jn1L1m9L5l2K1j0J0J5mk0MJ3NMj4JqRkRJ0mK7J0lP8J71J03j94j01qL9J2
1.16066A76N7K5o9l9k5Mk2J0Oj9lj3j1p7M9m0L3l1K6k0jj5L3j2k%NMnj6NK8qk9M3K5pj8N9K1R4
1.13980B21j9o9k5j0L4Oj3J4j6j7oJ2k9Mnj7J8j6mj1Nj9j2J8l6K3Jj4Nk1NLPpPRl5K6j2J4K0rl2
1.11793bL1pj8%K5rJ2Kj1Ol7QJ%K0k3J2J1j8j6%QMJ7J3j0j7L5l4J1Jk6K2J2oj7L0l0L1Pk4mQj8
1.09555@K6k0pLTlTmNPlJ4j2k3K7j1j3L2Mj9qoM3j4j8J4Ojj4M%Qj7Qj8J5Tm2L6Nk2K1J7k6nQJ7
1.07164B9l4QRK3k4oRK0k9NpjJ0j3K4j8PTnj2nLj3K2nmjKJ9j4MLJ5j8kJnJ7l0L6k7N0m7j0J9Ok0
$$ plain form
1.22832 32 34 5 27 27 25 30 28 22 33 16 34 17 29 30 35 32 42 33 13 39 12 35 31 9 56 25 39 40 45 52 35 52 29 38 24 50 17 47 10 36 15 43 49 43
1.20594 43 60 53 41 38 42 45 43 31 32 30 35 67 45 82 44 53 53 53 39 59 23 37 28 30 62 52 33 49 48 55 46 37 83 51 86 135 230 167 96 98 94 97 94 115 101 103 77
1.18203 77 88 92 84 69 78 81 68 69 18 49 0 35 3 24 14 24 39 35 15 19 32 37 41 27 28 20 29 27 36 46 42 69 79 76 154 325 428 234 133 125 164 176
1.16066 176 233 258 189 150 125 129 107 117 123 104 101 88 77 0 49 9 42 11 37 17 16 1 34 22 20 20 25 29 24 8 13 41 33 4 47 72 65 47 106 127 221
1.13980 221 202 133 108 98 132 138 125 139 123 106 100 112 83 87 82 65 83 67 63 52 57 38 26 44 8 31 32 18 23 2 7 10 17 10 17 26 -9 17 5 19 39 30 -2
1.11793 -2 29 22 4 4 29 20 32 34 23 29 -8 0 1 1 21 -2 10 21 3 -13 -13 -5 -1 16 29 19 2 37 3 14 15 -11 11 23 17 0 30 0 31 38 14 10 18 0
1.09555 0 26 6 -1 2 5 2 -1 -5 0 7 4 18 6 -17 10 -1 -14 18 22 3 -5 -11 32 18 0 14 20 19 5 9 9 17 0 8 -10 5 20 -22 14 19 -3 18 35 9 4 12 29
1.07164 29 -5 3 12 35 11 5 14 34 5 10 3 2 12 -1 23 5 12 19 14 2 -3 0 -13 9 4 0 -1 1 20 6 10 13 28 10 8 9 4 21 -9 27 0 50 3 -7 12 18 -2
1.04773bJ4lj8K0n%nj3PJ5RJ3k9K4l5K4j5J7oj9L5oj2j9K6qJ6j5mkmQRP%k9L1k7K3pj8mK8k8L8
1.02484C1j1Pnj4K5k7N%kQj8J3j5J4j1nK7j4K2n1PMjLL3rPm0N9l6Jj6L9l0J1OoJmTJ3KMoTJ4k0J
1.00042FqJ0LK0n2K3J4RJ4k8kmkJJ0j9%oL5k7K9ok5j5K5j9L7j7JJ5j7j2%K7j4J1Rj3k0K8J0k6L
0.97854Hj3L6j3rMlTPLrRl1j0M1J1k0j5L1l0L7k5J9jk5J6%pk1L0j7rK6j1mK2l9K9l4M4j5j7K3j8
0.95667cJ2MKqrRK9k6LjTMJ0k6K0k1O6q4K0J0n%OLj9L5k4Rj1RJ7m2PkPJ1Oj2Ol2K7mK8j3k2LRN
0.93225A2k0K3k1MJ3oj3N1n9M7k1J1k0J3MJ2l9K0k2J9K8l6Nj7NK7Pl6QJ0MTLj7OrlNpK1J8k1j0
0.91038CK3j2nJ5j5K1l8J9j9J6rJ8j0lmj4L8j3k4nL0l3K2J1j1J1LJj2L7j0j7k2L4j9K1j8Nm2M2
0.89003A5j5kL0k4Qj6J3oJ1nlpJRJ7k1Ok7M4j0qmL0l8L0j7J7k5jmJ2pK5qj2qK8rQk2J6pOTkj2np
$$ plain form
1.04773 -2 12 9 -9 11 6 6 1 -12 -5 10 19 32 3 27 -8 16 1 18 12 -7 28 22 10 -9 17 9 25 10 6 4 0 8 17 24 24 -5 26 -1 22 15 -3 -7 21 -7 31
1.02484 31 20 27 22 8 33 6 11 11 9 17 -1 12 -3 11 0 -5 22 8 30 -21 -14 -10 -11 -8 25 16 23 -17 42 6 7 -9 30 0 11 17 11 12 8 4 17 19 23 17 11 25 5 6
1.00042 6 -2 8 11 31 -21 2 16 25 39 11 9 5 3 4 14 -5 -5 -11 24 -3 26 20 -5 -20 5 -14 23 6 7 22 5 -7 -7 20 6 17 26 13 -7 21 31 5 8
0.97854 8 -5 31 18 9 13 10 7 14 17 8 17 -14 -24 17 28 8 -7 24 -6 31 6 25 24 -1 15 15 8 -13 17 0 -9 17 6 2 24 -15 14 -20 24 9 -8 15 -3
0.95667 -3 9 13 15 7 -2 7 36 10 13 12 11 15 25 -1 19 -2 64 -20 0 10 5 5 11 14 -5 30 6 15 4 13 30 -12 -5 -7 0 11 17 5 11 -21 6 2 30 17 -5 -2 7 12
0.93225 12 -8 15 -6 -2 11 5 -8 43 -16 31 10 21 1 14 18 30 -9 11 -11 8 36 0 5 -12 -7 20 27 -9 -1 9 13 17 20 3 9 0 -3 2 -5 16 34 13 3
0.91038 3 26 14 9 24 9 30 -8 11 -8 8 -1 17 7 4 0 -14 24 11 -13 -18 12 -21 1 12 1 12 15 16 4 41 31 14 -8 26 7 28 10 15 -27 15
0.89003 15 0 -2 28 4 12 -4 9 3 14 9 6 -1 0 9 26 5 11 -16 28 18 10 6 36 -2 28 11 28 3 2 -2 10 3 28 20 8 0 28 19 27 5 21 14 20 26 24 12 7 0
0.86561@JL1k6mL7k0qj0K5k2N2k2Lk4k0M3k1lJ0Jj2p%J9oJ0ok2J0Qj0J9omNjnj1NK5k5J8j4%Jo
0.84221HK1Qj8jPJ8oj5J7qRMl0K1k2J6k4L5j1k4L6Kj5%J3l5M5k8K0k6j0J8j7qL2j4j8L0j9J8l3
0.82135dL9l0K8k4K1l3M7j5oj9L5k4nRJ0k9OMoJ7K1j8M0l5pkLj1kJ2nJ4j5J2pPjk7K0poj9L5j5%
0.79846HMrM4n5L8k3j3L6n0L6OJ7l6J3j2J4Tl2K6rRqJ0k2j1J3J8J2m4M0k2pjQk5K4j5L7Ll5J2K1
0.77709C4qPl8J3j9K4jj1jj8K9rJKJ3Nj6JRmNj4J3j7MJ0Oj2MLpJPmTOJ3l7K2j4KqK3Lj1J1J3m4
0.75267a3M2j9JJ4j7NkQl4J6JjkK7Kk1J9l4K3j2J1lJ%K8k7j3J2K0l4L9l9K7l3L2oK4l6JTj0J4j2
0.73080@mJ1J3j6Pj1j3K8oRk8J0J7Kk8K2onNLJ2j2j5J8k0K5j3PknRl%j5RJJ4k0J9m0K7J9oj0J1
0.70791B0j0kroL8l5qK8j8kK3j9j0OJ5nJ6k2J2j2oL5j7oQkQkj0J7k4K5j0j4RJ3Lk9J1%rJ7j2J4
$$ plain form
0.86561 0 1 32 6 2 39 19 11 1 26 4 56 34 37 13 -7 36 15 12 22 23 11 4 4 23 17 27 21 -1 9 17 7 26 20 16 21 20 15 4 9 34 9 27 13 13 14 8
0.84221 8 29 37 19 18 25 43 37 22 39 31 40 44 14 35 13 29 5 40 29 5 41 43 28 28 41 6 51 23 43 17 7 25 8 0 32 18 0 30 11 29 -4
0.82135 -4 35 5 33 9 30 -3 44 29 23 4 39 15 10 19 29 0 6 10 4 21 42 24 64 29 22 20 23 12 10 22 17 31 16 28 21 28 27 0 20 13 7 -12 23 8 8
0.79846 8 12 3 47 -8 30 7 -6 30 -20 16 22 39 3 16 4 18 32 0 26 17 26 18 28 6 -5 8 26 38 -6 34 12 5 4 12 -13 11 -4 33 36 1 13 34
0.77709 34 26 33 -5 8 -11 13 12 1 0 -18 11 2 3 5 18 23 7 8 17 13 18 4 17 0 4 14 20 8 12 15 8 9 16 12 8 14 27 -10 12 -2 0 -8 15 18 7 18 31 -13
0.75267 -13 29 10 11 25 8 13 11 19 -15 1 2 1 -1 26 28 7 26 -8 15 3 14 11 12 12 40 13 0 12 32 -2 37 -2 25 -8 24 18 42 6 7 8 -2 12 0
0.73080 0 -4 7 20 4 11 0 -13 15 9 18 -10 0 17 19 -9 13 7 2 7 10 22 10 -5 13 -7 18 5 12 10 5 14 11 11 -4 5 6 20 0 19 -21 6 25 19 9 20
0.70791 20 10 8 -1 -7 31 -4 -12 16 -2 -4 19 0 -10 -4 11 6 22 0 12 0 -6 29 12 6 14 12 20 18 8 25 1 26 16 2 11 24 27 -2 9 9 0 17 5 19
0.68552A9k6RMj5K9jj5j2K4pK5m6J3lL1l0J0k0J4k2JL4Rl3L1pl2L0j0J1k0J5j9mJ3J1J6Kl5K4k4
0.66467fL1Omk7MmpK5pj9J4joJ6Ol3K8J2l8J8Oj4RJ%mJ6j9LomK6j6J2j4J0rnk5M9k8L6j7j5MpN
0.64076BJ4l9K3OljL7l9MRk1L0j2J4k0Oj4J1J5k6K3k6j8J3J0j3J0J5j2K8n1N3k8lMmlORj0lj9L4
0.61888A1Nj2QTqPKpQ%k1l0N0j9pjL3k7K6j4j3J2j7J9J5k1j5L8pJk6J4j4kKj4K0k%PJ4j6OJk7L7
0.59548B4j4J7k6J9j4KK0l7K4j5K9k1Pj5J1qNMk6L4J3k3J3j0Rk2J0jJ8j8J6l3JLj3J1nK6k1J5lj
0.57412EJ5J1l1J5J2j2mj9K1j6Mj3K6j3J3J4l1K7ll0K7lLpPj7kL1m6L2j7K3k4L3k5j4NK8k7j5M2
0.55326B5o0Q9o7K5j9L5Oj1k1qJ7kj3J4j5L0k5J7lK1l3J0KjrkpK0j4qK3k3J2J6k0NpK3l1OJ2j0o
0.53139glJ1kk4K3JJ4l1jL9roK3j3j5Nj5J0QK5m0Qj0M3k0J0j5k4J9J1qj2K2l3K9k2J0J6okrK5l0
$$ plain form
0.68552 19 -7 2 6 -9 20 19 4 -8 16 9 34 -12 1 -2 29 -1 9 -11 3 -19 -18 16 25 -8 23 16 -16 14 4 15 -5 10 -9 -13 0 11 27 29 -6 18 -6
0.66467 -6 25 31 27 0 4 0 -7 18 11 -8 6 5 -1 15 21 -12 16 28 -10 8 14 0 9 10 10 6 22 3 6 0 -4 22 6 18 4 14 5 0 -25 24 -4 32 15 0 4 -3 2
0.64076 2 16 -23 0 6 3 2 39 0 4 13 -8 22 10 24 4 10 -4 7 22 -4 19 -7 -25 -12 -2 -15 -5 10 -2 26 -25 28 0 -3 1 -3 -6 0 9 -1 -4 -23 11
0.61888 11 16 4 12 20 12 19 21 14 22 22 1 -29 21 2 -5 -6 27 0 26 12 -1 11 -6 13 28 7 -8 30 23 24 -2 12 -2 -4 -2 -16 4 2 2 9 23 7 13 14 -13 24
0.59548 24 10 27 1 20 6 8 28 -9 15 0 29 8 15 0 11 3 8 12 -14 20 33 10 23 13 22 0 10 9 27 9 25 -8 -7 -4 -17 -6 -11 15 -6 9 6 5
0.57412 5 20 31 0 15 27 15 11 -8 13 -3 1 -12 14 1 14 28 -3 24 21 -9 18 15 18 11 18 1 -1 30 -16 16 -1 22 -2 31 6 -8 -3 25 -2 -17 25
0.55326 25 -35 54 -13 12 -7 28 34 23 2 -6 11 9 -4 10 -5 25 0 17 14 35 2 12 14 13 4 2 -5 15 1 -7 16 -7 5 21 1 6 -1 22 -9 -3 9 -1 -7
0.53139 -7 -10 1 -1 -25 -2 -1 13 -18 -19 20 11 5 28 15 0 5 -10 0 8 33 -7 1 -9 34 14 24 9 -15 4 15 7 -5 17 -16 13 -9 1 17 11 9 0 25 -5
0.50951eJ5%k5%LJ1K9j8j4J1L2j8jj4rJ3Rlk6KJ6K3j2%j4J9l8M1l6L3j4J7j4J1l5L9l5J0J3kj1%
0.48814CrJ7rK7l1J0J4l0K5jQ%l9K6j9J7qkJ3j8Mj9M5j9NmJ1J9k4j1jL1k4j3RQJ3l9J9mJ2Nj7J3
0.46576A3j4Qj7L5k5J7j6NJ6kjkJ7n0K9k6L4k6QL1l4K2k2j5K1Pnk9L7mj1j6M7j0l5L0poPpmK0j9
0.44389AJK0k2K0j6Kj2J1nmK7Oj9J3pj0NPj4K2j3pJqK0Qjl0Qj7K3J3k7K4j6JmPJ9j6l5K7K2j3J2
0.42099B4pj7Rl5L6j5J6Mj5J8j2J4rQj9J5j3K6l4lkJ1nQmK1k3J4PMqrPMkJ3k4%K0j1j4MJ5Nk3K2
0.39759B1nK6j8k2J8LNnjj7NJRJk0J3j0LOlPj7Rk1K4KpK3j7J7j2Rk0K7m1rK9j2K4k3K6m4K7noJ0
0.37419A0j9N4m1K8n5K9Nnk3K4kJ1nk2L8m9L0pL7m0L5k9Lk6L7j8J9J5l9J7l3M2k1J0J8%l6L2pnN
0.35334A7Pqk4QL0l6K5k3J2l1L7pm1J8J3J9j2K6l4J6J4j0k0Rj4M0m0L5l2j4J7L1m5L3rlmL5j9j5
$$ plain form
0.50951 -5 10 10 -15 -15 -12 -1 28 10 -4 7 39 21 20 6 -3 10 19 16 -10 -8 8 31 19 19 5 24 -14 27 -9 24 10 27 13 24 -11 28 -7 3 16 14 3 3
0.48814 3 -6 11 2 29 -2 8 22 -8 17 16 24 24 -15 11 -8 9 1 -1 12 -6 -2 -21 24 5 10 6 17 36 12 1 0 31 7 -6 3 11 24 -15 4 0 12 17 0 13
0.46576 13 -1 7 -10 25 0 17 1 6 22 20 19 17 34 -16 13 -13 21 -5 3 34 0 22 0 -15 6 13 8 -21 16 12 1 -15 32 22 -13 17 10 4 11 4 0 20 1
0.44389 1 2 22 0 20 4 6 -6 5 0 -4 23 29 10 23 16 6 11 18 4 26 13 6 7 -1 19 27 26 -4 4 -13 10 23 -4 20 4 5 1 8 27 11 -24 3 25 12 24
0.42099 24 17 0 9 -26 10 -5 11 15 0 18 6 20 11 19 0 15 2 28 -6 -9 -11 0 -5 3 -1 20 -3 11 18 22 14 5 12 16 14 27 3 3 23 12 -2 2 17 22 -1 21
0.39759 21 16 42 24 2 20 23 28 23 22 5 10 11 20 21 1 14 4 7 13 10 17 0 9 -12 12 14 7 30 13 30 18 27 7 34 -7 -16 13 1 25 2 28 -16 11 6 0 10
0.37419 10 -9 45 4 32 -23 6 11 6 -17 7 5 16 11 -11 27 -22 8 1 38 -2 33 4 7 -19 18 0 19 34 -5 12 -21 21 0 10 28 28 -8 24 17 12 17
0.35334 17 24 16 -8 0 30 -6 19 -4 8 -23 14 7 -34 -16 -3 16 4 30 -4 12 26 16 -4 5 -9 31 -9 26 -6 -20 -3 28 -17 16 7 4 0 35 16 1
0.33299AK3RlOl8L4l6PkKkPjqK2j7LlK0k9lL4l1J3J2k4J5%nRm%J6l8O0n8K3%MPj0J8l3OL0j9nJ2
0.30857B4Ml1K0kOj5NKj1K4k9J9k2NkJ5loPj1nOj5K7j7MJ1nL9l7K4k6K1j3nPjj9L1j4k3J4J7M4
0.28619F4m2mk7L8l7K1JJ2k6pTJ5LJ3j4QPqJ5m4J3J7jPk3J3Trj6J0K1qj3Qk4L8oj4%nJ8%j8oJ9l
0.26279A2Rjj9KroK0LMlLmQjk1J0pK2k4L0l3J7J8j8mqmRK0k5K0rj3JJ1pNj2K2k3K8Jj3j4K2lJ2
0.23888B8k7LJ4j0PJ2k7L5l0J1Lj7jTK4m0L2l6L6mjj4L1nJj7LJ6k9J5Jj3j7K0L0J7m6K0mLlPpm
0.21649A6J2lkk3J2J8k8kmK8j3o%L2j8Qk2Pj0J8qJ0j5qK5k8L0k1K3k5J3j3%TkL5k8J0lmnlj3J3
0.19411CJ1l6N6l4J1qLJ5j5j2NK9%qj2j4K0ojj6jj0QK1mNJ6k3J1k4L2j2lJ8pJLPl3PQOk0Op%M0
0.17020C6l1Rj5K7l9%J9j0K7RpTNJ1j6j2j5RK4l7L1j9L7k0j8j7M0j1J4ok9M4m8M2NJ4m1K1QJ0m5
$$ plain form
0.33299 1 24 33 30 36 -2 32 -4 3 1 3 1 8 7 -1 21 4 7 4 24 -5 -8 26 -5 8 20 -4 11 11 6 15 11 11 27 -11 49 -9 14 14 18 25 15 33 0 6 36 17 12 24
0.30857 24 28 -3 17 15 21 6 11 13 2 26 -3 16 -6 -1 -3 12 9 3 10 -1 -6 0 -15 12 -5 -1 10 5 44 7 31 5 26 13 8 15 14 -5 26 12 -11 3 20 64
0.28619 64 22 18 -9 29 -8 13 14 26 0 -7 -14 1 4 17 3 11 18 10 25 -19 -6 11 10 17 -6 7 20 11 -5 5 26 18 5 13 -11 27 21 7 7 2 20 20 2 -4 15 12
0.26279 12 21 20 1 3 -6 -12 8 11 15 12 15 11 19 18 -3 7 0 22 -2 28 -5 12 30 12 8 0 -4 5 25 0 20 11 -2 -1 10 3 8 -4 18 -5 23 24 11 -3 19 16 28
0.23888 28 1 4 18 8 15 27 0 35 5 16 19 2 1 0 24 -16 16 -20 16 12 11 -3 28 23 24 7 10 26 -3 12 13 0 -17 3 33 50 4 24 20 23 20 27 20 16
0.21649 16 28 25 23 0 12 30 2 0 -4 24 11 5 5 37 19 27 5 12 2 20 12 22 7 -1 24 -4 26 5 28 3 16 3 3 3 1 36 8 18 15 11 6 3 -10 3
0.19411 3 14 -22 34 0 11 3 6 21 6 -6 -1 28 28 20 8 -6 14 8 7 -9 -10 -20 -12 9 5 10 26 3 14 -10 22 10 7 25 18 19 22 29 -4 3 11 17 -3 3 -4 -4 36
0.17020 36 5 14 -1 26 -13 -13 6 -4 23 32 25 18 23 34 18 6 -9 0 24 -13 18 -1 36 16 -2 -19 21 10 24 18 -11 33 -15 27 32 46 5 26 34 44 -1
0.14934aJ4j4QRJ1k9QJj4J7j0Mj0J8l1L6l5J4JRk0L4nj2j3K7qK2ll9J9jPNj8Nk0M8k5lNQj1Pl4N
0.12594a4K5Poj2N4m5K5l5Qr%OjpL5l7j2N3m9L1J9k5jrJ9pk1J2K1Ll2J8k8K8j4K9k1J9m5L9k8J5
0.10458Hk1J1lJ9KrlNj6RJ2KNmoOk8N4l2K2j5j0pjJ6j6rL4k3pJ1mpK0j4jJ5mJ0Lk4J2joj8J3LJ0
0.08016A3rN%KJMmJ1mm4M9k4J4j4LJ4l7K3j1J6NJ9m6QJ2Rkj3MJ6J4j2Tk1PJ4Rmj6OnRJ4j2mKK2
0.05625C1m0K8j6KjK4nj5j2j3M1m0L2oL2m1Rj6JJ7j3K1j3j8M0mj0j2N2n4J0Ojk2oM7k1NQj0k5J8
0.03488A0j1L5k1J5m8J4J6rKLJ3j7kJJ6oj9J1J3j6J7k2%LJ0J5j5kT%J0J9k1JjTj4K3rj3K3kj6k3
0.01250b0K6MJ4k4j1L0Nk7J5J6j5MjJ5k2L0l3K9l1L4n2K2JOj9J7JlnlkQrMRkj1K5l0J1j5RK3rR
-0.01039B3k5K9k2K6rj2kMj2Pj0MJ0J5j6PkJ6m3M8n3LN1k8lJoJ6j1J2Kkk2J0QK4o0L2j0K5nj3K3
$$ plain form
0.14934 -1 13 -1 7 16 27 -2 6 7 -7 10 0 4 -6 12 -19 17 -18 -4 -3 6 -14 20 15 3 -10 17 9 31 28 -11 8 7 14 19 1 6 -14 34 9 6 11 19 8 15 -19 -14
0.12594 -14 11 18 12 0 54 9 34 -1 7 -2 -2 4 3 -4 31 -6 -18 35 -14 17 36 11 10 1 20 13 -8 4 25 28 -4 14 -14 14 0 29 8 27 -18 21 -7 8
0.10458 8 -13 -2 -5 14 16 7 4 9 -7 2 14 16 21 17 11 17 -11 43 11 33 18 8 1 0 16 0 -9 25 2 -5 6 2 -5 15 1 0 15 11 21 24 0 12 11 5 -13 0 3 13
0.08016 13 4 9 9 11 12 16 12 23 19 -25 24 0 14 0 3 17 -20 3 -8 8 13 32 -14 -6 6 15 13 0 4 20 34 22 10 -11 -4 10 19 15 -1 5 0 9 23 11 7 9 31
0.05625 31 -9 19 3 5 4 28 23 8 -4 -17 24 -16 16 10 42 1 10 -6 -5 12 -1 20 7 -11 29 25 15 3 55 1 11 17 16 -6 -12 35 14 19 27 17 -8 10
0.03488 10 -1 34 13 28 -20 -6 10 1 3 6 19 2 0 1 17 11 -8 3 16 0 17 -5 -5 -2 8 23 8 6 4 4 14 33 12 13 12 11 -3 20 11 -2 21 19 3 -20
0.01250 -20 6 10 24 0 -11 19 24 -3 12 28 13 17 16 31 9 39 6 35 4 38 -14 8 9 15 -4 13 14 11 6 3 1 9 0 4 13 11 0 25 -5 6 -9 0 23 14 23
-0.01039 23 -2 27 5 31 22 10 8 12 0 7 -3 1 11 26 10 17 15 31 -12 36 -17 -14 37 9 6 7 1 17 6 18 20 18 -4 6 14 38 -22 10 0 25 20 7 30
-0.03227C0k5J7j5K4k3LkRj5KJ2j7K1qJ4pk6%K0kOj4K7l6K4lJ4k8OK1m0J2LJ0j9J3Oomj0%J3Nj2k
-0.05516bKMJ5j1J3l5K8qQk2L3m2N0m%m0M3l9J5Jj6K0R%k7KK2Rk0OLjk5K9j8J1oRlK2m0L1k1n%K9
-0.07856B9qj0Qj1K0jqk6N6m4j0K7mk0lNL7k9pJ3J5k7J7j0J0j2J1Mj2QnjmQNlj2lTJ2K3l0j1K4nq
-0.10196EL8m5J7k4K6PJl9M0k8%J6pj8L4l5K8j5K0j5lK7l0K0JOrj4KK8l8J8%Jk1J0J6nj7J8j6J8
-0.12333A8k2K1j7J9k4K9k4NmK2MJ0k8NJ5J1k6nK5j1kk8K3Mj2j3J5j0K1pj4lmKJ2pJ5NqQl8M5j1T
-0.14571EJK0l7L0qJ3pk2K7k5LJJ1K9k7J2k6J5j5K0j8j2LK6pMj6J7n0N0k6K2k0mK9j4L2l8RJ6Jj6
-0.16708Hn%lJ1j2RJ4lJ2j6j1J4j2K2l0KNJ4%nTj4NJ0j7J2J1oNjOMj4RqOmMKJLmj2K2l3K4j7lJ1
-0.19200A1J2k9QL4m2L9l9J8j2J4ORk3joK6k2Qk5M2m3K0Rklk9K9rJ2Kj1K2lk0nJ6l1L8j3pJ4pj6
$$ plain form
-0.03227 30 5 22 7 31 8 11 9 18 3 5 17 0 21 13 27 20 -6 -6 14 12 18 4 31 -5 19 16 30 2 8 29 -11 1 4 14 -5 8 14 8 4 -6 -6 7 12 0 -2
-0.05516 -2 0 4 19 8 21 -14 14 6 14 -8 25 -17 33 29 29 -11 32 -7 8 9 -7 13 22 22 -5 -3 19 28 8 14 17 16 -9 20 2 13 7 16 13 35 -5 26 5 0 0 29
-0.07856 29 21 11 19 8 28 27 19 -7 49 5 -5 22 18 -2 -5 0 37 8 1 14 29 2 19 9 19 7 18 22 10 18 13 12 8 16 21 18 6 3 0 12 35 5 -6 18 13 5
-0.10196 5 43 -2 15 -9 17 24 25 -14 26 -2 -2 14 7 -11 23 -12 16 1 21 6 3 30 0 20 21 27 18 4 6 34 -4 14 14 15 -6 4 20 15 -2 16 0 18
-0.12333 18 -4 17 0 19 -5 24 0 5 1 23 27 37 9 14 29 40 14 9 34 23 21 -7 16 20 8 -5 10 0 21 14 0 -3 -7 -5 7 0 15 20 12 20 -18 27 16 5
-0.14571 5 6 26 -11 19 11 24 17 -5 22 -3 0 1 12 41 14 26 0 15 0 20 2 -10 -7 19 12 16 0 17 -33 17 -9 13 -7 -11 18 4 36 -2 7 23 24 8
-0.16708 8 3 3 0 11 -1 8 22 19 31 15 4 18 6 28 -2 0 5 19 19 14 9 -5 0 10 -7 5 16 10 15 14 20 24 10 19 11 17 13 17 19 20 23 19 7 29 -4 20 3 0 11
-0.19200 11 23 -6 2 36 -6 33 -6 12 0 14 20 29 6 5 -1 25 3 11 -14 28 -15 5 14 12 9 -20 9 0 12 14 3 25 22 2 -3 13 -18 20 7 0 14 7 -9
-0.21388iM6k0KLkl5L3OlnkJ1l7L7j3mqNRj5J4%j5J4j2lL1k2pM5m0K3Qj1j0L1n2K0j2%K3j3JMJj2
-0.23728EJ4j5O%J9Mj9LNmj8K5k1OLQPk8PRk8K9l8K8rJ1j3MK0knkk2QK7k4%OJjnjlJ6Pj6J3j8OK3
-0.26271B8j5j0oQkk1L6j3L5j6l3RJ1j1RL4k6Nj7JpNTpK6k1Oj1J4j0QOl8L5l1M1m4O0k5j8JLJ3j9
-0.28510bJ3J1j8K2k5J3Jpj7J6J0Jj1jL0m3PMj2K2j7krL1j3J6lOmNqj5jPK0rk3K1nJ0oTRk2K9j1
-0.30850A4J8k3RN%j4K2n0K8Rj2K5Rnl0lK9qj2lJ3j4J2kj4K5k2K6l7NoL0j0j4MTqJ2k0J1k0J5QJ3
-0.33088A9nkMJ1k3PK1Nl2PL0l7Jj4J8MK6n4JL8j9J8m4J0K4%j4L2j0mjNj3j8K0j2PJ4k7K9k0J7k8
-0.35275iM1k2LJOlkJ2k0J9j9kQ%jJ4lk0j8K0NJ0pK8l7J2j0KOJ2qrOl8K7KJ1k1J6j6rM5j9Jj6JJ8
-0.37666A7jMk0J3MToM1n3M7n3J1J5k7lM4j2qk2K5j4J2lRj2%kJ8k2K4m5K1J1nj4K1l3L2pK7j6j3
$$ plain form
-0.21388 -9 37 17 19 22 20 -15 18 24 21 16 14 25 -12 25 12 8 0 5 14 -1 13 13 -2 12 0 -3 28 6 -1 44 4 27 35 24 14 45 -7 13 1 1 24 11 12 16 17 5
-0.23728 5 19 4 10 10 29 33 14 17 22 18 0 25 4 10 13 21 28 0 7 16 -12 17 -21 7 -2 9 -4 0 20 18 13 11 -11 -3 24 0 0 6 7 6 1 0 -3 13 20 4 17 -1 5 28
-0.26271 28 13 3 -3 5 3 -18 18 5 40 24 -9 0 11 0 9 43 17 22 5 6 -1 4 9 2 28 7 13 2 16 6 14 20 -18 17 -14 27 -17 43 18 0 1 4 17 -2
-0.28510 -2 11 22 4 26 1 14 15 8 -9 7 17 18 7 6 36 -7 0 4 -8 14 -3 -5 -14 17 4 20 17 23 19 24 16 1 0 7 27 18 -5 16 11 21 15 9 18 -4 25 14
-0.30850 14 32 9 18 23 23 9 31 -19 9 18 6 31 40 35 5 2 31 23 11 8 21 7 19 17 3 28 6 32 -5 0 -6 24 14 0 4 8 0 12 -8 3 -17 -2 6 19
-0.33088 19 14 12 16 27 4 11 32 37 5 12 42 5 6 -8 10 14 40 -14 -13 25 6 24 -20 -10 14 14 0 32 22 18 17 22 9 -9 11 -1 6 20 -7 22 2 19 -9
-0.35275 -9 32 10 13 14 20 17 15 27 7 26 7 5 13 13 12 26 23 3 -15 5 10 20 13 41 4 16 6 8 14 26 18 9 15 -23 4 6 17 -4 12 -4 -13 32 13 14 -2 -1 17
-0.37666 17 16 20 0 13 17 21 15 56 3 50 -3 8 23 -4 -7 37 25 17 -5 20 6 18 15 24 12 12 10 28 6 30 -15 6 17 12 -2 19 -14 18 11 38 22 9
-0.39803Ik4K5j1K5qPrOJ6l2Rj8J8onJ0j0L3k0kk4L0lj8L0j6Qk7PK6m0K4NJ6j9pm0P9n8K9j2L1m1
-0.41990gL8l4K1J7lj5j0lTK1k2J8j0K6rk9K6J1l0K1Lk7J8J6l2qJ3K5j4lJk2K5oj6L4jl1rK1lQJ3
-0.44178B9k9L8m3O3m7ljJ4Kj7K8l2K3j3l6L5kJ4j7J3kTj5%J9k6M6l9M0l8L0k1Mj4NK2k6K0k5L1
-0.46213B8k8JKK2qJ6j4Ql4J2K2J4l2J6j1lmT%qRK7j9Pkj2K4k7j1M0j6J1m2K5J0mkjKj0k2L5j3K3
-0.48451B7Kk9L%J8Kj2L2k5%j7J5lJ1TJ0l2MOj8pJ8k1J5noL7l9K1pj3J3kK3j7j0Pj4J8k4QK3k7KR
-0.50740GoL9l1j8RK1J5k6lkJ8kj8R%Pk3M7l2J8j4Rk1J6Jj7RLk3lL2Lk2K8j9OlTJ2j1qmQoJ5Ork7
-0.53182a3L2j2N5l6nK0l8j0K8jl2K6k4K8jj4jRK2pk1K4l1PJ1KJ0k8L1koj5J3%Tj2mL8l1J7k3oT
-0.55370fJ0qJ7k1L6l3L6k8jLkPJ6pj3Mj1J6LqKnRNmNkl4K8Mj0P%k4K6jj5K4k8J7j7K1oKjj0J4nl
$$ plain form
-0.39803 9 -15 10 -1 24 16 23 14 20 36 4 13 -5 13 7 2 12 2 35 15 13 -11 19 16 -2 28 12 20 -7 0 26 -14 10 15 31 12 5 -35 44 -14 15 3 34 -7
-0.41990 -7 31 -3 18 35 32 17 7 4 1 22 0 18 8 34 25 -4 22 33 3 24 27 0 18 34 2 -6 7 32 18 15 16 -6 19 13 -3 31 30 -1 -10 11 8 16 29
-0.44178 29 0 38 -5 58 11 8 7 21 23 6 34 2 25 12 -24 11 9 23 6 19 17 15 0 0 19 -7 39 0 40 2 32 11 15 1 6 28 2 22 -3 28
-0.46213 28 0 1 3 25 17 33 19 27 -7 5 27 41 9 25 14 11 7 3 3 -5 4 31 12 19 17 5 29 2 -9 31 15 26 -16 9 19 15 13 12 14 4 -18 17 4 27
-0.48451 27 29 0 3 3 21 23 11 43 18 18 1 16 13 24 35 45 13 17 23 5 -2 16 -5 10 5 -1 36 -3 18 11 -2 11 9 32 15 5 12 -2 16 -8 0 23 -4 -2 7
-0.50740 7 1 40 9 -9 0 21 36 10 7 5 23 21 3 12 12 19 -4 43 11 29 15 24 3 19 20 3 12 15 -8 -11 21 24 2 30 11 17 14 11 23 12 4 0 8 2 17 23 14 -13
-0.53182 -13 19 7 62 26 21 41 3 -7 21 20 -12 14 -10 18 17 3 2 11 33 26 5 29 -2 5 16 18 28 0 31 29 23 8 21 21 21 9 5 43 12 29 6 0 -6
-0.55370 -6 4 -4 13 -8 28 -5 31 3 2 5 3 10 26 19 6 10 -1 15 18 10 12 7 16 21 17 22 20 -14 14 18 8 15 15 -9 17 16 1 25 -3 14 -3 18 12 14 13 3 17 12 9
-0.57862IJ1Nj9K2qK5m6JNJ1k2K7k1PK0Ll4J2j9N6k2k8J0qK0j6J6j7J6j0NroK0Kk0K2KpNk0M4k1q
-0.60101A5lonL2k7K9l5K5k5J4Rj4K1j2Jj8J8j9K3J2k7j7qL3ojkJ6k8QL5m4M6l7Pj3OLJ0j6K5j5k
-0.62288HrJ0noJ1mJ4k5L4j2J1l9N9o4L4kQk1K4j4rTL4k5K2l5K4Lk1K2j1oLK2k6L2j9J1k7J2NqJ7
-0.64476B3j7jJ0j6J4k2L5k0RPJ0qm0L3M9n8L4l3J0j6J6Jj1K4k6jJj7M0l0J5k2K4Oj1j9K6j6M6o1
-0.66510a2L6o%Oj3j7J9PJk9M0j6nj1QqTK4lk4J1QJ0j6L2l0J8k3JRPj0j1M0m5K6k1K8jj3Mj3J9j9
-0.68749@L0rj4K2j4J0j9K0j2LOj1J5k5K2j9JL0k3j2J5qjK4k8J6j7J6orKL3m2K5j8K5l5%TKK2oq
-0.70936CJ8j2TjK0k9L5k6N1l7J4KM%J5m8L1k3L1k7L6l7Lj3K2Rk9O1l2j3k4Q%J4oKorML8k4J1j7l
-0.73174DPJ4qoMolJ8nK0m1K4lJ6k8J1k0K1K2m5Mk5K5P%kM%RnRqTj1L8l3J5k0K1k4L6k2J9Jnjj6
$$ plain form
-0.57862 9 20 25 6 28 20 45 -1 0 5 16 -6 21 0 7 27 30 -4 8 -11 45 23 -5 5 -3 17 1 17 0 16 6 11 2 -4 16 18 -2 20 22 15 20 0 44 23 15
-0.60101 15 12 6 1 33 6 35 0 25 0 14 23 9 30 18 19 1 19 0 23 35 8 -9 -17 16 10 9 7 23 -5 3 38 -6 40 3 10 -3 3 6 16 0 25 10 8
-0.62288 8 -1 9 4 -2 9 5 19 -6 28 16 27 -12 47 -17 17 15 23 2 26 12 3 -6 28 3 25 -10 14 17 -4 18 7 1 4 26 0 32 13 24 -3 9 14 6 23
-0.64476 23 6 5 15 -1 13 -9 26 6 15 22 32 24 -16 17 66 8 42 9 19 3 19 20 9 33 7 6 7 -10 30 0 15 -7 17 23 12 -7 19 3 49 -12
-0.66510 -12 24 18 18 24 11 -6 13 20 21 -8 32 16 11 0 8 0 -8 16 13 -11 0 8 18 2 34 4 22 -1 0 9 16 6 -5 35 -10 16 -5 23 22 9 13 0 19 0
-0.68749 0 30 21 7 29 15 25 6 26 14 17 23 12 27 2 24 5 6 36 13 1 16 8 7 31 3 19 2 18 12 3 5 38 -4 21 3 28 -7 -7 -7 -5 17 11 3
-0.70936 3 21 9 -3 -4 16 -13 22 -4 47 10 24 26 30 30 45 -3 28 5 36 9 45 8 11 -2 20 29 0 61 29 16 -8 0 0 14 8 10 4 -5 -1 37 13 24 7 4
-0.73174 4 11 25 17 11 15 9 6 24 19 39 -2 22 19 35 7 18 -2 19 41 -4 0 -25 0 7 7 5 9 9 18 13 22 14 6 -5 33 0 15 -5 16 -8 28 6 25 26 21 20 4
-0.75565DK0mk0K3k6J4J3KJ6l6PJ4j4J7j0K2m3K4k1L1j8K8ml9J7Pj1q%nK1J6l8J4l3M2k2K1j2nkO
-0.77702HK8l2J9k3J1Nj2KkL8k8J6j9j3NrJ5RJ5qk5L1j6J3J2j3k1J7ok9PJ6K4j4J8k4pJ1J3j4%K8
-0.79839D6l2K2j4nl3K6kKj1L5Rk8rLK3J2nk8nJ8%rJ7k2jJ2oL1po%k0j8J9K7nk1J0rJl0L7pknJ6
-0.82179B6k0J8Lmk1Pj1J5Lj0J1k0L0l1K4lj5MLTj5M0k1K2qok9K8m1L8j7J2MJ9k1Qk2J0j3L4l4L6
-0.84315C6l3J2j4K5k8K5j4J4qrQnL9m7K3j4J1k1mK0j5Nj8J6J9pQpTk2K7j8L1j6J5jnpkJ4k4J6K0
-0.86503C8k0JmpK8j6J0l0J6J5%l9NJ2L3l9Qj6K8lQl5K8j3%J1k3L4j7JK4j9L2k9J3k3lkL6m2N1k6
-0.88639B6nj5J7jj4j0PlqL2m1N5k6loM0m8J2KJ0j4M3n3K5nJ8l5J7Rj4jrJ6j8J0Rj9PJ5l3N7l4J
-0.90827A3k7K9k5M3k1j2K6k5K1k6L4j7J2j0jMJMj5K6k6Oj4L7k3jPOk7J2j5KNJ4j0jLPkj0J6j8L0
$$ plain form
-0.75565 4 24 20 0 23 -3 11 24 26 42 6 13 27 13 30 20 42 -1 23 2 33 15 43 39 0 17 24 13 5 5 0 21 37 -1 13 -20 22 0 21 9 4 2 8
-0.77702 8 36 4 23 0 11 16 4 6 4 42 14 30 11 -2 3 -6 9 18 33 25 0 31 15 28 40 27 6 23 17 -12 -5 11 35 21 39 15 8 19 32 18 18 46
-0.79839 46 14 36 22 17 -16 10 8 10 -1 34 43 15 6 9 32 44 39 11 6 24 24 15 32 10 9 21 15 46 39 33 33 13 -5 14 41 36 15 25 16 17 -13 24 17 15 10 26
-0.82179 26 6 24 27 23 2 9 -2 13 16 6 17 -3 27 -4 20 17 2 6 9 12 -3 37 16 38 30 24 -5 23 -18 20 3 15 19 38 17 25 3 13 0 34 0 36
-0.84315 36 3 15 1 26 -2 23 9 23 15 6 14 9 48 1 24 10 21 0 -4 16 1 6 -12 4 23 16 24 17 10 -12 15 -3 28 12 27 26 21 14 12 26 2 18 38
-0.86503 38 18 19 15 8 36 20 30 0 16 31 31 -8 -3 9 42 3 11 -5 23 20 28 -7 21 8 8 19 -4 30 13 14 38 19 51 22 35 12 9 7 43 1 52 26
-0.88639 26 21 6 23 22 8 -2 5 2 -6 26 -15 40 14 11 5 45 -3 9 11 21 7 50 -3 22 17 35 0 17 26 12 11 2 18 0 10 19 0 7 22 -11 46 12 13
-0.90827 13 -14 15 -10 33 12 0 26 1 22 -4 30 13 25 15 14 18 19 23 8 34 8 14 0 37 14 13 20 26 -1 11 -4 -2 3 17 7 6 9 16 14 4 20 2 32
-0.93014C2l3LK2qOj4J3j3MKj2J6NRj9lK0k4jpN0m7J0Mj8MK0J0Jk9j1M3k3j3J1J4j3NK2kk9J2L3
-0.95202E2l6j4J1K3l2RJ1OLk4RMk1L5l4K9m1K2QOk6K2j9M1m5K6j7L1k7K6l1pJ7jpj4K0J8Onpqk1
-0.97389bKK8j6j5K6rlkj5K5Jj3Nk2L9pl0OJ0j3N2l9J6lkloLK6k1KJ0l2J0kK4k9J7k6L6l0lJ9oJ3
-0.99678B1Kj0oK3k6NJ0mk0K7Pk9L3j2nNoK7l9K6%k0j4J5QJj1j4L1pj5K1qRm5L1J6J1l6K0Jk3LK
-1.01917EJ6rJ7k0J6jJ1Jk2kJ0npJ5m4M4k8K9Oj7rJ7j7k0N6l1%L5l0JTkomK6lj5%J8k2MrRnRJ2J
-1.04308C1m4K2J6k5J7j5J6j3QJ6k0%QJ5l0R%oJ1%Nj9PK3jk8LkK6j1%lqLj1M3l3NjK%mKNKLk0J5
-1.06749A9k0K0oMj3J8LKl3K0jk9L0mN%j4M3j7Ll5K1%Kj3J2J4j8oj7K3j8L0KJ1l3J6lqrjK2pTK0
-1.09039B8k7L8k6Qk7J9JNk1J8L6n1L0oj0TJK5k6JJ3l6N5l2K7k1LoJ7l2L6Ll1L4k5K4k0J9k5j6L9
$$ plain form
-0.93014 32 -1 2 24 16 22 8 21 8 12 14 2 18 23 32 13 10 30 6 5 -2 48 1 11 15 -3 1 21 31 32 3 -8 35 12 -1 10 24 11 16 38 36 7 19 52
-0.95202 52 16 2 13 36 4 13 24 30 33 9 18 22 1 36 2 31 -10 12 20 26 0 22 3 44 -1 25 8 39 12 38 7 0 17 16 9 -5 15 33 39 34 27 19 -2
-0.97389 -2 0 28 12 -3 23 14 11 9 -6 19 20 7 12 -10 29 22 -8 -2 8 -5 47 8 24 21 19 16 10 13 39 18 20 30 -2 8 6 30 1 18 -8 28 -2 -5 14 8 21
-0.99678 21 23 13 7 30 4 9 19 15 -5 22 29 0 33 21 16 21 15 42 3 29 29 9 -5 10 18 19 8 -6 25 18 3 24 16 25 -20 11 27 38 2 22 23 0 3 5
-1.01917 5 21 12 29 9 25 24 35 36 14 12 22 17 10 25 -19 25 -3 26 32 15 6 23 6 -14 42 11 11 46 16 17 18 16 10 6 32 29 14 14 32 10 14 5 14 9 18 30 31
-1.04308 31 -13 9 25 0 17 2 18 5 13 29 9 9 17 32 2 11 11 5 16 16 21 2 9 32 31 3 6 4 30 19 19 16 8 11 0 43 10 15 14 16 16 12 14 19 21 24 4 19
-1.06749 19 -1 19 13 17 4 22 25 27 -6 14 13 -16 14 10 15 15 1 44 27 30 -5 16 16 18 5 17 31 13 7 -10 13 -5 25 27 38 5 21 18 10 1 0 22 15 8 28
-1.09039 28 1 39 13 21 -6 13 14 19 -2 16 52 1 31 25 15 5 6 31 5 6 19 -17 38 6 33 12 15 9 26 -6 30 33 2 36 11 35 15 34 9 -7 32
-1.11124C2l4L4j7%j4J2Tk7oL8k9M2m6L9Ll5J6Tk8r%kL8l5K0qJ2Kk7KJ0LRqj5Nj4N4k1k4lK8oj7
-1.13363BK0rMJ3k1Mj5K4j0K1l4RJ7j7j4J8k4L0j9M2k5pnK6l3MK3Jrj8%L1k6J8kK5k0J6n5J8LL2
-1.15499C8j2k0LJ0Qj7J4l1K9mj8J7j0K2j5J0%j4Lj1J5k8L0j4J3mjkL0k4J5m2L2Kj6L1j7l4M7l1
-1.17534DJ1nk5K8nj0K9%j9J3j1Lmj0PJ0JK2k2MJ1j9lk3N6n0K3j4L2Kj8QNpKMjj3j4M4k5k2K4k3
-1.19772@J0kJ7k0KRk4J4K8k7J9k4J4j3J0j0J0l5M8J2k4k3K0K2qj6J0Mkj6M0l4J6oQNkj5J4k7%K6
-1.21909C0k7J3J2j5J6j2k2J9J5Rl2K9k4jMnL8k9K4j6J5k0qK4k7N3k8k9J4nMRk8J6kOj1LK5j9jp
-1.24046A0K4l0M5m0J5Kk3KJ4j6L2l5K4pTRll0O0l5PNj6K2j0KTJ0l3K3J1k1k2K0RMj5K8k3QLrTJ
-1.26284Hj8L8k8J1MjNK7l3J1J2m1L0k6L3l9L1l2J8mJ1K5k9J2JpJ8Tn3QM6n6K9k4QJ3Pkk1kk3J1M
$$ plain form
-1.11124 32 -2 32 15 15 1 13 25 -2 -8 30 1 43 -3 36 39 4 20 36 8 -1 -1 -3 35 0 20 12 24 26 -1 1 11 14 23 15 0 5 -9 45 24 0 -3 25 19 2
-1.13363 2 22 13 17 30 9 13 -2 22 12 33 -1 8 25 8 -6 12 -12 18 -1 41 16 9 4 30 -3 1 24 25 16 -2 -2 29 3 21 19 44 24 40 -15 3 6 38
-1.15499 38 26 6 9 19 27 10 24 -7 22 18 0 17 7 29 14 24 24 10 13 2 17 -11 19 5 18 14 13 11 41 17 32 -10 22 24 8 39 22 -12 35 4
-1.17534 4 15 10 -15 13 8 -2 27 27 8 21 10 13 9 -1 6 16 17 39 17 21 32 13 10 -13 43 -7 16 2 34 36 18 26 31 24 26 30 29 16 2 46 21 -1 23 0
-1.19772 0 10 8 25 5 7 16 -8 6 34 7 26 2 16 3 13 3 13 -22 26 38 14 -9 11 33 25 9 19 23 21 5 45 11 27 21 29 34 32 17 31 4 4 30
-1.21909 30 3 16 28 13 29 17 -5 14 29 38 6 35 11 10 14 9 47 18 42 26 41 21 13 37 10 63 35 6 20 15 19 28 0 16 14 20 9 12 37 18 17 10
-1.24046 10 34 4 49 9 24 26 3 5 19 3 35 0 24 17 10 19 16 -14 46 11 18 23 7 29 19 21 23 33 0 23 34 13 -9 11 20 24 9 37 14 22 25 16 7 8
-1.26284 8 -10 28 0 11 15 14 19 46 13 24 36 -5 25 -1 32 -7 24 -8 10 6 17 42 13 25 26 19 37 55 2 10 56 0 29 5 13 26 33 31 10 8 -15 -4 0
-1.28471@K9n%j2j5K6Oj2J5j9MLJ8k3QnMj9K4k6NK5l1K0%Mj8K2jl3L1j8jK1l3OJ6J5k2Nk4K3PMj6
-1.30761HJ4j7j4J5PmK5j5Qlk8K8Ok7M1l2J9l1L2moK6m3%J8%j1J3j4jJ6mj1TJ3J1k4QJK0mj7J8r
-1.32999A7J5j1Jj1orJ0j9L3j5nK5k0nL5k5%nK2pl%K3l2NJ4Rl7PL1j3oLoJ0k0NJ9j2mQJpJ3j8L9
-1.35339D9m6J2k0L0jmnoQrOJ2Rk2POj4KJ8Lk9J2Qj8PrlJ1J0Kj6KMJ4pL3m1j2J3kLl0K8JJ3j8J1
-1.37730B2K2rpk8M6lj1mm2M5j4J0rJ0Qj2j5nj0M9k8qJ6J7om4L3jNj0J8l7K4j5K8j4k9J8J3j1J1O
-1.39867B9olK9m5K6l5J8J1J6k8K5Mk1%jK4k3m9M7j3M1m6L8k0J6j1j6Rj5J6nJ4Jj3loJ3Lj4K6j1
-1.41952B2k1K0k5N0m2NoK1j6P%TJ2Tj2Rj0j9J7l5L1Kk1L0Qk0lTJ9pJ0Lj6j0K0rk1KJ8Mk0K2k0k
-1.44191FL6l5K1k5kJ9k1RLrL6k3qj4RjTRJ7l1J2J8qQ%j1lJmJ3Jpj2J3l0M9j7Mj9L4l1L6k3j7L0
$$ plain form
-1.28471 0 29 24 24 12 -3 23 29 17 32 13 17 20 38 15 23 18 22 3 27 1 6 31 0 20 20 24 6 28 27 -6 25 7 6 27 -6 0 16 31 9 14 -10 13 20 24 8
-1.30761 8 22 5 -9 6 13 9 34 19 27 24 -4 24 30 3 44 12 31 0 32 28 22 48 5 5 23 23 12 25 11 10 26 22 11 0 13 24 0 8 9 29 25 8 26 17
-1.32999 17 32 21 22 11 5 -4 6 -13 20 5 0 25 5 0 35 10 10 5 27 20 17 17 40 8 13 27 36 -1 6 37 24 18 21 15 25 5 10 29 17 13 21 22 15 28 10 49
-1.35339 49 3 15 -5 25 24 20 15 9 17 8 14 26 35 13 20 26 12 14 32 35 6 18 26 8 15 6 3 14 24 26 10 12 16 30 23 56 15 3 16 14 17 -13 15 16 29 11 22
-1.37730 22 44 35 28 0 46 43 32 28 -14 31 17 27 18 28 36 24 9 4 -6 43 15 7 23 40 34 -10 23 22 27 17 35 -2 22 7 35 21 -8 10 23 12 23 29
-1.39867 29 23 20 49 4 30 -5 13 24 40 12 37 41 20 20 19 43 20 -29 18 5 46 0 38 18 34 23 7 16 1 17 12 26 27 14 11 5 18 21 7 33 22
-1.41952 22 1 21 -4 46 4 9 3 24 8 15 15 15 27 39 27 36 26 7 24 -11 20 22 1 31 39 19 16 13 32 25 35 38 22 12 32 23 2 4 22 26 6 28 8 6
-1.44191 6 42 7 28 3 1 20 -1 8 11 2 38 15 7 -7 2 1 0 9 26 -5 7 25 17 25 25 14 11 12 8 21 22 15 3 16 -14 35 18 22 3 37 6 42 19 2 32
-1.46480C2j2oK4rj7J2Roj6j1K1Tj5jok9K0N4m5K7m1oJ5j5MQK7j7K7n0L3k2J6j6L3j4j3l%K6mk5
-1.48616A0M1l9K5nl3K4J2k7J8j5K1l5rJ3jJ6J2k8J1J6j4qL2m1K7rmKQpJ0j9J8mrL0k7prL5k8RL1
-1.50804D3l4J2k9K3K9j8Pj0TK9m4OL8j1qKk3J0J4k5J6J0lk8K4RJNl4J2Nk2J9j3JQRLl2K9Ojqj3L
-1.53093GK2prJ2k9N0l1J6j8L0l2J4j4J6l2L5j7J0j3J9pL4l6NpMPj9K9j3jk2qL2nK1l2L9l9J7J1oT
-1.55281B7j7K6j3Oj7RK3j5rqJ9j1MrJ6%KkJ7k9jj5M1l1J4j7K7k3J0Ljk1L8l2rK2k%j4OJ8j7J6j4
-1.57519A7jqTK0lkJ7j8j2TK4J6k6L3m0QL6j2Oj6NJ7k9K1j8oJ5rJ4l2L1j0Qj8J1J2l2K3lJ0k6L7
-1.59655D0k4K5l3K3k1qJ8JQk9JjK7%nj4L1ojmknk8K5j8L1lj5J1oK5n7K7k4M7j5J4l8K9kj6JL8m2
-1.61894EJ4j6M0k4lqnK8Jm5K4RK3o7O3m3M4l1K1k1PoRqj0K5j0mJ9k0KL4mMk2qJ4kqlJqK9J2m0K8
$$ plain form
-1.46480 32 20 14 38 29 12 24 33 27 11 0 21 42 27 26 20 -9 11 65 20 47 6 0 15 0 4 12 39 22 49 -1 32 10 26 10 43 29 16 13 13 39 35 10
-1.48616 10 51 12 37 32 -1 23 35 8 26 11 32 -3 -12 1 0 16 28 0 11 27 13 5 37 -4 23 14 10 12 20 13 23 4 22 18 9 39 12 5 -4 31 3 12 43
-1.50804 43 9 21 -8 15 44 26 33 23 13 42 -2 4 42 31 23 25 2 12 26 1 17 27 24 -4 20 29 30 35 1 13 18 -4 15 2 3 11 20 23 -9 20 26 25 17 4 7
-1.53093 7 29 22 13 25 -4 46 15 31 13 43 11 25 11 27 -5 30 13 23 10 29 22 56 20 25 18 22 29 10 39 26 25 3 -5 27 22 43 11 50 11 28 39 33 27
-1.55281 27 10 36 23 29 12 21 44 29 20 12 31 20 24 15 31 31 33 31 48 19 18 3 44 13 27 10 37 14 24 27 26 5 43 11 2 24 22 22 8 14 32 15 31 17
-1.57519 17 16 8 0 20 17 15 32 14 2 -10 14 30 4 37 -3 5 41 29 35 19 24 41 12 33 15 9 24 15 29 -3 28 18 26 8 19 31 -1 22 19 29 3 40
-1.59655 40 16 41 8 31 10 2 20 21 29 0 1 0 27 27 22 8 39 33 32 28 26 21 -7 18 0 31 28 13 24 18 43 -14 13 -11 36 21 35 -3 26 24 8 9 47 5
-1.61894 5 19 3 43 19 16 8 3 31 32 -13 11 20 43 -24 39 -4 40 9 30 9 16 10 19 11 1 26 16 12 31 11 13 47 43 47 25 17 31 29 21 18 19 11 40 52 12 40
-1.64234D0m5M2%j3L4l2j0j9M1k0oL3l3J8j0o%J3Kj7pL8l0RrJ5Mj0NnJ8j2Ml6J3j5J2J0K3k6nK3J
-1.66421C2mk2L2j2J0jk4K3j1k1J7L0l1Rj6NJpJ0lL3m1L1m0L4jLl0L5j3qPToNl4J3j8OK0J3k9K8
-1.68609C2k1lj1M4m1J7qJ2KJ5j3Ll6J0QK1l0K1j3J8%j4pJ7qJ7m6M5j4J3j3J6jk0K7lk5J1pL1k7
-1.70694A9j0moL8k2%L7m0k0J2J3K4m7K5J1pj1lK9j5J1rNl2K1nJ8j2J6j6j3mL8l0Ql1N3l4J4Jj0N
-1.72831A7LJ2k4NL5k5Pj5TL6k7K9m6K0kK0j8M9n0qK1pj1J7Pj6Qj4L0j0qJ5j3J7k6LKj3J3j5J7Q
-1.74968B8j9K8l1LqM8m4lK4k8L2j5jj0N6o3L7k2J1k0QL1l0%JJ9k0PLl1J6M5n5M7j4J3l5K0j5M7
-1.77002F0n1L0j1rOk1L0j9K8k2J0k2K3l8L3NKk4J5Kj3J4l5M1%rj2L5k7Jj5L0k5L4k6j4pJ4jM7n8
-1.79088AL2k5K7k8J6j4OmJ2%j0L5j9Nkj2RTpK9k6J3l6L1pj2l8M1Lq%j2ON8n9QJk0MJ5k5M3l8LM
$$ plain form
-1.64234 40 -5 37 37 24 58 26 16 -3 38 18 12 45 12 30 20 14 14 27 29 12 5 43 13 22 13 28 32 22 27 22 40 28 32 -4 9 -6 6 16 39 13 8 31 32
-1.66421 32 28 6 38 26 36 35 11 34 23 2 19 49 18 27 11 16 17 10 20 17 50 9 40 0 34 33 36 6 41 28 20 27 34 28 33 -1 12 -6 0 20 33 4 32
-1.68609 32 11 8 -3 41 0 17 9 21 23 38 25 28 -8 2 10 31 1 22 9 27 27 13 6 23 15 32 -14 31 17 30 17 33 32 12 39 36 11 22 15 46 19
-1.70694 19 9 5 -1 37 15 15 52 12 -8 4 17 41 -6 19 30 23 12 9 38 23 34 25 30 -2 19 14 32 20 36 20 7 3 41 11 19 -12 41 7 21 22 12 17
-1.72831 17 20 32 8 13 48 23 30 15 0 36 9 38 -8 12 10 30 12 61 11 3 24 17 6 23 30 14 22 8 38 28 20 35 22 39 13 16 18 5 18 3 20 28
-1.74968 28 9 37 6 9 1 49 5 2 26 -2 30 15 14 4 60 -3 34 12 23 3 11 42 12 12 13 32 12 19 22 -9 7 52 -3 44 30 43 8 28 13 60
-1.77002 60 9 39 28 19 25 4 34 15 43 21 31 9 32 -6 27 32 34 10 25 27 14 28 -7 34 34 25 13 48 21 22 7 37 12 46 20 6 -1 13 12 59 1
-1.79088 1 33 8 35 7 23 9 15 11 23 23 13 48 29 34 32 20 29 38 31 60 34 47 11 42 35 23 -15 26 29 21 21 9 15 73 14 22 23 3 7 22 -3 40 2 5 9
-1.81377IL1k2j1L1k1Olk8K8J0J1j4j3j6N7l4Qk5K2K0j3nJ9l8J6MroL4m1J9mK2j0K2o8L5J4j1nJ3
-1.83463C4Kl0MJ5rK0j9Nl8L0j4K0pL2m5J3j3N3nok8J6lj0PJ1Kj4j8J0K1j5NMJmk2J0K2Jk9J8nJ0
-1.85701C2Lk3L1l1J6n6P5n2M8j4mk6L0k2QK6k0J4j4J2j3QqolPQK4p2K6J6Rj2J0Om6M9m2L7k4J5
-1.87787B2K8l5jnJ0NjJ5k8Pk0K4J4j1lj0j1M1k7jkL1mnQk7K1k9L9m5QK3Lk0J6Rk1J6kj9J0J3j8
-1.89975A8j0L6k4J8l5K0l2K4O%jj5J1TrJ5JJ9l0poJj5K3J8Tl2%k5K6j4knL1lnrPol%J0jLJ3j7p
-1.92366A6K5k4M3l6J0m2L1j5J4nLOj3jpJ1j4J1M5l5mkJ2k7K0j1L3k9j2K4lJ7rjnj6oL3j1k0K0j1
-1.94502A5j5L7oJ8k9ok0J6J5j4nJ6qPokRnj4M4m7L6m6N6m6L8l1J1K2j9j1NjrJ0K4kqkJ9k7Mj6K6
-1.96740C3j5k%QK6k6K6n0L4j1J4pl0L7Lnj3K2j4j2TJ3kM7o2L1onJ2OlnJk5L1l4L0k1qK7oJ2k4K4
$$ plain form
-1.81377 9 40 18 7 38 17 23 20 -8 20 30 41 27 14 -2 55 21 29 4 26 46 33 28 47 9 25 29 20 14 48 7 26 22 44 34 56 -12 23 37 26 21 34
-1.83463 34 36 6 10 25 16 36 17 22 -16 14 0 20 13 45 0 13 0 53 48 42 14 30 27 17 24 35 37 23 5 15 36 21 26 30 31 27 5 15 37 38 9 27 22 32
-1.85701 32 35 12 43 12 28 -28 47 -5 43 29 25 -1 29 7 15 41 21 35 21 33 20 28 20 14 11 18 26 50 -22 4 20 29 17 27 33 -13 36 -6 31 7 22
-1.87787 22 50 15 14 9 19 24 23 38 10 17 -3 21 35 24 21 11 0 41 14 13 11 42 38 33 41 14 35 6 45 0 8 31 34 14 30 39 18 34 32 13 23 36 18
-1.89975 18 8 44 20 38 3 23 -9 15 21 21 20 5 16 27 18 33 34 53 23 16 10 11 -4 19 37 55 23 23 -2 24 10 8 3 34 31 26 17 24 18 15 15 25 24 27 40 23 16
-1.92366 16 41 17 60 24 34 -8 23 8 22 17 20 26 13 12 5 16 2 13 58 23 19 17 29 2 22 11 44 15 3 27 24 41 32 31 26 10 4 37 26 6 26 15
-1.94502 15 0 37 31 49 20 14 -6 10 25 11 6 22 14 21 15 13 22 17 3 47 0 36 -10 46 0 38 7 18 40 21 10 15 14 5 15 39 37 29 27 46 19 23 7 33
-1.96740 33 18 16 16 24 50 24 50 0 34 23 37 30 0 37 40 35 22 44 30 18 6 19 17 64 2 33 27 22 34 40 37 32 33 8 39 5 35 14 6 33 27 39 15 39
-1.98979C9l8N0n4L8m9N0j6mJ1j0K1m9M7l8J3K3j0oJ1j5LOJ7l3K6lJ6m1L0l8M0k5J7J1l2J3J4l2L
-2.00963FRMNTll6O5l1K0k2K7k0K4k4Ok1J6K5m8K2j5J8j0J3KqmTRJ1ok3K3MLl0J0k6J4N1m4L6l3l
-2.03201A7kJ9Lm2L4Nlmj5J9j4rJ1K8k8Oj8K5jj5M3n9J9MojQK4n3N2l2K3m4J1J2J4j1K9k6Pk2K6o
-2.05389B8l1K3k0QJ7j4J0Rj2J2KojTJ8l6L4j4k2OJ1jk1J3nlK8k6L3j5J2k1K0Pm1M3m0QJ0MJl1j6
-2.07576b0M9k0J1mL5l2J7j8k3N9j3rj6J2j0PJ7Mpmr%QJ5mj3TJ2j7K9j5j3J6JK8k5Pl1J0K2l5J2
-2.09713B0K7J4m7K5l5K5MOj8k3oK7J0j5NkKnK4qj9L0l1K2Mj6RrJ5j5J9j0j9L5l5J7lJ0KoqJ4j8
-2.11900A8J4l2L6l8L0J1j7jQmpJJ4PMpl1N6l2J4qj0j1mN1l9Rj2mL0l6K5k4K7jk1kk8M1K0l8K8j7
-2.14088B0J9k2PTkJj9J0kJ2j1J1nJ1j0k2J5jJ6k4M3l5Kj6L3l0J3j7J0J2J7k4J6k3J8mj0J7j9RL1
$$ plain form
-1.98979 39 1 51 -3 35 -14 36 20 16 27 17 38 -11 36 -2 11 34 24 18 29 14 17 23 40 7 33 30 46 5 35 -3 37 12 29 40 8 21 35 3 6
-2.00963 6 15 19 24 29 26 -10 55 24 44 22 49 29 53 29 35 14 30 55 7 29 14 32 22 35 37 29 25 21 30 41 35 12 35 39 42 12 22 -4 10 61 17 53 20 17
-2.03201 17 15 34 37 -5 29 34 31 27 12 31 17 8 19 47 19 25 7 32 31 16 59 0 19 23 17 16 24 48 -5 47 15 38 -6 5 17 31 20 49 23 30 8 34 28
-2.05389 28 -3 20 0 8 25 11 21 30 18 30 32 26 25 24 42 6 40 26 4 10 21 20 -1 12 7 4 32 6 39 24 36 15 35 42 1 44 4 12 22 26 27 -4 -20
-2.07576 -20 29 9 20 16 51 19 36 18 -5 54 41 32 16 28 18 25 42 46 39 35 26 26 34 49 45 32 19 31 14 43 28 15 31 32 60 35 42 11 21 43 8 20
-2.09713 20 47 61 14 39 4 29 33 39 21 -2 -8 19 29 14 19 17 19 14 38 30 11 41 10 32 36 20 29 20 35 20 39 29 10 45 10 27 24 34 36 30 22 36 18
-2.11900 18 32 0 36 -2 28 39 22 21 29 25 18 19 33 40 44 37 6 62 30 44 36 26 15 11 62 23 32 20 16 46 10 35 11 38 37 16 14 -14 27 47 9 37 20
-2.14088 20 39 17 24 31 29 30 11 21 19 31 20 31 26 37 27 5 20 19 35 11 54 19 21 5 38 8 21 4 14 26 43 19 35 12 30 26 16 33 14 23 54
-2.16173E4k3j1L1l3J8j7J6pOmoJLj1J3k5K6j5Qj1K7Mj6rJ7m5K2J3qj5K9KJ0kk8j4J7%nQ%Ql4L6
-2.18412C0l2L8l9M7oj5J1OJk7L3k0j1J3Nnk4L3j1K3k8lMj2J4k5M0l5K0j2K2rj0MOK6m8L3k%j6J3
-2.20548C2l2K8mj4L2j7qJ9J0rk4J8J1jl3L8j5Qj3J4mk2J7Tk3%K0kpk2Nj6RK2K4nk4%j2j3J2M1k7
-2.22736C0rJ8l8M0mj0mK4l4rK0kJ4LMj7lj5OJ4QK5k0k1J3j0mk4M8lTk8K0kJ4j7oJ1NMKjl5L4j4j
-2.25076B3Pok1N5o1L6k6M0l2J6Rk1J2j9L1k7L1k7K7l7K7J2k6J7j7QLJNpRJ0k5ll4K7J8j8%MTL%
-2.27263B8j5L3m2M7l0J8Kl9L2k5RoNK7k1K3j7J2rpoQJ4onk3L0Nk7J4KkqJ0j9M6l7J8j5rM0k9PLl
-2.29552C3K1k4j4PLk9M1j3TJ1J0pk5O3l0rJ8j6KMj5J4Kj1J3k1ONJ5j2nKLRk4J3K8k1j8K9j6%j0
-2.31740A9K8k5J2KjoJ%j1K4j4k8M4j1j5j2J0jJ1MqRnmo%oK7JnJ0k3k2N2j5k7K0pKnK6%oj7k1L2j
$$ plain form
-2.16173 54 31 20 51 18 36 19 35 28 34 30 24 25 28 17 30 5 31 16 24 13 40 44 28 19 36 -9 13 26 18 3 32 34 44 42 14 0 17 17 12 20 20 28 -6 30
-2.18412 30 -2 36 -3 44 38 23 34 40 41 14 47 27 16 29 34 29 5 38 27 50 22 19 23 11 25 0 40 5 25 13 35 26 16 20 26 52 4 37 35 35 19 32
-2.20548 32 0 28 24 10 42 25 17 36 46 37 13 31 42 41 8 46 31 39 26 40 36 14 31 48 25 25 45 43 36 14 19 3 12 34 58 53 29 29 17 4 16 57 30
-2.22736 30 21 39 1 41 37 27 23 47 13 4 24 22 36 39 43 26 23 8 14 28 36 61 41 20 33 23 19 -5 43 40 37 9 29 27 41 24 18 29 34 38 40 39 4 38 24 23
-2.25076 23 30 24 3 58 -3 33 7 47 15 31 40 19 31 12 43 16 47 20 47 10 37 49 23 40 23 31 34 35 40 33 42 52 27 24 -10 17 35 17 17 21 25 28 28
-2.27263 28 13 46 4 51 21 39 41 2 34 9 18 12 17 44 23 46 29 41 32 25 19 27 41 35 30 7 37 42 15 29 31 29 21 31 12 58 21 39 24 15 55 26 33 36 33
-2.29552 33 54 30 16 23 26 -3 38 25 12 23 33 26 1 64 34 25 43 27 29 33 18 32 34 23 36 15 21 26 41 29 24 26 29 38 14 27 55 34 16 45 29 29 19
-2.31740 19 47 22 34 36 35 29 30 30 19 43 29 1 45 34 19 7 17 16 27 31 23 32 27 23 17 17 11 38 39 34 44 21 -1 51 36 9 29 22 24 19 45 45 39 22 1 33 32
-2.34131C2Lj1PKkJ0Pm1MJ1j8L7K0k9j3LK6l5K2k3L3m3M4rPl6NoK5j4J1K9k4Lk4kK2j3Qj8Qj7K1
-2.36318B2l4O3l2J3oLTk4L7m1L5l8O7n9L8o0O3nrjrJ0k3PJ5j8RJ8k3J7kRl6L8k0oJ0j2KJ4k4L5
-2.38455D6k6QJ2nk6J1L5k2OKk0%J2jNj3mJ7j0Pk3mQOJ0k5L3qK0j4l%j4qK5j8K5j7kJ1J8l3J4j9
-2.40693A6K6j6j8J8jJ1rK3k1l7M8j5TJ7K3rl2lJ5j0nN3k8lJ2k9QJ4j1L9m6Lk9N1kj2KK4k7NTnOj
-2.42931C5k6L2kk8L6j7K2m2L4j8Qk1K9l4L0rNJ9l9K7j8j2pJ2L2j5J2k8K2j5j3L7k9j2K7J8rk3KT
-2.44966B4L2Kl2J8kTk0kK5Qrj3J3k2lK5j0J5rklrJ6K4m0J2Jj3J9j4J2Jm8M2lJ9k3J0k3L9l9K1k4
-2.47154A3K2oJ4k4L1k2Rm0L1LpLJK0l5K3OmOTj1j7k3L5knj6N0m1lJKJ3J0j6j3M4m5J8j3J6Nj2jQ
-2.49443C4j7PK2j2k2J0J7qlLjJ0Rl5J0OPj4OJ5k6j0J3K4j4J6k1Qj1j6K4J7Rk6Lj8rK1K3k4rMJ5n
$$ plain form
-2.34131 32 35 24 31 33 31 41 48 7 11 22 4 41 61 32 19 22 48 13 35 12 45 2 46 37 44 8 13 7 32 18 29 58 34 37 13 11 33 20 28 10 18 1 22
-2.36318 22 -12 51 19 32 26 29 32 8 45 4 39 1 68 9 47 -13 50 45 36 35 26 36 13 20 35 17 26 44 21 38 36 45 9 47 27 21 31 19 21 35 11 46
-2.38455 46 20 28 40 35 9 20 55 33 39 41 21 21 33 32 37 24 20 37 27 34 11 7 15 21 31 6 39 31 51 37 34 34 20 12 37 19 44 27 25 36 54 21 35 16
-2.40693 16 42 26 8 26 25 36 27 50 29 -8 40 25 10 27 50 41 9 6 21 11 6 59 31 28 40 11 19 33 22 61 15 18 -11 40 38 26 28 52 25 30 35 30 36 35
-2.42931 35 9 41 39 11 47 30 52 10 44 26 34 13 42 8 38 29 34 53 14 41 23 11 4 16 48 33 45 17 39 24 11 48 19 7 34 52 43 20 22 24
-2.44966 24 56 58 26 44 42 40 20 18 43 51 42 29 42 20 17 42 32 47 38 36 33 24 40 64 24 36 37 24 43 29 41 42 -6 36 33 52 29 39 16 55 16 37 13
-2.47154 13 35 29 43 19 50 28 37 -3 28 31 24 27 28 48 13 36 42 38 44 50 39 22 -1 34 32 27 11 61 20 17 18 20 33 43 27 14 58 13 31 18 34 39 27 26 34
-2.49443 34 17 24 46 34 12 22 39 31 28 31 30 40 49 14 24 30 37 23 29 44 18 8 21 45 31 47 26 34 23 7 31 48 57 31 34 16 7 28 51 27 18 22 37 32
-2.51681C2Nnj7JK6%j8K5k0K3l1L5m7J9%KOmnj1J8Rj6nJ2J1Jl5J7Rj5QJPk8K5lj5N2l2Lk6L4l6M2
-2.53971E4o2L7%k7K3POj3J7k9K9j1k2QOl%K5l6J4LNmK7l8JRj8L7j2J7k3K5k5L0m7L6k9J3k2PJ9r
-2.56158B5RJ2nj2mMlJ0kj0J6Mk6K2j2j7J3j6L1rJ7j6L4k6j8K4lkorK2mLk3K9j7j2K4kj0jqJL0r
-2.58447D8m5J6jJ8j4K8m8K3j0M1j0qj3Ok6L6m0M3mqk0jL8m6N2n0M0k4KM0m3K4Jk1qJ7lJ8k9K6j6
-2.60533B9J6Jk8L5m9K3j2K0J5l2Qj1L2Qj0j9J7oTk0j7L9J%k4L6Jj1l2K1qM7n6N5j2%k7kTM4l1rK1
-2.62720D5k0j5QK5k1Qj%OqK4Oj2j4qkJ5jLJk4J9lK0m4K4JJ4rl6M1J0j5k3J3j4K9orL2m0L2j0Jj6
-2.65010B6L8l1Om0L7mJkj3K1Lqrnj3M0l4RLl2M0jJ0m4J8K5k0j1K9k8M0k3pJ7j9K9l1K9l3L4l8L4
-2.67146D3k1K2m0M6l5K6l4NJ6K6l2L2l7M1l7J6j1J2K9n4J9j1J5k3M0m0L1Pm0L3PJ6j9m1K6MPJ0l0
$$ plain form
-2.51681 32 37 32 15 16 42 42 24 49 29 52 21 56 9 28 28 30 36 32 27 16 34 43 27 22 34 45 46 11 28 37 22 30 31 38 10 35 32 17 69 37 40 14 48 12 54
-2.53971 54 -8 29 29 2 25 32 38 25 42 13 42 31 9 17 23 20 20 45 9 23 26 31 27 54 16 17 26 8 45 33 50 27 52 27 57 10 46 17 30 8 15 34 25
-2.56158 25 34 46 41 29 25 29 26 36 34 24 40 44 18 40 28 11 24 8 39 30 47 31 65 39 21 45 42 40 34 25 47 43 46 23 52 35 23 47 45 35 34 26 27 57 48
-2.58447 48 3 19 18 36 22 50 2 25 15 56 46 38 25 31 5 41 1 44 40 32 12 11 49 3 55 5 45 21 23 63 20 44 45 24 16 33 30 48 19 45 29
-2.60533 29 45 46 18 53 4 27 15 35 50 18 26 15 47 55 45 26 43 37 31 11 -6 33 34 34 10 46 47 36 4 25 17 64 8 63 51 51 24 22 20 64 33 24 45
-2.62720 45 25 10 18 43 22 30 29 29 35 27 51 57 45 31 23 21 36 35 38 39 15 34 31 51 7 31 32 46 37 1 42 52 37 14 27 13 42 36 27 59 19 51 41 42 26
-2.65010 26 64 33 39 -1 36 32 33 31 18 39 42 34 25 20 7 47 13 22 25 -7 33 32 42 -2 16 41 21 10 39 11 51 28 21 38 19 48 17 46 13 47 9 43
-2.67146 43 22 44 4 50 15 41 7 12 28 54 22 54 17 58 21 37 26 38 67 13 32 21 36 13 53 13 44 51 11 44 51 67 48 7 33 37 44 54 24
-2.69130B4j5J7L4m5L8m4K7Nj8jj7%J9J0k6K5k4J6RL2k7k2J2OJ8j1k4J0J2rJ5l7L9rj5J5OJqMnkk6
-2.71318IK1K2j7m0M7k4L3l6J6kLnK2m2M4PTn0J9Lj0L7k4QnMj8Jj9K3rMk8J5L8k1j%j2PrL3j8k1K5
-2.73607C7J5k7k2M9j4orJ7Rj3j2lj4L8J1o4M1mPNj3L0m1K9k6J3kK4j1Oj0rJ0k2J7j0oJ6mP%qK4pn
-2.75896D3k8K5j9J0j2kK7pJ3j9JJ2k3J9j3Nk4K0JJ4k0J7Nk0J4J8k7J5j7j8KL3k1J1J4rK2%k5M2m4
-2.77982C5j5KK4J0mRrl2j0M5k8L2k9OJnj4J0lOPj2L1l0nJ6j1QKJ2k4M%K0k6NoJ4Mj7J1J5k%pjrJ8
-2.80423D8k2J5j0KnK2nLk1Mj4K6j6K6l3OK4lj2L0m1J9KPj6j5K9j3K1rj0TpJ5J0k0K5l9J6j4M8k9K
-2.82611C6k1L0J0l9N2n5M1j8J5k8mK8Kk8NK7pk5K7j0KJj7K0l5K8k5K8KJ0j8k3J3J2qJ4lTJ2j9j8
-2.84697A1K1j2K1oj6J8%j8J4LrK3l2J7rj8RK9j0Pk2L1l0J1LJ3rj6KJ6j2J4Kjj9Kk7L0PLjk7L4l8
$$ plain form
-2.69130 24 9 26 60 15 53 9 36 41 23 22 5 5 24 34 8 33 9 25 34 66 39 17 29 35 53 42 18 28 40 31 46 9 48 39 24 39 45 46 38 42 37 35 9
-2.71318 9 30 52 35 -5 42 18 51 15 31 29 32 27 49 7 51 58 65 15 34 37 27 64 40 48 43 47 29 30 11 34 25 29 1 16 54 33 32 32 20 27 18 51 33 12 37
-2.73607 37 52 25 3 52 38 32 23 40 49 36 24 21 7 45 56 -8 33 29 36 41 28 58 17 46 20 33 31 55 44 50 40 31 41 19 36 26 20 36 32 39 39 31 55 48 43
-2.75896 43 15 40 21 31 19 17 44 37 50 31 32 44 21 40 27 32 8 28 29 43 23 40 45 25 39 57 30 45 28 10 12 45 24 35 49 40 62 62 37 79 35
-2.77982 35 20 22 46 56 52 61 52 20 10 55 27 59 30 36 37 32 18 28 25 31 38 26 57 27 22 38 27 35 37 49 25 29 29 49 23 28 22 36 40 23 34 49 47 47 40 39 30 48
-2.80423 48 26 41 31 33 28 50 45 48 27 31 17 43 27 53 20 26 50 47 35 65 24 43 45 52 36 21 50 37 58 49 39 29 22 37 47 27 52 13 29 15 63 34 36
-2.82611 36 15 45 55 16 68 13 54 36 51 23 19 47 49 21 26 53 46 21 48 38 40 41 24 44 9 37 12 40 42 52 34 11 24 36 28 42 39 36 48 29 11
-2.84697 11 32 20 41 35 19 37 37 19 33 36 27 50 18 35 26 8 17 46 36 43 21 52 22 33 36 49 40 24 26 42 30 44 46 45 26 28 1 31 38 41 40 13 47 9
-2.86935IN2k9K3k8nNMl0L4k0J9K3k6J4j6J3%Jnk6J8pK8j4Ml4J6kJ5j1K0j7j9K4j5TK1MJ9j5K5j9
-2.89072C8J4m0J5QKj3M1j7J3j7j6J4k4MK3Nk0M4o5O9l5lm0J7J0L7l9PK4k7KpNQj0j4K9pKJ5j3Ll
-2.91259C9k6K0k8K6KK1k4K7k8k0lK0%L7ml3J9j0knOk2L9k3j7J3j4L3pj3K4j4Lj2L1n0L9j7J8pj4n
-2.93396A9K2J0l2J3j9J1L3pNok6K8j7J3j0Pk7K5Nk1J2Pj6mj9M0k4K7JoJ2l0J8k2K2k3K5k8J6nL4
-2.95481F3k9K0rk7K5PjLkqj0j5K5j4K2k4RK7k1jk5L7k1K8kk1qjJ1J2ok1jJ7J4k6QK4j8Qj1J7j2r
-2.97720C4J3k2L7m3%J2J4jOj8j5M6l1Kj4J0nlK1JkrOjj1K8k9JJ7rJ9j5J5k2L8j0roUNj9QqN0l2jp
-3.00161B9QJ2Mnj0J3j2Nj3J2J1m1O1j9Ml1K4qk8L4Jl1L4k7J0j1JjL2l1K9mpJLJ8Kl2j8K6mj3J5j7
-3.02400B6L0k4K8l0K2l3J4Nk8L6Pj2j1qJ6j4M2n8JJ7J3J2j6JJ4rK1l6RlJ5mOLl3MJL4m9J9J4rQj9
$$ plain form
-2.86935 9 61 32 55 27 22 27 31 1 35 15 34 57 31 45 29 42 42 43 38 12 30 23 51 37 41 7 23 21 36 25 45 28 9 33 18 3 24 28 47 32 57 38
-2.89072 38 52 12 27 35 37 24 65 48 61 44 28 42 18 22 45 50 30 74 9 78 43 40 0 17 27 64 25 32 56 29 31 24 29 37 27 13 42 35 37 52 39 42 39
-2.91259 39 13 33 5 31 33 54 30 57 29 9 6 26 26 63 59 26 45 35 33 28 34 12 51 28 11 24 10 43 36 23 47 33 36 24 55 5 44 27 45 38 24 19
-2.93396 19 41 51 19 32 13 24 57 50 55 49 23 51 34 47 37 44 17 42 47 26 38 45 29 25 6 46 22 49 50 44 56 26 44 22 44 21 46 18 34 29 63
-2.95481 63 34 54 45 18 43 50 49 52 50 42 32 17 42 28 50 26 35 62 41 40 15 52 31 59 57 36 28 27 38 50 44 23 22 39 53 27 35 59 41 49 38 55 43 34
-2.97720 34 47 25 62 19 19 31 45 44 50 32 17 63 32 34 20 30 25 22 43 44 42 33 39 38 27 55 26 27 44 35 54 39 54 32 70 60 51 45 39 33 38 19 27 19 69 37 36 29
-3.00161 29 37 49 53 48 38 51 39 44 31 43 54 13 74 55 59 28 52 44 16 50 51 20 54 27 37 26 27 26 58 27 56 52 45 46 49 67 69 37 19 45 41 28 43 26
-3.02400 26 56 32 60 30 52 19 33 38 10 46 53 41 30 22 38 24 66 8 9 26 39 51 35 36 50 41 62 26 35 32 47 43 49 52 19 23 24 58 9 28 42 33 41 22
-3.04638B2J3oK9m4K1Joj0K3lmkjM9m5%kPLk5J3K4k0lNj2J5kmk3J2MJ1lK0nK3m7jmJ1%l1K4j2K4r
-3.07029C0L0LNj1k2qK6k6j5L0J6l5J9KMOj3K1j8k4M4%l9J5Kk4K8LMj5j4OTJ8j8J9k1KJ6Rk0Kj6J3
-3.09267D0L0n3L8j5Mk2J3J8qk0K1L6o0M6n1
$$ plain form
-3.04638 22 35 29 58 14 35 36 30 20 43 40 36 34 33 82 37 37 35 42 45 20 33 57 37 34 39 27 42 40 36 13 25 29 40 37 57 52 75 28 27 23 34 34 3 27 15 39 30
-3.07029 30 60 63 68 57 35 27 53 27 12 42 58 23 42 44 48 54 41 62 44 20 64 64 25 40 42 18 46 49 53 38 24 30 36 54 36 55 34 36 52 61 41 43 27 40
-3.09267 40 70 17 55 40 44 22 35 53 45 25 46 82 22 68 17
-3.10030A7    $$ checkpoint
##END=
