##TITLE= 2,6-Dihydro-2,5,11-trimethyl-1H-pyridazino[4,5-b]carbazol-1-one
##JCAMP-DX=   5.00   $$ Varian Associates, Inc., VNMR Software
$$ VNMR Version 5.1 Revision A, March 1, 1995
$$ Wed Jun  3 11:46:09 MET DST 1998
$$ svsj version 5.1, 97/1/14
##DATA TYPE=  NMR SPECTRUM
##DATA CLASS= XYDATA
##ORIGIN=     varian
##OWNER=      haider
##SPECTROMETER/DATA SYSTEM=   Varian UNITYplus-300
##.OBSERVE FREQUENCY= 299.9498529
##.OBSERVE NUCLEUS=   ^1H
##.SOLVENT REFERENCE= 2.490        $$ solvent=dmso
##.FIELD=             7.04         $$ Tesla
##.ACQUISITION TIME=  3.7376000    $$ seconds
##.AVERAGES=          32           $$ number of transients
##RESOLUTION=         0.153        $$ digital resolution in Hz
##.PHASE 0=           -38.5        $$ zero order phase correction (left edge)
##.PHASE 1=           0.011232     $$ first order phase correction, deg/Hz
##$REFERENCE_POINT=   929.936      $$ Referencing label
$$ Varian specific parameters
$$ --------------------------
##$acqstatus=    (0..1)  101 0
##$alfa=         19.9999923706     $$ usec
##$alock=        <n>
##$array=        <>
##$arraydim=     1
##$arrayelemts=  0
##$at=           3.7376
##$bs=           16
##$celem=        1
##$cp=           <y>
##$ct=           32
##$d1=           2                 $$ sec
##$d2=           0                 $$ sec
##$date=         <Oct 20 97>
##$dfrq=         299.9493529       $$ Hz
##$dm=           <nnn>
##$dmf=          200
##$dmm=          <c>
##$dn=           <H1>
##$dod=          0.00999999977648  $$ sec
##$dof=          0                 $$ Hz
##$dp=           <y>
##$dpwr=         30
##$exppath=      </export/home/varian/haider/vnmrsys/exp1/acqfil>
##$fb=           2800
##$file=         </export/home/varian/haider/jk3>
##$filter=       54.0999984741
##$fn1=          1024
##$gain=         48
##$homo=         <n>
##$hs=           <nn>
##$hst=          0.00800000037998  $$ sec
##$il=           <n>
##$in=           <n>
##$lb1=          0.318309992552
##$load=         <n>
##$loc=          0
##$math=         <f>
##$method=       <z1z2>
##$np=           37376
##$nt=           32
##$p1=           0                 $$ usec
##$pad=          0.5               $$ sec
##$parversion=   4.3
##$pmode=        <partial>
##$priority=     5
##$proc1=        <ft>
##$proc=         <ft>
##$pslabel=      <std1h>
##$pw90=         16.8              $$ usec
##$pw=           10                $$ usec
##$rfband=       <ch>
##$rof1=         10                $$ usec
##$rof2=         9.9999961853      $$ usec
##$seqfil=       <s2pul>
##$sfrq=         299.9498529
##$sn=           0
##$solvent=      <dmso>
##$ss=           0
##$sw=           5000
##$temp=         28
##$tin=          <n>
##$tn=           <H1>
##$tof=          500               $$ Hz
##$tpwr=         57
##$vtc=          25
##$vtwait=       300               $$ sec
##$wbs=          <>
##$werr=         <>
##$wexp=         <>
##$wnt=          <>
##$wshim=        <n>
##$wtfile1=      <>
##$wtfile=       <>
##$x1=           -103
##$x2y2=         327
##$x3=           123
##$xy=           335
##$xz2=          0
##$xz=           62
##$y1=           22
##$y3=           -133
##$yz2=          0
##$yz=           -40
##$z1=           -1904
##$z1c=          -86
##$z2=           -1250
##$z2c=          208
##$z2x2y2=       0
##$z2x3=         0
##$z2xy=         0
##$z2y3=         0
##$z3=           85
##$z3c=          0
##$z3x2y2=       0
##$z3x3=         0
##$z3x=          0
##$z3xy=         0
##$z3y3=         0
##$z3y=          0
##$z4=           -101
##$z4c=          0
##$z4x2y2=       0
##$z4x=          0
##$z4xy=         0
##$z4y=          0
##$z5=           0
##$z5x=          0
##$z5y=          0
##$z6=           0
##$z7=           0
##$z8=           0
##$zx2y2=        0
##$zx3=          0
##$zxy=          0
##$zy3=          0
##$rp=           17.7
##$lp=           -56.2
##$rfl=          1676.8
##$rfp=          746.9
##$axis=         <p>
##$sp=           -30.1
##$wp=           3779.3
##$cr=           1057.2
##$delta=        111.5
$$ End of Varian specific parameters
$$ ---------------------------------
$$ Y-values stored with standard (16-bit) integer precision
##DELTAX= -0.0005087113
##XUNITS=        PPM
##YUNITS=        ARBITRARY UNITS      $$ (mm on paper)
##XFACTOR= 1.0000000000
##YFACTOR=       0.004410246
##FIRSTX= 13.5686394668
##LASTX= -3.1003049043
##MAXY=          144.510530
##MINY=          -0.515999
##NPOINTS=       32768
##FIRSTY=        0.374871
##XYDATA=        (X++(Y..Y))
$$ [...]
10.66237c3L8j6P1n7N0k5K8m7k9L7rjl8O6j3o8P2j1oqL3Om3M9j8jq7R9n3K8J6m8lJ6N8p6L6O4o3
$$ -33 5 -11 60 3 53 28 56 9 -20 17 8 7 -31 35 22 -46 26 15 9 1 34 40 -3 46 28 27 -60 39 -14 14 30 -18 -21 -5 53 -23 13 77 14
10.64253A4qL3m4qO7K3r9L9j3k4M2k6Oj9K3J0o6Q8m6K9n0J00r9L9j7L2k6L9l1k0J9L4nl1J2l4J6
$$ 14 6 39 -5 -13 54 77 -22 17 4 -20 22 -4 2 -17 6 16 -50 38 -8 21 -29 71 -28 11 -6 26 0 39 8 -12 7 41 36 5 17 -17 -1
10.62371aN3q4N5j9k2N7j7k2K2l5K4PM5p6M3j7m1L7l5M4n9L6J3j7L1k4k3K8PTk4k6L3K7l6K0m0Q
$$ -1 52 -32 23 4 -18 39 22 0 22 -13 11 18 63 -13 30 13 -28 9 -26 18 -41 -5 8 -9 22 -2 -25 3 10 17 -7 -33 0 27 -9 11 -29 -21
10.60438b1L6K3o8M9n3M3QN3o6L7J7o1J0mL9o6J9J0L7m0K8l4L3JrqPm0QJ4RPRm3N1q3O3Jl6JN0
$$ -21 15 38 -30 19 -34 9 17 70 4 41 58 -3 7 3 42 -24 -5 5 42 2 30 -4 29 30 21 13 20 -20 -12 2 11 18 27 -16 35 -48 15 16 -20 -19 31
10.58352C1l5K2nm1O7m7L5j7ok1O0m2M0o8O0m1l8M9j5K5Qn2N8k9J0j7P1o6L9l7K2n%M3q9O1o2L8
$$ 31 -4 18 13 -28 39 -8 27 10 4 -17 43 1 41 -27 33 -8 -46 3 -12 13 21 -31 27 -2 8 -9 62 -4 35 -2 20 15 15 58 -31 30 -32 6
10.56419Fl2N6p5R8o9K2L5o2JM6k9Qk9J7PjK0okPTlj0j9K4j7m6N9m2P7l9J9o5P6n0N5k0pJ5J8n3
$$ 6 -26 30 -45 53 -16 6 41 -21 -20 26 -3 5 -24 -7 0 -1 19 13 11 18 25 22 12 -7 17 0 -46 13 -29 48 9 28 -37 39 -11 44 24 17 32 50 -3
10.54333cM0nj3J0n8P6k6nj3JkOqmK3k5L4j8n0K9ojM8m0L3j2n6N6Lj4j2J2K3Jl0J9No3M2J6m1N7
$$ -3 37 32 19 29 -29 47 21 16 3 4 2 8 0 -4 19 -6 28 10 -40 -11 -17 -18 30 -10 23 11 -45 11 14 0 -12 0 23 24 -6 13 18 -45 -3 13 -28 29
10.52197B9n9N1k2pK9J2m3K8n2J02m2m5O8m9K8k1J6lJ1J4j3L8n5NQo0N9lOj4L1m9L4m9K3%MlL4
$$ 29 -30 21 -1 -8 21 33 -10 18 -34 68 26 -19 49 0 28 7 23 20 31 45 32 70 15 20 28 -32 27 24 30 16 47 -2 32 -17 6 6 10 7 41
10.50213D1l6L4l2j8K8l4L5l1N4k4K9m6N4n8M0m9P4n7Nj1J0M6p3O7p7K5k6P4o1%J8j1K3j5Tl6R2
$$ 41 5 39 7 -11 17 -17 18 -13 41 17 46 0 54 -4 36 -13 61 4 9 -2 8 54 -19 48 -29 -4 -30 44 -17 -17 1 -10 13 -2 -17 -53 39
10.48331C9j9jk7M5k0n8K1K0O7j00L3j0N5m7J0Ojj4K6p0P4n6P8o7J8nj3k9M4J9L1l3l5P3r5R3q5
$$ 39 20 19 -8 37 17 -41 -20 0 67 -33 0 -10 45 -2 8 14 13 -1 25 -45 29 -27 51 -16 2 -3 -16 -45 -1 18 49 16 -19 54 -41 52 -33
10.46448c3P7l4j5j9P3n4L5m4K7j8PK4J1l1Lj2L3n1J3jJ4K2l1L6j12J39n9O5q8N8o6Q2n0nL6q6
$$ -33 44 10 -5 -24 49 -5 30 -14 13 -5 2 26 37 6 9 -3 30 -21 -8 -9 5 27 -4 32 -80 59 0 65 -23 35 -31 51 1 -4 32 -54
10.44617e4N5Rlj2qK5K2n3j5L8K2l4L2k0K4k3J4m0J02r6jJ9K9k0j0m2O8k8J0Kol0K2J3lj0J3rK5
$$ -54 1 10 7 -5 -13 12 34 -19 -34 4 26 -8 24 4 28 5 19 -21 81 -15 -16 3 32 12 2 -40 28 0 10 12 6 -24 -2 11 8 -2 11 2 27
10.42633B7j3pk2J8l9P2k0j2K2k4%j7lP5r2P6n5K1KTl2M0j4J6K1p9L3m1R7n3M3o1L0Mm6K8M4ll8
$$ 27 14 7 -15 3 -36 36 16 4 26 2 2 -15 -18 57 -35 41 -14 7 9 11 -21 19 5 21 42 -37 -4 -45 52 -1 42 -19 11 15 -31 -3 41 38 0
10.40649@lLrKj5K3k0J1N%Qn1M7J1n2N0qOj9L1l4j0N7l3K1p8O1pK8j2J6J0p9L4lRm0L1P7j15O1
$$ 0 -3 0 -9 -7 -22 1 -19 -8 -3 -3 5 -46 1 12 -40 10 2 8 -11 20 -14 -24 33 0 21 -57 4 -3 25 13 29 39 -40 -6 -9 0 -40 -9 68 -47 14
10.38563A4k4K1j5MKk4N9j2l8J7j0L5j7jl0RJ6k6L9J5j3j4pM3j12P9J0J1k7K2%j3J3n2M9m6J7p
$$ 14 -10 11 -4 0 2 -22 37 25 -13 4 -6 29 12 11 -19 -10 6 -20 19 34 21 7 0 43 -69 10 20 31 4 26 26 13 26 -26 23 -23 -6 -13
10.36630a3J3KJ6o2L6J3j7K4K7k8qk3K8NK8m0j3KM3l9L0%j8j4K4j3JK9Nl3J0l4L0j6Nlm9K0L3nM
$$ -13 0 2 18 -44 -8 5 -12 12 39 11 3 -20 8 13 41 1 -12 -10 33 -6 24 24 6 -8 16 3 4 33 38 5 15 -19 11 -5 0 -3 -52 -32 1 -4 0
10.34544@k5K4LMl5Q0j04P5j7L7o1Qk5Nk1K4nL9k2L4j8L4k1rj6J6Lk1N9l8k8L3Pm9N4j4j6Mkl0
$$ 0 -25 -1 2 6 -29 51 -53 22 5 42 -19 -11 -36 -31 -52 -28 -33 6 -16 18 0 34 13 4 -12 4 7 -14 45 7 -21 12 19 -30 24 10 -6 -2 -4 -34
10.32510c4K5J1MoK9jj2j6L4k5j9j2J0K7J5n2M0j2qNK1j0kL8m5J0l7N7o6L4m5O5j7K8n9O9k2j0
$$ -34 -9 2 6 0 29 28 16 0 34 9 -10 -22 -12 15 30 -22 18 6 -2 3 24 14 12 50 5 15 -22 35 -31 3 -42 23 6 34 -25 44 22 12
10.30576A2k6J1o4Q9j3k9K2l4N1m5LpK0K6lj5K3jk6lK6l1M0m6N6k7J0Tk6K1q4J23p5L3q6R7j4l7
$$ 12 -14 -3 -67 22 9 -20 2 -32 19 -26 -23 -30 -10 16 13 -2 21 20 -6 -9 17 -14 26 -20 36 9 19 29 3 24 -60 63 -12 21 -65 32 18 -19
10.28643a9RJ1L8n6L0LkJK1j8n8Q3n6k4L2L4l3k1M9m9K7KJ6j1mpmOL1j6Ql2J7m4N4j4PL1n3J9O
$$ -19 -10 1 39 -17 13 16 14 15 36 18 -40 43 -13 -37 -5 29 -4 -25 24 -25 2 4 20 9 5 -2 -6 0 31 15 23 -9 8 -36 18 4 11 42 -11 8 14
10.26558A4J8n7L5j7K4k5L7p8J6O0K0k2k4Kqj%J4Tn0N6j6J9n8J7K6p0R3j9n1N4j2l2J3J2J4m7L6
$$ 14 32 -25 10 -7 17 -8 29 -49 -33 27 47 25 1 3 -5 -6 -6 8 22 -28 28 12 31 -27 -10 16 -54 39 20 -31 23 11 -21 -8 4 18 -29 7
10.24625Gj2l2P4l7L8o1L4J2Pm2J3J2m3J9Qj4O5l2J5m3K2k4N6m0K3rPl6L2Kk1K4J4l0Lk3Pk3K9
$$ 7 -5 -37 37 0 38 -23 11 23 30 -12 1 13 -30 -11 -3 -17 48 16 31 -12 10 -14 42 2 25 16 23 -13 19 21 0 24 38 8 11 -12 -5 -28 1
10.22641Ak8Q2n1K5j4Pol0M6qk4j3K8j9K8K2n0oK7rJ5l4J0KlM1nl4jJ7m8JOP0l5o4N1MqOKNL7k
$$ 1 -27 55 4 29 15 22 16 -14 32 24 0 -13 15 -4 24 46 -4 -10 17 8 23 -11 -1 1 -2 39 34 0 -1 16 -32 -31 -25 45 10 -54 -3 1 -7 -1 1 6 43 41
10.20402D1n2L7o3O6m0J1jJ7o5O8Kk1l1J6L6%l3M1j5m9M0m2N7m9L7j2k2QTK7m2J9L8n7J2L9ln9
$$ 41 -11 26 -37 29 -11 0 -1 16 -49 19 21 0 -31 -15 21 21 -12 29 14 -35 5 -37 20 -29 8 -4 -26 -18 -10 17 -25 -6 32 -25 -13 26 23 -36
10.18469c6O4o0N4l0OrJ4M3o0N6m8O0n7J7NPp9P4jk0J6jj4m5J17m5k4J3rj4k0J1K1P0p5jK3K0m9
$$ -36 28 -32 22 -8 -2 -11 3 46 -14 42 -6 54 -3 14 19 26 -53 21 20 0 16 15 1 -44 73 28 4 17 8 -6 -26 -15 6 76 1 0 23 43 -6
10.16485fN2l0Qp5P5L0k6l5J7j4R4l6l7m5J2J7k2M8nk5N6m7Kk2J2K3m5N5Klj7mj3k0J7k6O3Mn6
$$ -6 46 16 24 -51 24 54 28 -7 10 -4 90 54 17 -28 -16 1 -21 27 22 -3 53 6 8 -14 -2 21 -24 31 33 30 13 9 -4 -24 -7 -33 30 34 -22
10.14501b2K4kk5K3J2j1J7oJk5N4lo4J8J1K0rk1L8k2JoO1r9J7pJ9KK3J0l4Ok0j0J4Kj3L3j5MrK0
$$ -22 2 0 -25 -2 10 -1 16 10 11 -14 40 37 -27 -9 2 22 13 -8 30 8 9 3 64 -35 -18 -25 -6 -4 19 29 -5 1 -19 -29 -15 -13 -26 7 -8 -4 -13 7
10.12365Gj5O6j12Q8j1m1jO4j5j7k8N2j0j05P2J3k6J4j9JM9m2mJ7j8K3j6j5J1kM8l5qj3J5k4K2n
$$ 7 -8 58 -54 34 23 -18 -19 45 30 13 -15 37 27 -78 -6 7 -19 -5 -24 -23 26 -16 -20 -3 -21 2 -14 -29 -18 -20 28 -7 -15 -28 -13 -37 -15 -20
10.10432b0J2M1l4K7l3P9r6N8o3L5j0K6o3O2Om6N3j5k7j9RL2J4n0NJ9pJ0kj7oN0j3j0Lk3N8q5L0
$$ -20 -8 33 -1 26 -7 72 -24 34 -29 6 -4 22 -41 21 27 -19 34 19 -8 -27 -18 14 28 -22 -17 2 -5 5 3 -14 -20 30 17 7 10 -13 45 -40 -10
10.08448a0QJK0l3J4M7o2K8kj8PJ%l8L9l0rR0j2j13P8m5K0KM9pj5rL0k9L2l7KknlM0j6l4K2MQj1
$$ -10 -2 -1 19 -14 0 47 -15 13 11 -7 0 1 1 -37 2 -28 -37 53 41 -72 6 -39 -19 -17 32 25 10 1 31 2 34 -3 -1 -3 -8 -11 29 13 -21 1 5 13 2
10.06260Bj0K1rm1L7K8n6L4n2N4L0j2k6J5j2l3K3l4L1J4Mm3L6K3K4l8pk6OK3j0pj7M0K3Om3mN2
$$ 2 -8 13 4 -37 0 28 -28 6 -46 8 38 26 0 15 3 -30 -7 -41 -10 4 8 -35 1 24 48 10 3 -23 -17 6 -4 -11 -28 12 35 41 -2 -6 46
10.04276D6k0J3o4M8k7RLlk7M0L7m1k1%qnL0K6r0O0m4L7%O3r9N4o6O6j8jJ9l5M2l2M6n0L0k2K3
$$ 46 26 39 -25 23 -4 5 8 5 -22 18 55 14 -7 -7 -15 -20 10 36 -54 6 -38 -1 -1 62 -37 17 -49 17 -1 -2 17 -18 24 -8 38 -12 18 -4 19
10.02292A9n5O3k7Rj8L5Ok7qL6j9m8L6QOl5J2J8l6L8m5M3m4K5J8mL9q3N2j9K4j2K7pn1M9n1K8m
$$ 19 -36 27 0 9 -9 26 32 5 -3 33 14 -34 2 10 16 -19 -7 11 -25 13 -32 11 -33 -8 10 6 45 -38 14 -5 19 7 34 27 -24 25 -26 2 -2
10.00308bL6m5jJ8Mj0QlJ2k6J7m0J6P1l5l0J1k4N1m7OJ0k8K5k6M8k0j5J2j8L0k1N6l8J1n8O4nL8
$$ -2 34 -11 -12 6 10 0 8 5 17 -9 8 -32 -16 55 20 -10 1 -23 28 -19 -13 -3 -31 -6 -32 16 -4 -19 -7 -25 5 -16 40 2 13 -45 19 14 52
9.98324E2m7nJ7Qk6mMj3L9l6M5k4l2N2l7J7l8R%M1l3nQ1o5K6Kp2L9k9K8J6j2nJ5l2j8K6qJ0N2
$$ 52 5 0 17 25 -1 -5 -1 -14 25 -11 34 10 -22 30 -7 10 -28 -19 -19 22 -11 -16 65 0 26 28 -44 -5 -34 -6 10 -2 -7 8 -24 -42 -16 -24 -14 38
9.96289C8k2rJ5n0M9K0n7L0K5n3k4J5N0j2TnJ0l8M7n7L8J8m4L7Jj6J2K3j4k0qK8l7J4j5J0J7J0
$$ 38 16 7 22 -28 21 41 -16 14 39 -14 -38 -23 27 15 3 -2 8 -30 17 -40 -2 16 -28 9 10 -6 6 29 15 -5 -13 15 -22 -8 -23 -13 4 14
9.94356A4K8o5OQmj7K9MJ0L1o8N1n5P6n3K0k1j2M2k9j9JJ5K6k2jk1pJ6j8QK5J6k2N6o1M6m2M5
$$ 14 42 -23 -17 -9 -13 -30 -1 3 13 44 -24 27 -28 48 -5 15 -6 -18 24 -5 -24 -23 -8 18 -4 -5 -26 -33 -17 -35 -27 -2 14 -8 48 -13 33 -9 36
9.92372C6m5L7l4Rl%l2M8k7j6J9j9J9K2k0KOoL7n8J3L7k0j8k0M6j9k0l9J05k3j9J4m2J0TKj9L5
$$ 36 -9 28 -6 3 0 0 -32 16 -11 -27 -8 -27 -8 14 -6 -4 2 -4 33 -25 -12 25 5 -13 -33 13 -6 -26 -65 40 17 -2 12 -30 -20 -10 -8 -27 8
9.90388Hj4J7j3J8Ro4N5mk1M1o6O2nn3J8n6P5j7LNKLM5m8%n2L2MOPJ7J2k4PJ2p3O1jqoJ9Pm1K3
$$ 8 -6 11 -2 16 25 -39 16 12 -9 32 -34 28 23 -30 -12 -68 7 -10 -7 -2 0 3 48 0 0 -52 -20 -16 -10 -3 14 26 2 9 21 -52 9 8 0 -6 13 20 -21 2
9.88150Bj9L2m5K9j5MK4l2L1K3n7M5n6M5K7l5J6qL7k5ol6j3mL0J4N3o5J3k0J1j6L5n0N1l1L4o9
$$ 2 -17 15 -30 -1 -16 -12 12 -20 11 34 -23 22 -34 11 38 3 19 11 48 23 17 -19 -32 -36 -6 8 61 -4 9 -11 0 -16 19 -31 20 -11 23 -46
9.86217d6P2m3K0l8L7L3l5j3nL0k5rpJ8j0L8j7L0l6Kk4N5l0J7lm6O7k1J1qm6K4k4L3L1L5n3q6
$$ -46 26 -17 3 -35 2 35 0 -13 -18 12 -13 -22 -29 -11 -21 17 0 30 -6 -4 -28 27 -3 14 11 -35 32 11 22 14 -32 -8 -32 1 32 67 14 -72
9.84284g2R5Om3K3rJ0k7Mj9L2l3lL6%j6J6j1K3J0o7O7J3n0M0m6j6Q2l9m7O7k6Pk5M4o0J4N0l9l
$$ -72 23 29 -14 9 0 10 -17 -13 -32 0 -33 -36 0 0 -16 0 -11 12 22 -45 22 35 -15 25 -21 -37 45 6 -41 26 0 7 -18 26 -34 -20 30 -9 -12
9.82300a2j3M4l2K6o2N9l2M1n2M2k3N2l8M1n3J8j5K4l9L4Jj1Nj2JJ5Qk2k0OLM4l2J9qln8P9j7Q
$$ -12 -25 19 -13 13 -49 10 -22 19 -33 9 -14 38 0 41 -12 6 -9 15 -24 10 11 0 5 -7 -6 9 17 -5 -25 -19 -16 28 -4 15 7 4 -54 25 8 16
9.80265A6m7N8n7J2L8j7LN0m9k3N5m8kL1k9j3pK2%jo2M5L0j0nj8J8j6J7k8K0P3o2M7o3qK3pL4
$$ 16 -31 27 -30 -18 20 3 6 56 7 -16 39 -9 -11 20 -9 -22 -29 -7 -7 -8 -70 -25 5 -5 -10 -28 -10 -26 -9 -37 -17 56 -6 41 -22 -30 -7 -14 20
9.78281B0k4K0k0L2j06M8K1K3n6L4pM4m4J5%J6m1N1o1K0j7J3L1k4N7m2K3j8Tk1L4mK7J8l6m6K1
$$ 20 -4 16 -4 28 -78 -30 -9 14 -42 -8 -15 29 -15 0 0 16 -25 26 -35 -15 -32 -19 12 -12 45 3 26 8 -10 -31 3 -1 26 44 8 -38 -17
9.76399a7LL9m3JrJK5L6j1p3J0N0qlN6p3J1J8j2QMk1NN2r2O7l9J2PTj4m3L2NONL8p4N4ql2M0k4
$$ -17 -14 25 -18 -17 -26 -25 0 36 25 -48 -38 12 4 1 57 -16 -5 13 1 9 13 -8 -3 49 -43 24 -15 -3 4 11 -3 -46 -14 -9 -3 2 40 -34 20 12 -20 20 -4
9.74211dj5k3M9j8OJNl9N7K3l5L1q4N0j5mRj5N1l1l9M4l2P5n6J8loj7J2j0jK7j8J6m8L8Lm3Q1
$$ -4 -19 -42 7 -11 -5 -4 1 -38 19 42 7 38 -46 4 -11 -15 -6 -21 30 -1 -40 4 -28 47 -9 9 6 0 -17 -5 -15 -16 11 -7 9 -39 -1 2 -41 40
9.72176D0m6L2n1N3o3M6J6l8nM9lm4K6j6K1J1m9K7k4L3j5M6r5M8J5J7poJ8n2J3Lj5KNKm4KK7N3
$$ 40 -6 26 -25 28 -35 11 27 -11 -16 33 30 -14 12 -4 17 28 -21 6 -18 15 0 46 -49 -1 14 31 24 18 36 -16 -3 0 -15 -13 -8 -6 -50 -48 -21 32
9.70142C2J4o6L3qJ0j7l2M8L9o8mJ1k6KPpL5L4Kl5j8M2n0K8jl4J1mJ6m8O9p1N5o0P5l2K5jn6L5
$$ 32 46 -20 13 5 15 -2 -34 14 53 -15 -19 -8 -34 -32 -25 -32 3 37 39 4 -14 28 -22 6 5 -29 -18 -22 -6 -54 15 -56 -1 -61 14 -18 7 6 -50 -15
9.68107a5j1J3k7nR5k4m7LL6n8M0k7L1k7K5ll0O2l5Kj4M6q0N0m2J5L2L1q0M0l9Q5n2j0N6m5jk5
$$ -15 -26 -13 -40 -45 50 26 -21 -18 18 -40 0 -27 4 -23 2 -1 -31 31 -4 -2 -16 30 -50 0 -42 -27 5 36 -44 -4 -43 42 -10 -20 36 -9 -10 -35
9.66174c5K2j9K0J5j7Rj8Jl5M5K5k1M0mlm1j9J5Rj5j4M8k2L3l3K7nMLJm0L6m6k4K3L8JML8r1L5
$$ -35 -13 -32 -12 3 -14 -5 -23 -22 -57 -12 13 -8 32 28 25 -16 -35 -20 -11 -26 -40 8 -14 19 -14 13 8 12 15 16 -24 12 -34 -58 -35 3 4 8 46 -45 -10
9.64088a0k2LPmM0k9K0l6N8L1o8J0m8N5moj6J9pP0o9K2j8j7L0n9O2k9lJ2jj2mL6k6j0J7L9l9m
$$ -10 -32 -29 -22 -26 14 -15 5 -31 27 58 -10 0 -48 7 3 -3 -19 0 -7 63 -6 16 -2 -19 11 -48 14 -15 -18 -6 -7 -19 -23 13 -13 -23 -6 33 -6 -10
9.62053a0K9J3p0N9J3l5K2j5K7j5l2j0L8n6M5K0l2l%K0k5j1k1P2k4oM5l2l7P7q0N2k5j2K1K4n5
$$ -10 19 32 -38 21 34 -1 21 6 33 18 -14 -24 14 -42 3 23 -9 -12 -12 8 -17 -28 -49 23 -1 -7 38 6 -31 46 -34 18 -7 -19 2 26 -29
9.60171b9K8N9l8K3n1r%L4k6L3m3J3k1M8K3n6LJ4L2l5Rm1M5pKn9L9j6k0L7m0L9m0O3Ql5TK8k1
$$ -29 -1 58 20 43 -8 -17 -17 17 -9 24 -19 -6 -27 21 44 -12 -9 5 37 2 11 -30 15 8 10 -49 -10 -26 -46 -9 -49 -10 -50 13 21 -14 -49 -21 -42
9.58187d2L1PRNN0p7M2j7J9o0M2J9nm1JL5m2J1k2JL8l9L7l5RM6m8j9K5k7L6k6K4j4L5j8K7k2K0
$$ -42 -11 -4 5 10 60 -17 25 8 27 -33 9 28 23 -18 -17 18 -24 -13 -35 -34 4 -35 2 -33 -24 22 -26 -45 -20 -47 -11 -37 -13 -27 8 -10 17 -5 15
9.56203A5k5k1K4J4Pm6J8J2Tl2OK6rp3P2K0oj1K8k9TK5l0L1l1N9o0J7K8p1N1j2K5mN3r9J5lj6
$$ 15 -10 -31 -7 7 14 -32 -14 -2 10 -22 -16 10 1 -72 0 20 14 3 31 2 -27 -2 -32 -1 -32 27 -33 -16 12 -59 -8 -20 5 1 54 -45 -30 -33 -49
9.54219d9N8l4K7m7P0M2r1J8n8M4NJ6JJ6j6Qm7L3mNj2l2P2k9Lp2L8TJ8ln4k0L0L5l9K6m6O5m4
$$ -49 9 -25 2 -45 25 67 -24 -6 -64 -20 -15 1 2 18 2 10 -37 -4 -8 -3 -15 -47 25 -4 -1 -73 -35 3 21 18 -36 -56 -26 9 -30 -4 -50 15 -29
9.52235b9N3l4j9KL8Mo6P6K0o3m7O1nN0o3j3L3Ql8K2m0R6o4M3m7J9jk3N3n2M4p0Q7m0NoL6n8K1
$$ -29 24 -10 -29 -27 11 15 -51 25 45 -18 -65 -4 -9 41 -22 -35 -2 6 -32 -10 -50 46 -18 25 -22 -3 -4 -27 26 -26 18 -52 35 -5 0 -6 30 -28 -7
9.50251gK3k2ormJ8J1k4QJ4j2k2NJ5k9NL2m7N1kj8j7O8l1J7m1R8n2l2ln1L8K2Mj7j0l0K8K1j2
$$ -7 16 -6 -12 -21 -25 -7 4 -20 -12 2 -10 -32 -27 -12 -41 -36 -4 -51 0 -2 -20 -37 31 0 17 -24 74 22 -10 -13 -64 -26 -4 0 -17 -27 -57 -29 -8 -20
9.48216b0K5k0K4l8jJ8OK4kk7J4K0n2J9qK2J3Om7M5k4L9l8K1l8OK6k9K0m1O4k1J0n0N9l9J5l7
$$ -20 5 -15 9 -29 -30 -12 -6 18 16 -11 3 23 -29 -10 -18 4 17 23 -24 21 -3 36 -2 19 -19 -13 13 -16 4 -37 27 6 16 -34 25 -14 1 -36
9.46283c6O7m5k3R2q6K6k0K5J7J6n3N5p4N9o2P5m3j3lL7j7l0K6MK0j4J7n8N9rRj8m5L2J7LL0n3
$$ -36 31 -14 -37 55 -31 -5 -25 0 17 33 -20 35 -39 20 -42 33 -10 -23 -26 11 -6 -36 -10 -6 14 0 17 -41 18 9 18 0 -45 -13 4 7 37 -16
9.44350a6K0n9K1N4m8kL7k7K3k4L5k4QNL5q4O2k9Ll1J1RJ8K9pm6M7o1K8JM1k3Mk2oN2l5K7l7m4
$$ -16 4 -55 -34 20 -28 -30 7 -20 3 -21 14 -10 -2 3 38 -46 16 -13 -10 -41 -30 -21 -3 26 19 -27 20 -41 -13 -12 29 6 10 -12 -18 34 -1 26 -11 -55
9.42315e5JL4M9n1J0L0J7n6L6j4K2pj7kl6L1Lk7J8Qj5N7n0K3r5J29p2P1m2K6o7M5l3K1j7M6o7
$$ -55 -54 -20 29 -22 -12 18 35 -21 15 1 23 16 -1 -3 -39 -8 -5 -32 -14 -6 -21 36 -14 9 -86 43 -29 42 0 26 -41 4 -29 -8 -25 21 -46
9.40433d6J00j01K7l7N3k9P2m3J6Lj8m0L2rkK8Jj0KK1J2k3j9pM1m3L9kp5M7k4oJ4j3M3l1M8o2
$$ -46 54 -47 -20 -57 -4 -33 39 -4 12 15 -3 -43 -11 -20 -22 6 7 -3 -1 20 32 9 -10 -17 24 -19 20 18 -57 -10 -34 -40 -26 -39 4 -27 21 -41
9.38500d1K8lJ3M1n6N1l3J3k0k2J9pM3ljk2M5k3m2K0Km4M6l3M0m9K3k3J1qM0m0P3n1L2l7j9K3
$$ -41 -13 -16 -3 38 -18 33 0 13 -7 -29 -10 -17 26 23 22 0 45 22 -20 0 2 -42 4 -29 11 -38 -15 -38 -27 -35 5 -35 38 -13 19 -18 -37 -14
9.36567a4P8n1j4J6l4J5P5p1n7J02k0n5K2k1%K8n1J2O4m0L6l9nK7kj4j8P2n0kLL5Jk8NoJ8Mo2
$$ -14 64 13 -1 15 -19 -4 71 0 -57 45 25 -30 -8 -29 -29 -1 -52 -40 24 -16 20 -19 -24 3 1 -13 -31 41 -9 -11 -8 27 28 0 5 -1 17 21 -41
9.34583d1M1k1j8N9J8n4K3j6J9j6JqJ0PTrj4K4j2o0O2k4N0m3K0jJk9N0o3JK5MPJK8j0J3n3Q0
$$ -41 0 -21 -39 20 38 -16 7 -9 10 -6 -5 -13 -3 4 11 2 -12 12 0 -60 2 -22 28 -15 5 4 5 -24 26 -37 -36 -11 -7 0 1 29 19 32 -21 59
9.32548E9j04J8K7K8o7J7j5KlLM9j2kj7JK6J1q0Q0Rmj8qK3o4N6j5k9j6J5J9k6qJ14o1L1pj6n3J
$$ 59 -45 -27 0 28 -39 -22 -37 -35 -38 -35 14 2 0 -17 -16 10 21 -59 21 30 26 8 0 23 -41 15 0 -29 -45 -30 -11 -37 -45 69 8 39 32 16 -37 -36
9.30513c6N5k1K1k3mL4j7rNn8O6l6J8l7M4qL2pj4n7N2k3PJ8m8K9j5J7L4K5l4k6pK0Pk9K5mL1m1
$$ -36 19 -2 19 -4 -8 26 9 0 5 -53 13 -23 -5 -42 2 -6 26 19 5 -52 0 -23 -16 2 -46 -17 -32 -15 19 44 10 -16 -23 -3 4 -25 0 -4 27 -14
9.28478a4K4M4o2nlQj7J9j0L6j1k4jO7p5Mj3P3j9o1L7j6K6J7l2krj1J8J1L1j2q7J01l2J4k9Qk5
$$ -14 10 54 -8 -13 -16 -8 -25 -6 -16 20 9 -15 -16 51 -24 -20 -33 40 21 -40 -3 -19 7 24 -8 -10 -19 -30 -12 -1 30 18 -69 32 0 14 -15 -7 -32
9.26494c2N9q2N5m3N0m2P4p3M1l6M5j5MJ7qK0l3K1n1%K2K6n3P0l3j0k3JJ7Tj5K4j5J3m1N4o1K2
$$ -32 27 -55 0 -43 7 -35 39 -34 7 -29 16 1 5 22 14 34 1 22 -29 -29 -7 19 -34 36 3 -7 -30 -29 -12 5 -10 14 -1 12 -29 25 -36 -14
9.24561a4kJ9K1l4lj0mK1J5n2L1plTnj0OM3L7m4Ok1KK0kl2RL4j9l6L3mj9K3k1P0m5O8p5K9l0m3
$$ -14 -16 3 24 -10 -13 -23 -27 -6 9 -43 -12 -19 -22 -25 -30 -40 -34 9 46 2 8 -13 -11 9 7 -25 -16 18 -1 -37 -4 -8 -27 -4 -25 45 0 68 -7 22 -8 -51
9.22424e1O4J9Kj1j3n0Q1o9N5k8lpRrk3N0l4L7k2K7m4K5Kj1J2Lk0K4n5L3l2J7J3JLK7K3m0NJ2
$$ -51 13 32 34 23 10 -40 41 -28 27 -1 -4 -11 -2 -11 -34 16 -18 19 -3 24 -20 5 7 -4 8 11 -9 15 -40 -7 -39 -22 -9 -8 -5 22 45 5 10 22
9.20390B2k8L1l1N8n7jPj4K9p2O5kl0k6N3Rj3k4K1k2K3mLJ0K5p1R0r8P6m8J8L1j4m1lK7k8L7p
$$ 22 -6 25 -6 52 -5 -6 1 -13 16 -56 9 7 -23 -49 4 13 0 -24 -3 -25 -2 -6 -3 7 32 -39 51 -47 29 -19 -1 30 16 -25 -28 -1 -29 8 1
9.18406Ak9K1m2O8m8M5m5Q9o3jj2O0k7o2K1Ql8Q1o0K1mJ3kl2JK5N1p8J2M5k5M0m9K5l5J3jJ3n
$$ 1 -28 -7 -49 19 -29 16 -29 60 -3 -4 -16 44 17 -45 -24 -16 -54 27 -33 -12 -16 -3 -5 -37 -36 -11 40 -38 -26 19 -6 34 -15 10 -25 -12 -13 0 -5
9.16422el4N4ok3rO3k2l4K3rj1K4m7K7j6j2J2L4J2k0J4L8q3K1lJ8k7M8m1k8J7M6k9jK7J4o7O3
$$ -5 -39 15 9 -14 -23 40 18 -16 7 -2 -13 11 -36 -9 -25 -37 -25 9 21 1 15 53 -30 -9 -12 6 -21 27 -14 -42 -25 21 -8 -9 18 32 -35 28
9.14489B8p9O2m1Kj4lTP1o2L1L3l5J8J5n7N3k7k3jj2M4J4p6P1j5j0KJ1k3K3l8K2K9pLj3J5l9k2
$$ 28 -51 11 -30 -28 -42 -45 -48 23 -39 -8 25 -10 8 23 -34 19 -8 -31 -32 -44 0 14 -62 9 -6 -16 -14 -3 -26 -3 -41 -19 10 3 6 -7 8 -31 -53
9.12505e3RQ8k6L4p9K5j7TKK5JJ9p2P6k4Oj1L1m0N7o2J0k6K3M8k9K4l6K0l5M0k4K9m1K0j0k2k9
$$ -53 -44 44 18 52 -27 -2 -19 -36 -34 -9 -8 11 -61 15 -9 -3 -14 17 -23 34 -28 -18 -44 -21 27 -2 22 -14 6 -29 11 -13 16 -25 -5 -15 -37 -66
9.10571f6j6J01k2j2Mk2M9j3Nn2N9n4N7k9J7K0n0QNJ2j7L4jJ0k0l6N3m9j1LL0Rl5O4o1Qn5P7k9
$$ -66 -82 19 -3 -15 -11 -33 16 3 8 -44 15 -39 18 -11 6 26 -24 -16 -11 1 -16 18 17 27 7 -29 24 -25 -36 -33 -3 6 -29 35 -26 -18 -73 4 -25
9.08588b5K4l0j5M2l7N3n7K4j0N1j9Jpl3%K1J1%k0L5o1N6n8P0l0J6k7J1K2j4L5q7ML8J6K7%o7
$$ -25 -1 -31 -46 -4 -41 12 -45 -21 -31 20 1 2 -5 -38 -38 -17 -6 -6 -26 9 -52 4 -54 16 -14 2 -25 -14 8 -6 29 -58 -54 -16 0 27 27 -40
9.06654d0P5n7mJ7j1M5k1lK7n2OoM3o6P5m7L9l5Q%n1P0m2J6m8R9l7Qml8O3m0j6L7k9Ql2M9m2N7
$$ -40 35 -22 -26 -9 -20 25 4 1 28 -24 -18 -24 19 -47 28 -19 20 -15 -7 -7 -58 12 -30 -14 -62 37 0 8 4 -34 29 -11 -27 10 -19 -11 -43 6 -36 21
9.04620B1n9K4k0O2j6J2m4kjnJ9jj5TK7mK8l7kPK1M4p5NqOj0M8j9jqJ3j5N4n4j6O0l8pKMk2N5
$$ 21 -38 -14 -34 28 12 24 -20 -22 -23 -28 -9 -10 -25 -40 -13 -17 11 -26 -28 -21 0 44 -31 -26 -34 -28 -38 10 -9 -10 -18 -5 -20 34 -20 -36 24 -14 -21 -19 -15 -37 18
9.02432A8K6Jr1O6k7L6k4mj8j4LL4j8oL3o4M2j2pL0qk6l5L6K2k9L4moj2N2q0P2J9n6Ol9K8%j5T
$$ 18 44 45 -46 20 -7 29 5 1 -17 -31 -28 6 -12 -18 15 -49 -7 -19 -26 4 -4 -30 -65 -29 -7 -36 -2 -6 -12 -24 28 -52 20 39 -17 -11 -50 -22 -22 -37 -52
9.00346e2M0l6N8m5J1l3N1Om8L0k4J5M6p8R7o1L9rlk0J5k3j2M1pK9nj1TqJ6j5K2k4J2j7j5NoM1
$$ -52 -12 -48 10 -35 -24 -57 -6 0 -48 -18 -42 -27 19 -59 38 -23 16 7 4 -16 -1 -24 -36 5 -2 27 22 11 0 -8 8 -7 15 -9 3 -14 -29 -24 -30 11
8.98312A1Mn7M2o4L7M9m2K8LJ5m9j8O4l6K9k9J0J8o6Q3o1N3l8K2j5m0M5k1L8k1j3j1M3m2N7k0
$$ 11 15 -42 0 -64 -27 22 -20 8 11 26 -23 -41 23 -13 16 -13 -3 15 -51 32 -29 24 -14 8 -7 -47 -2 -23 15 -6 -19 -30 13 -29 28 8
8.96480HJ3ll4j9J5J6J8J2j0n1M3%o1L0K7l5J9lTJ0j4J8%l2K4JJ4j6Lj3J1Ok2K9k9K6k8J2k3M1
$$ 8 21 18 -16 -35 -20 -4 14 26 16 -35 8 8 -53 -23 4 -31 -12 -15 -18 -8 -22 -4 -4 -36 -12 -11 3 -13 -10 -23 -12 -6 -28 1 -28 -2 -30 -18 -41 0
8.94445@j1M4o1M1Kj2j4j6K3o3P3l1L0k0l2N7l2J9K3k3j3J5oJ8L7lk9J6j7J0K8J7m5kL4j2oL3q
$$ 0 -11 33 -28 13 15 3 -11 -27 -4 -67 6 -25 5 -15 -47 10 -22 -3 20 -3 -16 -1 -7 11 48 45 16 32 15 25 53 70 25 23 57 45 39 72 64
8.92461F4j5k2j0J9nk4oJ5j0LTL0M4j11K9Mn1O7J0n5K0kJM2o4K7o3L8j1oL6qkk9L3Rl4kJ7oO6
$$ 64 49 27 17 36 31 7 1 16 6 9 12 42 86 -25 4 8 -43 24 34 -21 -1 -3 -2 40 -24 3 -60 -22 -33 -39 -3 -11 -13 -42 -9 0 -34 -36 -19 -25 41
8.90376D1m1J2l0L2Nn3M8m6L2J3j3pj7oJ5L3n7K8OL2m7K6Ln4pN3k9Rl8P0m6J9k4O0k9om3N6k4%
$$ 41 0 12 -18 14 19 -34 14 -32 0 13 0 -7 -24 -30 -15 18 -39 -11 -5 27 -20 6 9 -45 -52 1 -28 -19 -57 13 -33 -14 -38 22 -7 -13 -56 0 -24 -24
8.88341b4K9k1oj4PL2j7p1J04j6j2M1r7O2k8J8l1K5KMj4oN8n3QKmk0M5L5r6P4p5P8qnTj8J7Rn1
$$ -24 5 -16 -22 -36 -29 3 -14 -85 19 3 -9 32 -65 -3 -31 -13 -44 -19 -17 -13 -27 -33 25 -28 -20 -18 -22 -42 3 38 -58 16 -59 19 11 6 1 -17 0 9 -42
8.86255d2Q0j7j2Nm9M8j3j5J9l1k2N9jm2j4ML1jL6k8pLL4o8Q7l3ll7M3k5KRlN%l6K9k1m7O2l3
$$ -42 38 21 9 14 -35 13 0 -15 4 -27 -49 10 9 -33 -47 -43 -12 -13 23 -5 -12 -9 25 -43 44 11 8 -29 14 -11 -9 0 -3 2 2 -34 -5 -26 -73 -11 -44
8.84169d4Q5j06P1p0N5l9N6j6Ol1J8pK6mo0J6N2j6j4K1l7JM9nk8L6m8L1Oj0L5o4N7p6N4j5k6k1
$$ -44 41 -65 6 -64 -9 -48 8 -8 -2 -33 -15 -22 4 0 -60 -44 8 -8 -22 -1 -38 -37 12 7 -21 15 -33 -2 4 -6 29 -35 22 -54 0 -15 -41 -62
8.82236f2M0pM4mj6QOPn0L8Qm0K2l0j8P1l3Ok4M1k4KPK6J8o8M4qk4J8K3l7k3L9Ll5L3jm2P5o6
$$ -62 -22 -29 15 11 -5 3 9 16 -34 4 12 -28 -6 -36 -54 17 -16 -10 -34 7 -17 -15 -8 18 36 -32 12 4 -20 -2 21 -16 -39 0 3 -32 1 0 -42 33 -33
8.80151c3P3k0J8m1M0rK8J8m6l4L1o%j2RL2j4TJ5%m5P2o9QM3m5l9N2k9J4k7k1Q1n4kJ6Kk2k6P3
$$ -33 40 20 38 -3 37 28 56 74 28 -6 25 19 19 7 16 48 34 20 35 35 -10 62 -7 1 44 -1 -40 12 -17 -3 -30 -51 30 -24 -26 -10 -8 -30 -56 17
8.78116A7n4M8l1K7l1K7OoOj4m2LjQN2k8k6L8pJ9l4kL5J1n4L2Lkl2K5j6rj5N2k4l1K5NM7l1J0P
$$ 17 -37 11 -20 7 -24 3 9 3 9 -5 -47 -44 -45 -37 15 -13 -39 -1 -8 11 -23 -25 10 21 -33 -1 2 0 -32 -7 -23 -32 -47 5 -19 -50 -25 -20 27 -4 6 13
8.75979A3k0m5O6k4JpL7j8n1L9J2j0Jm7K0K3K0n6M1k3OM7j6l9M7l5M1om5J0KJ8k1K1j4k4j9qN8
$$ 13 -7 -52 14 -10 -9 -16 21 3 -48 -9 3 -7 -6 -53 -33 -10 10 -46 -5 -28 -22 25 9 -30 17 -18 23 17 -28 -18 -16 2 -19 2 -12 -36 -55 -63 -5
8.73995ek3j0K8K4l6J8L9p1K6JK2n6QO7o1NK0J6j1jj0K9j6Rn0L5k5K4j8%L7l0M2q1L5K2j7kNr
$$ -5 -28 -38 -10 14 -22 -4 35 -36 -10 -9 13 -43 -35 32 -29 -24 -4 12 1 0 -10 19 3 12 -38 -3 -28 -4 -22 -22 15 -15 27 -54 -19 3 -14 -16 -11 -20
8.71960b0N9o3L0n1J5L1l5j3Q1l2m1M6nl6L6k4l9N2nl4M8jQk8K1j7L7m9k7M6K8op4M7%L1m1PJ2
$$ -20 39 -24 6 -45 -30 1 -34 -47 34 2 -39 7 2 -34 2 -22 -61 -9 -14 -48 0 -1 7 -21 0 -17 20 -29 -56 -10 18 12 -62 -15 -15 16 -25 -18 -6
8.69976fnpkK0k7N9n1KK4k9M6l8J7l5L5qk5oMJ9L5%p3K3Nj3M4lJ0m0lj4K8LMJ4n4O3j8M0j2n8
$$ -6 -11 -18 -20 0 -27 32 -19 -17 7 -22 24 -14 3 -32 3 -5 -30 -36 -32 -13 22 22 -51 -28 -23 -36 8 5 15 -25 -28 -42 -14 -11 -7 7 -47 16 -2 38 26 -32
8.67840c2K6j3j5%P3q7P0k5J3n4J6N2m1J4k8J4j1L3pmk0M9m3M4rl7l9M4JL9q0O1nl0K4k2J7J2
$$ -32 -6 -19 -34 -34 39 -48 22 -3 10 -44 -28 24 -17 -3 -31 -17 -28 5 -2 -6 -26 23 -20 24 15 -22 -61 -17 -16 23 -57 4 -1 -31 -7 -29 -12 0
8.65907@j1L8k6l4L4l2K9m6N5k0J4m9L2%k0K1m5L6JK6k2MK4l3J9KONn1O8k4M0r6P6Nl2J4j7Rn8
$$ 0 -11 27 1 -33 1 -31 -2 -48 7 -13 1 -48 -16 -16 -36 -15 -60 -24 -23 3 -19 -15 9 -24 -5 -3 3 8 -43 25 1 41 -55 21 26 -6 8 -9 0 -58
8.63872e8N7%L4m8j7j4P7mn4LJ6mL1j2K1n8J0OL9J5n2J9j4k7P4o3J4M8o0L9kl2qJ7O8m3k3L3m4
$$ -58 -1 -1 33 -15 -32 -46 31 27 -27 -24 -8 -12 19 7 28 -30 -20 -14 25 40 -12 7 -7 -34 40 -23 -9 39 -21 18 16 -16 -24 -7 61 18 -5 28 -16
8.61888a6K8m6L8k4N7n3Ok7N9m8M9j3M0k3K9K5j7jrJ6K0mj5Lj2M3l3K1pK4TlnL2n4L5n0J0l5K
$$ -16 12 -34 4 -20 37 -16 -10 -37 22 -26 23 10 50 27 56 81 64 63 54 70 90 86 71 74 62 105 72 93 86 110 134 131 126 158 104 139 89 99 64 66
8.59853F6K3KK3n4nK7n3J2l1J1l3J8K6K7o5K8p2O5j8P4j04R0m3l9J2OJ4l2J6k1m3P4JK5l4K3k8
$$ 66 89 91 114 60 55 82 29 41 10 21 -12 6 32 59 -6 22 -50 15 -3 71 -33 57 14 -25 -13 -7 7 -25 -9 -30 -73 1 2 27 -7 16 -12
8.57971a2K5K0k9k3M2m4K0j0N4o0j2M4J1k5l7N6mk3k6K3mj2M8k9K9n0J4O1n0Ql5K8K3m7L6l6J4
$$ -12 13 33 4 -19 23 -21 -1 -11 43 -17 -29 15 26 1 -36 20 16 -7 -33 -10 -14 -26 22 -7 22 -28 -14 47 -3 5 -30 -2 21 -26 10 -26 -12
8.56089a2rN2q7P3o6K6j8K8l2LJ0QJ4oL3m5K6l2Nn5N8L0l4J9Ll4K7J2qrK4l8M1l1J6L1q3J3P2
$$ -12 -21 31 -56 17 -49 -23 -41 -13 -45 -42 -32 -24 -10 -16 17 -28 -2 -34 -29 -84 -26 4 -30 -11 -8 -42 -15 -3 -11 -20 4 -34 7 -24 -8 23 -60 -47 25
8.54105B5n7mL8j7qj1j7N4k7L8o8O3k9j9N5n4P9q1j6N1M2o6M1k8M9q1N2j9j2PL0j5l0J4TKk0K6
$$ 25 -32 -36 2 -15 -23 -34 -51 3 -24 14 -54 9 -20 -39 16 -38 41 -40 -56 -5 37 -29 12 -16 33 -48 4 -15 -27 -20 10 -5 -35 -21 -7 -5 -25 1
8.52171Ak9K8l1Nj1J03p1K7qL2j2j8L5k7L0m4O6n1L7L3oLP2m8Q1mN9m2O3q4R8PK5L1L2j9N2k0
$$ 1 -28 0 -31 -26 -37 66 -5 22 14 46 34 16 51 24 54 10 76 25 62 95 89 92 164 116 197 193 252 210 273 189 287 294 319 350 382 363 415 395
8.50238C95J50OJ29J28J75K86L74M99N96P66Q96J421K665L041k06j737j662q20o7K36M67L68
$$ 395 545 551 680 808 983 1269 1643 2142 2738 3504 4400 5821 8486 11527 11321 9584 7922 7102 7035 7271 7738 8106
8.49119H106K60l59q30n66l69j88l54m08l67k90l83n87o62o80n47m69l25k11q6j15k7j24N5j26
$$ 8106 8366 8007 7177 6611 6242 6054 5700 5292 4925 4635 4252 3665 3003 2323 1776 1307 982 771 685 570 543 419 474 348
8.47898C48k0k3J2l2m4qJ6l9k7k0k9N6m0K4Kl1o8Q4o6J4k2L8n0QK7J1j3m3OK6l0j5M5k4l0L7k3
$$ 348 328 305 317 285 241 233 249 210 183 163 134 190 150 174 176 145 77 161 95 109 87 125 75 83 110 121 108 65 71 97 67 52 97 73 43 80 57
8.46016E7jL1j6K0k6j1J7K3o9J8j3l2N9L1n2k3J7J4K7n3P5p1L0l6K3JK2l9L3o8N0j0M0%k8J9j9
$$ 57 56 87 71 91 65 54 71 94 25 43 30 -2 57 88 36 13 30 44 71 18 93 22 52 16 39 40 62 23 56 -12 38 28 68 68 40 59 40
8.44134D0J6k0Mm0Q3o8K0j0j5J1jj0L9j8mM7m2K7qP0k4Oj8N8l0o1J5k8J2O5m2J6m0rm0K0L6l9
$$ 40 56 36 40 0 83 15 35 25 10 21 20 10 49 31 27 74 32 59 51 121 97 103 85 143 113 52 67 39 51 116 74 90 50 41 1 21 57 18
8.42201A8J8j1J9j1J7l0J6JTk3J0L2k7Lp2J02n3Qk6nk4M2j8L6J9m2J3k0K3K6l5K4p3M0k7L9kqn
$$ 18 36 25 44 33 50 20 36 37 38 15 25 57 30 33 -39 63 10 18 -8 -13 -37 5 -13 23 42 0 13 -7 16 42 7 31 -42 -2 -29 10 8 0 -5
8.40217eN4q6O6k7kKk0J0J3j9K3j6K5rP1m3k0j4M9l2%J2OL9o2j6L5N3m2TO9k4j4L5K6j3OJ4j9
$$ -5 49 -37 29 2 0 2 -18 -8 5 -14 9 -7 18 9 80 37 17 3 52 20 20 32 38 77 15 -1 34 87 45 3 72 48 34 69 95 82 88 102 83
8.38233H3K1m8P6p2N6L3JMj4L2PK8l8J3J4L5L4J2Q6N2Q0Q1Q2J97J79K53K22K85K74K63K68K65
$$ 83 104 56 132 60 116 149 150 154 140 172 179 207 169 182 196 231 265 277 363 415 495 576 658 855 1034 1287 1509 1794 2068 2331 2599 2864
8.36605B864K58K11K17J68R1L3oN4o6n5j30j83q0k87p4j95j00k18j03j64j90j68j80j62j57j16
$$ 2864 3122 3333 3550 3718 3809 3842 3836 3890 3824 3769 3639 3456 3376 3089 3015 2820 2720 2502 2399 2235 2045 1877 1697 1535 1378 1262
8.35282A262j72p1j47m1p4r8o9l9k4l3M5k5K5oJ01J4J18J37J27K26K31K76K57L07K97K61K65
$$ 1262 1090 1019 872 831 757 659 590 551 527 494 539 514 539 533 634 648 766 903 1030 1256 1487 1763 2020 2327 2624 2885 3150
8.33909C150K14K84J96J10R5N7pJn9j30j17j86j69j70j66j56j96j42j64j90k03k01j29k46j27
$$ 3150 3364 3648 3844 3954 4049 4106 4099 4100 4041 3911 3794 3608 3439 3269 3103 2947 2751 2609 2445 2255 2052 1851 1722 1476 1349
8.32637A349k11j11j81o4j42l3j02m7r5p2J9q5J7l3klq6M0m1P9j02Q7p4L0k4%l0J4K7o5L1j1j4
$$ 1349 1138 1027 846 782 640 607 505 458 363 291 310 225 242 209 207 204 118 158 117 196 94 181 107 137 113 113 83 97 124 59 90 79 65
8.30958F5Mj9L3j0oJ0NL5l1nm9j9Q0jk5OJ3k6k4M3Ok0j2KRj2ml3M0j7qK5JJ5k2K8m6OL2%njl2
$$ 65 69 50 83 73 67 77 82 117 86 81 32 13 93 92 67 73 86 60 36 79 85 65 53 55 64 52 48 15 55 38 30 55 56 71 49 77 31 37 69 69 64 63 31
8.28771C1j2J5M8o6J6JL3k2Qk0J9pNj4J3n2O1j0L2K2m1J2k6krJ7l5jQJ2j7L0l%Qp1P8j4j3l2K0
$$ 31 19 34 82 16 32 33 66 44 52 32 51 44 49 35 48 -4 57 47 79 101 60 72 46 44 35 52 17 16 24 36 19 49 46 46 54 -17 61 47 34 2 22
8.26685B2J2J8j8J6m8P6l7LkjJj0jJ2l8%J9K2j3j0L6m4K6j1L3o8J8N7r2P2k0KJ4MlJ3o5J5k7M4
$$ 22 34 52 34 50 2 78 41 44 42 41 42 32 31 43 5 5 24 46 33 23 59 15 41 30 63 -5 13 70 -22 50 30 32 46 50 47 60 -5 10 -17 27
8.24650B7j2j3K1k2M3o2MK5K1l1KM1n3N6k0Njk1J2nLJ5n1L2m4P2j4rk1K2ml0jM9k2k9O0n3K7M1
$$ 27 15 2 23 1 44 -18 -14 11 32 1 3 44 -9 47 27 32 31 10 22 17 20 35 -16 16 -28 44 30 21 0 22 18 -12 -13 36 14 -15 45 -8 19 60
8.22615F0j1l5j3K5k9J0L5Rl1l9O6m3K6j6M4n3M1n9P8r5N3pJ7k3QJ5J8l2L2l1j7K5K6n1K3k8L2
$$ 60 49 14 1 26 -3 7 42 51 20 -19 47 4 30 14 58 5 46 -13 65 -30 23 16 33 10 18 33 51 19 51 20 3 28 54 3 26 -2 30
8.20733C0Lk9L4p8J14p2M6l7nL4Kj7k5O8n2Rk4nL1J5k6M0pk4Nj1nJ8KPj7M3k5j3L8m4K6K5jj7
$$ 30 33 4 38 -40 74 2 48 11 6 40 42 25 0 68 16 25 1 -4 27 42 16 56 49 25 30 19 14 32 34 41 24 67 42 29 67 23 49 74 73 56
8.18698E6m0lK1M5j6rkoM2m2K9k7j2KkrJ2Lj8M0l7J3l1PM8k3mk8K6k9%K9j5L0qL3p7P1p4J9j3
$$ 56 16 13 34 79 63 54 52 46 88 46 75 48 36 38 36 27 39 42 24 64 27 40 9 16 64 41 37 9 35 6 6 35 20 50 42 75 -2 69 -5 14 1
8.16613AJ2j3J1MjJ5j1l4J2M%K4j9J0JJ4l2K3j2Lk5M3k3k7O0o6M4n6N0nl2L8j8j0O4q8M6k2L1r
$$ 1 13 0 11 15 14 29 18 -16 -4 0 0 24 5 15 16 30 -2 21 9 12 -13 30 7 -20 40 -26 18 -38 12 7 -25 13 -5 -15 49 -39 7 -15 16 7
8.14578GQk6K9j7nM6k7J4q6J28p3k0M4m5ML5Kj8k7N7n6J5PTo2R9l7K7k9K7m6M2K5l9m8M1j0K3Q
$$ 7 15 -11 18 1 -4 42 15 29 -57 71 -2 -22 22 -23 -19 16 18 0 -27 30 -26 -11 -4 3 -59 40 3 30 1 28 -18 24 49 10 -38 3 -7 16 24
8.12594B4lk3K4JKj1K4k8j0PL9m3K4m2K7lJ4j8j3rM6p0K5K2J8m5K1OPL0k1j3Ok9J5nJ4j1Pl9K6
$$ 24 21 -2 22 23 25 14 38 10 0 7 46 3 27 -15 12 9 23 5 -8 -17 29 -41 -16 6 24 -21 0 6 13 43 22 9 15 -14 1 -4 10 -1 6 -33 -7
8.10508gM0j2j7J0k7J0K1k2O9q0K1J0l1J9lM0J1n6K0LkK7rl5J5J4k9L5Mpl9j9N0j0M3n7L7k0m0
$$ -7 33 21 4 14 -13 -3 18 -4 65 -15 6 16 -15 4 1 41 52 -4 16 19 17 44 35 0 15 29 0 35 39 32 -7 -26 24 14 57 0 37 17 -23
8.08524b3N0jrK3l9QqL4k4j5j8M9J5p1J6J1Kk8O2m3N9q7Q3m8j2JK3rL9m7M4j2lj8L7m9L3jj1j4
$$ -23 27 26 17 40 1 9 1 35 11 -4 -22 27 42 -29 -13 -2 0 -28 34 -9 50 -37 46 -2 -14 -13 10 1 40 -7 37 25 22 4 41 -8 25 24 13 -1
8.06489aL0qKk3PNK1m6K1Jk5M9j8kk8kK1J7j8%OJ7m9L0%MJ9j2M8p0j0NrK4J2LTo9N1l2K6K8o8
$$ -1 29 21 23 0 7 12 33 -13 8 9 -16 33 15 13 -15 -17 4 21 3 3 9 26 -23 7 7 11 30 18 66 -4 -14 -9 -18 6 18 21 24 -45 6 -26 0 28 -40
8.04302d0L1j3K6j3K3K2n9J5N4r2R7n0mL0j3k4l8Q3j9l5L2j4rK5k5K4n5N8k5M0n1%k0K0J9J6N
$$ -40 -9 -22 4 -9 14 36 -23 -8 46 -46 51 1 -3 27 14 -10 -48 35 16 -19 13 -1 -10 15 -10 14 -41 17 -8 32 -19 -19 -39 -19 0 16 21
8.02419B1m0%LpK5RLlj1Ro1K6lL2l5M4pj4M5o4M6k6oM4p7P4l2K4n9N8j7j1RJ8pj0Nl8P1l6%rL3
$$ 21 -19 -19 -16 -23 2 11 14 11 0 9 -52 -26 -29 3 -32 12 5 -9 36 -28 18 -8 -14 30 -47 27 -5 19 -40 18 1 -10 -1 17 10 0 5 -33 38 2 2 -7 26
8.00232B6m5RK1l4N4k7k1J1RJ0k0PK7p7K3L1Pm8mJ3K8m1J1J4lN5r6O0pmRLl8J2LjL7k6j4J4jJ0
$$ 26 -19 -10 11 -23 31 4 -17 -6 3 13 -7 0 27 -50 -27 4 11 -37 -41 -28 0 -41 -30 -16 -19 36 -60 0 -7 -11 -2 1 -37 -25 -22 -23 14 -12 -26 -12 -13 -3
7.98095c%RJ5l7ML4m7J6k8K9OJ5Mn7O3lj2j8J0Tn7M8nJ0j8Qj4NJ1K7J0m8L2p1Q1k8j0j8K4l8K8
$$ -3 -3 6 21 -16 -12 22 -25 -9 -37 -8 -2 13 17 -40 23 20 8 -10 0 10 -47 1 -4 6 -12 -4 -18 -13 -2 25 35 -13 19 -52 29 1 -9 -27 -3 -41 -13
7.96010a3k8O6k2%o5J9K3j2O8n2rK0K8qL9m4j0Rm4N6m4M8q7L5J7qJ6l5O6l9M1o4M3J0rm9K4K0
$$ -13 -41 25 3 3 -62 -43 -20 -32 36 -16 -25 -5 23 15 54 10 0 9 -35 21 -23 25 -62 -27 -10 -18 -2 -37 29 -10 31 -33 10 20 11 -38 -14 6
7.94077Fk1%M0o3M9p3R0l6j1nJ8j4j5N6o1L5l9Q3k6k3J1K2j7o2N6%k1P5m0k4%k3LL0QRn1J5Lq
$$ 6 -15 -15 25 -38 11 -62 28 -8 -19 -24 -6 -20 -35 21 -40 -5 -44 39 13 -10 1 23 6 -56 0 0 -21 54 14 -10 -10 -33 -30 0 8 17 -34 -19 -16 -24
7.92042b4M2l0k6M2J5k7K8j2J2j7K1j7k7JJ9k2J1Jj4OJ5k7j1M2J3jm2M9ok9L9k5J2lj1oQJ8j5
$$ -24 18 -12 -38 4 19 -8 20 8 20 3 24 7 -20 -19 0 -22 -11 -10 -24 -18 -3 -30 -41 1 14 13 -29 20 14 -15 24 -1 11 8 -3 -9 -1 17 2
7.90058BK4Kl2Ok5M8m6O5o0Q4o1k5L9j0k0k5R5j31Q0jj9K4k6j8NL5K8o4K8mJ8j7MQloj9k7J0P6
$$ 2 26 28 -4 2 -23 25 -21 44 -16 68 7 -18 21 11 -9 -34 61 -70 10 9 -10 14 -12 -30 -25 10 38 -26 2 -2 16 -1 3 11 8 2 -17 -44 -34 42
7.88023D2m7J9k8L8j2k8O1j6J8o1M0m9M8K1l8k0N2k8NJ1l5j4J0K8JL4n8K2m1L1k8P9n9kOL2Pj7
$$ 42 -5 14 -14 24 12 -16 45 29 47 -14 26 -23 25 46 8 -12 40 12 17 28 -7 -21 -11 17 18 52 -6 16 -25 6 -22 57 -2 -4 2 34 41 24
7.86090B4Lj2m1L8l4K7Rjk3J6j4K4j5l2K0LQl1M6m3J9j7J3j7K6J3k1L2k9Knk3L1j0l1L5jTL8mk
$$ 24 27 15 -26 12 -22 5 14 13 -10 6 -8 16 1 -31 -11 -8 0 -31 15 -28 -9 -26 -13 -30 -4 9 -12 20 -9 -7 -12 -35 -4 -14 -45 -10 -11 -12 26 22 20
7.84004B0l4rN0p3L3%mJ7LK2k4rKl0O5l7k0K7j5l3JQ1l4m4P8kp2Q1o2M3JJ7o0Oj6P1l2j9L0p3
$$ 20 -14 -23 27 -46 -13 -13 -17 0 3 25 1 -8 -6 -36 29 -8 -28 -1 -16 -49 -48 33 -1 -45 33 31 -41 40 -22 21 22 39 -21 -15 -31 40 8 -11 19 -54
7.81969e4R0p1L4n3O0oj0pK9l6K0jj1Qk9J1J9JOj5nLpP2o6N6l7j3J7rJ7qK6k3L4p0O5l9pL8l4
$$ -54 36 -35 -1 -54 6 0 -10 -17 12 -24 -4 -5 -16 -8 -37 -26 -7 -6 0 -15 -20 -17 -24 48 -18 38 1 -12 5 -4 13 5 31 8 42 -28 37 -2 -9 29 -5
7.79884eJ2%Mj2%rL9Lm7j7K8L4o5P6q1N8p3L6J0J1m9O8n3L3MOj0QrK9n2J9k9Q1q5K3k5OQO8k7o
$$ -5 7 7 11 -1 -1 -10 29 32 -15 -32 -4 30 -35 41 -40 18 -55 -19 -9 2 -47 21 -32 1 5 11 1 9 0 29 -23 -4 -33 48 -37 -14 -39 -33 -25 43 16 10
7.77747A0M0n0%loK6P%k3Ll1O2k2J8po0L2k7K6J1rl6LL2J5k5oJJ1MOprK1kl9K2j6K8k8J5j5N6
$$ 10 50 0 0 -3 -9 17 24 24 1 4 -27 35 13 31 24 -36 -4 -31 -5 6 -3 -39 -36 -4 11 -14 -20 -19 -8 -4 2 -5 -14 7 5 -34 -12 -28 0 -28 -13 -28 28
7.75560B8n2J6K1om0TO3J4J7m1Nj9N4n2L0M5%l6Jl9L4ql4JL6PjK8m9J9n7Q4m8K6rKJ3j5PK8q1
$$ 28 -24 -8 13 7 -33 -73 -10 4 21 -20 -15 -34 20 -32 -2 43 43 7 8 -31 3 -5 -39 -38 -2 5 4 32 -17 2 -55 29 -19 7 -2 0 13 -2 5 33 -48
7.73474d8O4l2OL1Qq0N2j6J1mK1k6L6o1L1K1k0j5KO4m2Lmj5J0q0J70p3k4j1J5Lk0K8m2K1qjMJ6
$$ -48 16 -16 -10 21 29 -51 1 -15 -4 -8 13 -13 23 -38 -7 14 -6 -21 -19 45 3 6 2 -13 -3 -83 87 14 -10 -21 -6 -3 -23 5 -37 -16 -24 -25 -21 -5
7.71439em0J9RmJj2J5LK5k5K9j9j6L0m8L8L2l9O4o0Ppl6L9Pj7k7M5j1%J3oJ6k7j1nN0n9J7l9P2
$$ -5 -45 -26 -17 -21 -20 -32 -17 -14 11 -14 15 -4 -20 10 -38 0 32 -7 57 -3 4 -3 -39 0 7 -10 -37 8 -3 -3 10 4 20 -7 -18 -23 27 -32 -15 -54 18
7.69353A8pm5lN3J9p9K1M0m1N2j9k2K8l8M3l6O2n3J8j5L2l8J7k3lk0L2j7J0N2p2L8N8r5K8j1L4
$$ 18 11 -34 -37 16 35 -44 -23 17 -24 28 9 -13 15 -23 20 -16 46 -7 11 -4 28 -10 7 -16 -19 -39 -7 -24 -14 38 -34 4 62 -33 -5 -16 18
7.67471A8j4J8k2l5M8j3J7m2M4lj2j%MTK3j6J4o4P5m1K4j9mM7q5M6n9J00q4J3N0m5M4l0NnLRJ6
$$ 18 4 22 0 -35 13 0 17 -25 19 16 4 3 3 7 11 34 18 32 -32 43 2 26 7 3 50 -35 11 -48 52 -32 -19 31 -14 30 0 5 0 3 12 28
7.65436B8M2j1oj7k8Q6m3j1K1L1m6J3K8J5J3n8O4K5JL3mTP2Q6J26K6K04J78K26K37J51J31K06
$$ 28 70 59 53 36 8 94 51 40 61 92 46 59 87 102 115 57 121 146 147 180 176 172 244 330 456 482 686 864 1090 1327 1478 1609 1815
7.63757A815J95K01J66J49J19P8M7jP8j1q7j67j51j02j03j01j36o2o6j85j21j69q4j32p4j58
$$ 1815 2010 2211 2377 2526 2645 2723 2770 2769 2847 2836 2749 2582 2431 2329 2226 2125 1989 1927 1861 1676 1555 1386 1302 1170 1096 938
7.62435I38j04q2j24%j02Pj02J0r4L8pKJ3j5R9P1O0J45J19K55K63M40M88N05K37L15K78N00L86
$$ 938 834 752 628 628 526 533 431 441 347 385 378 380 393 378 477 548 608 753 872 1127 1390 1830 2318 2823 3060 3375 3653 4153 4539
7.60959D539J95K46J66J59jP6kJ02j91k25m03j98k58k13j68k34j67k92k64l62j92k41k50j77
$$ 4539 4734 4980 5146 5305 5304 5380 5378 5480 5289 5064 4661 4463 4205 3992 3824 3590 3423 3131 2867 2505 2313 2072 1822 1645
7.59739A645k58k01j13j85j64j34r7o7r2l9m0j3mk2j9J5l0L0n9K8m9M9n0QJ0j1J6J3l6j9K1k8
$$ 1645 1387 1186 1073 888 724 590 493 426 334 295 255 242 238 216 197 212 182 212 153 181 132 181 131 139 149 138 154 167 131 112 133 105
7.58111A05M8lk3N6k4J8m2Q1qo9O7pk3J0Tj9pQ3m9M4p0J07k7P1J1J35L9J45J46J80L29L90L00n
$$ 105 153 150 127 183 159 177 135 216 208 139 206 199 176 186 196 177 170 253 204 248 178 285 258 329 340 475 514 659 805 985 1314 1704 2004 1999
7.56381A999K0n3R3K26M06K83Q1k64j98j74n9k2l9j1n9j07j36j48j32j58j07j33j22o1j47j3
$$ 1999 2019 1966 2059 2285 2691 2974 3055 2791 2593 2419 2360 2338 2299 2288 2229 2122 1986 1838 1706 1548 1441 1308 1186 1125 978 965
7.55058I65j28j09n5j22M6j30M2J3L2J9N4N0J00J43J84J74M03M26M37R0L5lJ00K84M89N15J96
$$ 965 837 728 673 551 597 467 509 522 554 573 627 677 777 920 1104 1278 1681 2107 2544 2634 2669 2666 2766 3050 3539 4054 4250
7.53685D250j66j77k74l5J16J01J07j99k07k80k08j84j64j47j99j57j82j83k49j02j91j72j01
$$ 4250 4084 3907 3633 3598 3714 3815 3922 3723 3516 3236 3028 2844 2680 2533 2334 2177 1995 1812 1563 1461 1270 1098 997
7.52515I97j31j14n8q8m3m7n4q1k1k9M6m1L6M6kpJ23PJ44J65K85K24J15l6n4j9J03J94K15J67
$$ 997 866 752 694 606 563 516 462 381 360 331 377 336 372 418 416 409 532 539 683 848 1133 1357 1472 1436 1382 1363 1466 1660 1875 2042
7.50989B042q7j65j75p3n3m1J9m0j2j26q5j00r1j33l0j01j00r5m9n5l3q7o4j3n7K0p7M3q0M9l1
$$ 2042 1955 1790 1615 1542 1489 1448 1467 1427 1415 1289 1204 1104 1013 880 850 749 649 554 505 450 417 330 266 253 196 216 139 182 102 151 120
7.49412A20KPRJ8k0l2K3Kl9ON2n0Rj1m1l3P3k2LJ5Lj1Pn8L6J8p3J04n7KjJ2Ok2K3J2k1K4Nl4K5
$$ 120 122 129 138 156 136 104 127 129 90 96 148 98 107 96 55 22 95 73 76 91 94 83 90 32 68 86 13 117 60 62 61 73 79 57 80 92 71 95 100 66 91
7.47326I1k6L3Pp4O8n4K8j2M2n8K6J6nL4p0J5j5J5j2jL5o4N1%m3K8OKj7L0n3J2k9M9K0k6l9J4
$$ 91 65 98 105 31 99 45 73 61 103 45 71 87 82 116 46 61 46 61 49 48 83 19 70 70 27 55 61 63 46 76 23 35 6 55 75 49 10 24
7.45393B4K1j2L6Qk9K8m4K4k0JQk0L1J5n5M2pNk0K4k5L5m5L7n1Q8n8N6m9K0JJ9m8lK0k9K0J6J7
$$ 24 45 33 69 77 48 76 32 56 36 37 45 25 56 71 16 58 51 56 36 60 35 70 25 62 11 99 41 97 48 68 69 88 40 37 57 28 48 64 81
7.43409H1k5Ok7pK8lL5k2k4j1M2j9rjJ0Ln7M6%J2qK5l6kmOKJ0j3LRj4J9k5J7k0LL8k2j5j7L5j6
$$ 81 56 62 35 28 56 53 88 66 42 31 73 54 45 44 54 57 0 46 46 58 50 75 39 37 33 39 41 51 38 41 50 36 55 30 47 27 30 68 46 31 14 49 33
7.41221C3j1j8L0L7n3l0N3lK9rk6J2Mrj5M0l3J0O1m5k4k3L9k4Kj8N4k0l9L4mJ9j3J9pqJ2%pj2
$$ 33 22 4 34 71 18 -12 41 38 67 58 32 44 48 39 24 64 31 41 102 57 33 10 49 25 27 9 63 43 4 38 34 53 40 59 52 44 56 56 49 37
7.39187C7j1%J2K2nk3nOM1r7R5p2J09m0l4k6R8j30O3kPJ7n6J6J7J4k4J1k8j5O9m1K9j4lKlK5Ln
$$ 37 26 26 38 60 55 32 27 33 74 -23 72 0 109 69 35 9 107 -23 40 38 45 62 6 22 39 53 29 40 12 -3 66 25 54 40 37 39 36 61 64 59
7.37152E9l1JK7krj6rL1mL4n1L6l5M1j4nQl1J5%k2J2K1j7K4ln5M9o2P8JJ2l6K6m7P7m7j0lokL0
$$ 59 28 29 56 54 45 29 20 51 47 81 30 66 31 72 58 53 61 30 45 45 23 35 56 39 63 60 5 54 -8 70 71 83 47 73 26 103 56 46 43 37 35 65
7.35015F5l2J4JQnOn5J4TN4l0j7L1jm4m2O8l1N8o6J4J2M0p3M1l6M5j6nJ1k0M2j1k5K1j2j8j1M7
$$ 65 33 47 48 56 51 57 2 16 30 84 54 37 68 67 23 -19 49 18 76 10 24 36 76 3 44 8 53 37 32 43 23 65 54 29 50 38 20 9 56
7.33031E6l3OjJ8JLJ7k7L7n8L0K2Ql9K3k0K3J5j7L7j2m2O7k3L4j1l2M5rKk3L3k5P1j6M3j7K1N7
$$ 56 23 29 28 46 47 50 67 40 77 19 49 71 79 40 63 43 66 81 64 101 89 47 114 91 125 114 82 127 118 120 97 130 105 176 160 203 186 207 264
7.31047B64lP5Q2J04J29K03K38K85L10N9%q6RJ25K12L16K80O2j16k42k36j00Pn2o3op4j18j40
$$ 264 261 336 418 522 651 854 1092 1377 1687 1746 1746 1660 1669 1794 2006 2322 2602 2664 2548 2306 2070 1970 1977 1925 1862 1856 1782 1664 1524
7.29572A524j44r8o5j16o6r0n1o8q7p5Tq3J9l3m6K2Q7m8J15MR8J06J74K32K66L55J45J04N6J58
$$ 1524 1380 1282 1217 1101 1035 945 894 826 739 664 589 506 525 492 446 468 555 507 622 626 724 830 1004 1236 1502 1857 2002 2106 2162 2320
7.28046B320L50L70N43J58Q1p1j60j2L2K53K10M2k62k71j98k87j37j72q3j76j24j80k15j99j02
$$ 2320 2670 3040 3583 3741 3822 3751 3591 3579 3611 3864 4074 4116 3854 3583 3385 3098 2961 2789 2706 2530 2406 2226 2011 1812 1710
7.26774A710k12j67j22j33j01q1q4j37l7r9l7n0Lk5O0j1L4PJ25L9J64K18K59J89J02k4p4M1J7
$$ 1710 1498 1331 1209 1076 975 894 810 673 636 537 500 450 453 428 488 477 511 518 643 682 846 1064 1323 1512 1614 1590 1516 1557 1574
7.25299A574J82K05J79Q3j53j56Tj47m7j3n0n1j1j05r9j26p1j59m4q0j26J9j46m9q1l6J0p7p3
$$ 1574 1756 1961 2140 2223 2070 1914 1758 1611 1564 1551 1501 1450 1439 1334 1235 1109 1038 879 835 755 629 648 502 453 372 336 346 269 196
7.23824A96M9m0j4k8oMj4K0m7L0r5N0K4J4j5m0O2o6j9Oj0k2N8j3nj6J2Ml2M2J2o0qP9o7PKMmPj
$$ 196 245 205 191 163 157 161 147 167 120 150 55 105 129 143 128 88 150 84 65 71 61 39 97 84 79 63 75 79 47 89 101 41 33 112 45 52 54 58 54 61 60
7.21738F0k1K7Tk0j5N5j2n6R1o5O1n7L5p5P4j5rnn5NL5Om0J4k7M6nrK7j6J3n0M3kJ2K8m2k1LJ1
$$ 60 39 66 93 73 58 113 101 45 136 71 132 75 110 35 109 94 85 80 25 30 65 71 31 45 18 64 59 50 77 61 74 24 67 65 77 105 63 42 45 56
7.19703E6l1K7L5l3nOkjRK2qj9j7K6j2J1Qn6M8PJ4Ln3k6M7K1j9L3n7O7p8L1j9K8JL9q5NJ1lL4
$$ 56 25 52 87 54 49 55 53 52 61 83 75 56 39 65 53 64 72 16 64 71 85 88 35 9 56 77 58 91 34 101 23 54 35 63 64 103 18 23 34 31 65
7.17617F5l3Q1j17Q5n2R7o6M9k3p8R1n5p%lj5O6m1j4J7mOM4l5L0l8K1o1QL1l7K6k4MTJ2pJ2j8M
$$ 65 32 113 -4 81 29 126 60 109 86 8 99 44 37 37 34 19 85 44 30 47 43 49 93 58 88 50 71 10 18 49 12 38 14 18 22 34 27 39 21 25
7.15582B5qQ0q1J2oK7MK9l8K7p4M4j6J1L5p4K5j2N5Jj8nj3J8l8Pj0M3j0j5mJ3J6m3K3q%L8j2Q
$$ 25 17 97 16 28 22 49 53 82 44 71 -3 41 25 36 71 -3 22 10 65 66 48 43 30 48 10 17 7 50 40 25 21 34 50 7 30 22 22 60 48 56
7.13548E6j5j1qM3mj9l0nL3jOJj6J7K1m6K9m2lN6j5K9o3L2Ko1O6j9j5PK4j9J0k8L0lj3K0LPk8
$$ 56 41 30 22 65 61 42 12 7 40 39 45 46 30 47 68 22 51 9 6 62 47 76 13 45 47 -14 52 33 18 25 49 30 40 12 42 39 26 46 49 56 28
7.11462B8M4m9K5o2N7LMk9J2J0rj7N8l4ml3N0l3l6N1l2M6Rmn0Qj7KM8l9K0nK2m5N4m6M3m4oL0
$$ 28 72 23 48 -14 43 46 50 21 33 43 34 17 75 41 37 4 54 21 -15 36 4 50 59 55 5 13 -4 -2 46 7 27 22 44 -1 53 7 50 6 0 30
7.09427C0n4N3k6K6l1j%pJ9L1nl4M5m9L2j8K4m0RJ5J7l7J3rM9ml3J3K4l4k9M0k9J3QJ8Pn2M2k8
$$ 30 -24 29 3 29 -2 -3 -3 -10 9 40 35 1 46 -3 29 11 35 -5 4 19 36 -1 12 3 52 48 15 28 52 18 -11 29 0 13 21 39 46 -6 36 8
7.07392HLRQk3oJ1M2pj3M8q0N1m4lJ9k3jk6P0o3N6k3M8p1N9rK6l6Pl6J3Om0N0J9p4Q8m4j5j7j8
$$ 8 11 20 28 5 -1 10 52 45 32 80 0 51 7 4 23 0 -1 -27 43 -20 36 13 61 -10 49 40 66 30 37 1 14 20 -20 30 49 -25 63 19 4 -13 -31
7.05306c1N4j4l9L1k0N5lL2o3M3l6N1o7J4j1J9J4l2J5j7J8k3L0L5n8OM3l8nL2j8K9rm1K2L9m3P
$$ -31 23 9 -30 1 -19 36 33 65 2 45 9 60 -7 7 -4 15 29 -3 12 -5 13 -10 20 55 -3 3 46 8 3 35 17 46 37 -4 18 57 14 21
7.03373B1J8j2k6K3lKM3o4M1p3P0m6M9l1Jk4M6k8L6k1J1j6QJ8j1Pk5K4K7p4L3k4PL5l0N5l1j6
$$ 21 39 27 1 24 21 23 66 2 43 -30 40 -6 43 12 13 -11 35 7 43 22 33 17 25 43 32 39 14 38 65 -9 24 0 7 42 12 67 36 20
7.01440B0k9M0l9L4K6l9M2k0pk1K1j6L0l1J7K1o0P4l9j3J5j0Rj3J8m0N4o0N9n7L0j8jK6j3J6l7
$$ 20 -9 31 -8 26 52 13 55 35 28 7 28 12 42 11 28 49 -11 63 24 11 26 16 25 12 30 -10 44 -16 43 -14 16 -2 -3 23 10 26 -11
6.99558a1K7njM3m0Nk0L7k5K6n8L7k5M9lk2j0k9N5nMk4j1L5M4m0j4pj9N2k4m6N7M4j6o8L2Mk4
$$ -11 16 11 10 53 13 18 -2 35 10 36 -22 15 -10 39 36 14 4 -25 30 25 29 5 -6 29 73 33 19 12 -7 45 21 -25 32 76 60 -8 24 28 4
6.97574Dj8L4j0l9LL9L8nn3M8k8j5Ok5K7j5M8j9K6m4kRk9qJ5L8k2j9L5j0O5n3L9m7Pj3K4l5J5
$$ 4 -14 20 10 -29 -26 13 51 46 -7 41 13 -2 4 -21 6 -9 39 20 46 2 0 9 -20 -28 -13 25 3 -16 19 9 74 21 60 13 20 7 31 -4 11
6.95590A1j2L8k7j8ON7l6jj5T%N5k5j3KPj8j6M9k2Pj8jJ8l2qLOJJ1j9M9j6K4p2Q6n9O5k4l3Rj4
$$ 11 -1 37 10 -8 -2 55 19 18 3 -12 -12 43 18 5 7 14 -4 -20 29 7 14 -4 -5 13 -19 -27 -24 -18 -17 -6 -25 24 8 32 -40 46 -13 52 28 -5 4 -10
6.93453a0L1l7K8k0Jj1J6Tk9M9n1K2j5k6K8M9Lm4N6k7pm3K4Nk4J0RrK0m8N9j4l6pK7N2m3j4Ql0
$$ -10 21 -16 12 -8 -7 -18 -2 14 -15 34 -17 5 -10 -36 -8 41 44 0 56 29 22 -21 3 8 -16 -6 3 -6 14 -34 25 11 -25 -32 -5 47 4 -10 -2 -32
6.91419c2L2J6j6PK7Pl9k8j0M6pkk8O0l3L3m0J6J2j7J6o1O7pTj1k4P0k6m6K1J6rQK0m7NJ7j8L5
$$ -32 0 16 0 7 34 41 2 -26 -36 10 3 1 -27 33 0 33 -7 9 21 4 20 -41 26 19 12 1 -23 47 21 -25 -4 12 3 11 31 -16 -11 6 -12 23
6.89384B3m8L4k3K1k0k3K1J1j2K8m7N4LL2j7k4J6k9QK5K6n4jn4M8L0n8N1l1Q7r6O1m3qm4N8J9
$$ 23 -25 9 -14 7 -13 -36 -15 -4 -16 12 -35 19 22 54 37 13 29 0 8 33 59 5 4 -50 -2 28 -30 21 -10 77 -19 42 -1 -9 -53 5 24
6.87502B4n4L0k1N2l4K5j7mOj2M2l5j3k0L5j5J7j4j5K7P5q9P3o4oj2K6JN4n9lqPk0J1j4J9oL1r
$$ 24 -30 0 -21 31 -3 22 5 1 7 -5 37 2 -11 -31 4 -11 6 -8 -23 4 79 -10 63 -1 -7 -19 7 8 62 3 0 -8 -1 -21 -10 -24 -5 -11 20 11
6.85467A1qk5pO3n7O2n1JJ5K4n6M6k8k0K9k0K6M3p3N9n6M5o4O9k7lnLPQk6K2J5j0n1P2pl4K6l2
$$ 11 3 -22 -29 34 -23 39 -12 -11 4 28 -28 18 -10 -30 -1 -21 5 48 -25 34 -22 23 -41 28 1 -2 -7 -4 3 11 -15 7 22 12 -39 33 26 -8 18 -14
6.83432a4L1k6N2p5M2m6N2l6K4L9l2n1L7J4o8M3K0j7j3L2j7Mk5K4M3l3l1J6j3P5n4L2k5JQmJ5
$$ -14 17 -9 43 -32 10 -36 16 -20 4 43 11 -40 -3 11 -57 -14 6 -11 -24 8 -9 -5 -30 -6 37 4 -27 -11 -24 51 -3 29 4 5 13 9 24
6.81550B4j2m3K6lK7l2K9k6k1N3k9l9M8k6L0l1K5Mk3N2l8mJ5J6m8L8pM1l0l8lK5lM3o6M6Nm9J9
$$ 24 12 -31 -5 -8 19 -13 16 -10 -31 22 -7 -46 2 -24 6 -25 0 4 -19 33 -5 -9 6 22 -26 12 5 46 16 -22 -25 0 -3 40 -26 20 25 -24 -5
6.79566eK8o0N7l6M8k8j1l6O1jl9K2j3J7mPl8M1j4J2jJ1l9K8PJ1j9j0l1M7KJ2n0P5j01L2kL7j5
$$ -5 23 -37 20 -16 32 4 -7 -43 18 17 -22 0 -13 4 0 7 -31 10 -4 8 7 18 -21 7 14 25 6 -4 -35 12 14 26 -24 51 -50 -18 -20 17 2
6.77582Bl9J9L5rj7J2Kk5J2nL9l8M4L4p8M2l7J2k4KK5J0m5L4Jj0m8L0KK8k2J2J4L1q9O6m2%M5
$$ 2 -37 -18 17 8 -9 3 5 -20 -8 -13 26 -12 32 66 -12 30 -7 5 -19 -17 8 18 -27 7 8 -2 -50 -20 -18 10 -12 0 14 45 -44 22 -20 -20 25
6.75598B5l1j2NL4j6j0L8l2j2M0l0j3J0J1j9N5l7L2m4K1qkMKJ4pMJ7j8j6k0j1N1l0j4J5j7M5l8
$$ 25 -6 -18 -13 21 5 -5 33 1 -11 29 -1 -14 -4 7 -12 43 6 38 -6 15 7 5 9 11 25 18 22 39 21 5 -15 -26 25 -5 -19 -4 -21 24 -14
6.73614a4K7Nn8P2n3oK5K0k8L7l2m1O4Pk8k5mK6jL2m6K8j5N9o6K7j8M0m1mJ8on6L6QTJ1J8n2K2
$$ -14 13 18 -40 32 -21 -27 -2 18 -10 27 -5 -46 18 25 -3 -28 -32 -6 -7 25 -21 7 -8 51 -15 12 -6 34 -7 -11 7 1 -55 -19 -11 -3 8 26 -26 -4
6.71579dj1M7o0K0mj1K7j8L4k6rn4N5J0nPK7n4K8j4kl1L0J0j4OQJk3Q1n5K0qNr7N2M2o1N7k9L3
$$ -4 -15 32 -28 -8 -12 -23 4 -14 20 -6 -15 -69 -14 -4 -9 -2 25 -29 -1 -15 -17 -48 -18 -8 -22 -16 -8 -7 -30 51 -4 16 8 13 -84 -32 10 -51 6 -23 10
6.69493A0k4N6n4N9m2k7JlL1m0L6j8NmM0m3j8M4J4J5m8j2K7jj1kPn9Q5j7On5M2n1L2J5J1k9J5P
$$ 10 -14 42 -12 47 5 -22 -21 -24 7 -33 3 -15 -10 -14 26 -17 -35 9 23 38 -10 -22 5 4 -7 -9 -2 -61 24 7 13 -42 0 -51 -19 -4 7 -22 -7 0
6.67458@l2M6m4M1mJk5K1k9RO6n6J9Ln1L0L4pK1o6M0l7L1k2oj6L1m3N6m2M1k5O1o5MJ5jPk6L8
$$ 0 -32 14 -30 11 7 8 -17 4 -25 -16 50 -6 13 16 -35 -5 29 22 43 -23 17 -20 11 -11 -17 -33 -2 -45 11 -31 10 -15 46 -19 -15 0 -1 6 -20 18
6.65423A8l0J1K3Jn2K5k6L2l7JL4J6pk4M0j7pj1j0K0m8L1K2Tj4l8OL1m9J0P0k7k8oK7RN3l9k4q
$$ 18 -12 -1 22 23 -29 -4 -30 2 -35 -34 0 16 9 -15 25 8 1 -10 -20 0 -48 -17 5 27 13 -25 -19 12 -37 -27 43 16 -12 -18 9 18 71 32 8 0
6.63389@k2pL7n6M6k4J5JN9q4QM9Qp0K0NRL5Ro3k1M9J5m3L5J2kl6L3k2J3OJ0n3JM6q3P7pnNJ4
$$ 0 -22 -29 8 -48 -2 -26 -11 -10 49 -35 -27 22 30 -40 -20 -15 -6 29 38 -25 -46 3 18 -25 10 22 20 -16 17 -5 8 14 24 -29 -28 18 -65 12 5 0 5 19
6.61252A9k5j3RJ5Ll7K9Kn7O5rpl1N0oK2n7L5n5N8r6J07n9O0o2K2L5n8L6K2jj7qm7M3lo0P7l4
$$ 19 -6 -19 -10 5 8 -29 0 2 -55 10 1 -6 -37 13 7 29 -28 7 -48 10 -86 21 -38 22 -40 -18 17 -41 -5 17 16 -1 -9 -56 -13 -16 -76 1 -33
6.59268c3M1k8J2nL4l6Ql8M2j6N4m8jTQL5k5j0j8J3Jl1M9Qm9lL2%j9j3O0p8M9K5J6l6j7k8K7J0
$$ -33 8 -20 -8 -13 21 -15 -7 -45 -3 -19 35 -13 -14 -15 -7 28 3 -7 -25 -12 -11 -42 7 15 -34 -37 -5 -5 -24 -37 23 -55 -6 19 35 -1 -18 -46 -19 -9
6.57233iK5m1J5L0m7K3NK8m6Pj8O5m8k2K9kJM8n8%M7k4o7P8Rl8L3k2J0m5M5mk2J2j6M3l8jL5l4
$$ -9 16 -25 -10 20 -27 -4 1 29 -17 -10 -28 37 -11 -33 -4 -6 -5 43 -15 -15 32 8 -59 19 28 -10 23 1 11 -34 11 7 -15 -3 -19 24 -14 -15 20 -14
6.55198a4K0oL5mm4j1PL5pK3l9j8k1N8j0mTl7M8r6R2J3o3O6k5l0j4M4m9N3k4K6mPNl8PK0j9TO0
$$ -14 6 0 35 31 -13 -24 -17 18 11 34 -5 -23 -44 14 4 0 -4 -41 7 -89 3 16 -47 19 -6 -36 -50 -6 -55 -2 -26 0 -4 3 8 -30 -23 -3 -22 -41 19
6.53113A9k2l0j4M5l6L6npK2k7J3pJ8Qk2qj9OL2J2n3MJ2QL4n7K3l6P1k9RKj6OqM7q2Q5l6K1l7
$$ 19 -3 -33 -47 -2 -38 -2 -7 -14 8 -19 -6 -13 5 13 -9 -17 -36 -30 2 14 -39 -35 -23 -15 19 -38 -15 -51 20 -9 0 2 -14 -8 -16 31 -51 34 -2 19 -18
6.51027a8K3n0N0q5Q4k6O2p2O5o0L9l6LJ2L1j2jj9Pmm1N5j3L4k7qK6j9j3J6k8L6l4L3J0j1j4j3
$$ -18 5 -45 5 -80 4 -22 40 -32 33 -27 12 -24 -21 -9 22 10 9 -10 -3 -7 -48 7 -6 28 1 -7 19 0 -13 3 -25 11 -23 10 20 9 -5 -18
6.49094a8L%j5%l6N3J1K9l1J7l8L4k0L7qj8%j7j3M6m3J1j7L6J6nm2OK6nK5m6%oO4l0j8Pj4L6j0T
$$ -18 -15 -15 -30 -30 -66 -13 -2 27 -4 13 -25 9 -11 26 18 0 0 -17 -30 16 -27 -16 -33 3 19 14 -28 -22 4 -1 24 -22 -22 -28 36 6 -12 -5 -19 17 7 -3
6.46957clJ1l6M1k0L8rk5k3NM2lj6j2PpJ5j2K4m3RK8k1j8L7j3ml0L1pKrlL4k2K2k1pN4n1Rn0M6
$$ -3 -6 5 -31 10 -10 28 19 -6 -29 -24 18 15 -1 -13 -6 -13 2 -10 14 -29 -20 8 -13 -31 6 -7 -11 -41 -10 -17 -15 -24 -27 7 -15 7 -14 -21 33 -18 -9 -59 -13
6.44770a3l1ML0j6L5kl6M3l0k2K9kj8QKJ9%j1Oj7N8l9Mj7l3N6k7M4o5M9m7L5MJ%n7K3J6K3m2K5
$$ -13 -44 -40 -10 -26 9 7 -29 14 -16 -38 -9 -11 -29 -21 -19 0 0 -11 -5 -22 36 -3 1 -16 -49 7 -20 24 -41 8 -39 -4 0 1 1 -56 -33 -17 6 -36 -11
6.42684a1Rn3P2m5kL0j%K7l0j8L1k9PNPk6K5Jlp5O7k3K4K8j4k1J1k1k0L9j1nK0Ol1L0rj4j5M7
$$ -11 -2 -55 17 -28 -30 0 -1 -1 26 -4 -22 9 -20 -13 -8 -1 -27 -2 -1 -4 -79 -12 -35 -11 17 3 -18 -7 -28 -48 -9 -20 -25 -5 1 -30 0 -9 -23 -38 9
6.40598IK3rm9O6m2j8L4j7J0K5o7K6M2j6j9k2J5M0m1Ll9J8K3PTm5M1l6L9o8Q2Jk9L1m2L5l3J9J
$$ 9 32 23 -26 40 -2 -20 14 -3 7 32 -35 -9 33 17 -2 -24 -9 31 -10 -7 -46 -28 -5 2 9 -36 5 -31 8 -60 22 23 -6 25 -17 18 -15 4 5
6.38614EL7o9L3o6L9M3l8J4j3j6L6m7P4q5M7k4oJ6l3K4l5M5J9m9O1o4Q2o3J4NJ4l6K2j3J6Lpk7
$$ 5 42 -27 6 -60 -21 22 -16 -2 -15 -31 5 -42 32 -53 -6 -30 -36 -20 -53 -29 -64 -19 0 -49 12 -52 30 -33 -19 -14 0 -36 -14 -27 -11 -8 -15 -42
6.36681d2L8k8K9l2K6K3l2kK2k2k1J2TL1Kl0K3l2nM6m8K0J4no2N9l6K1k5P5r1J2M5J5m3L9j7M
$$ -42 -4 -32 -3 -35 -9 14 -18 -20 2 -20 -41 -29 -17 14 16 -14 9 -23 -28 18 -30 -10 4 -1 -63 -4 -40 -19 -44 31 -60 -48 -3 12 -31 8 -9 -5
6.34748ek4N8j4J2l2K4j2l0P2p2L5k7K3j4k4J0J3Pk0L5l4QM8n7kjJJ7oJ2L9l5m7j5N7jJK0j3j7
$$ -5 -29 29 15 27 -5 19 7 -23 49 -23 12 -15 8 -6 -30 -20 -7 0 -20 15 -19 -11 37 -20 -22 -23 -22 -5 -11 1 40 5 -42 -57 0 -1 0 20 7 -10
6.32713a0m3Q6p9M1k5K5m1M0k2J5k7J6MM5oo3M2J8n3K3l1M7k9K1Pqj1pj1M9j7TlJ5ok0O8l5J4
$$ -10 -53 33 -46 -5 -30 -5 -46 -6 -28 -13 -40 -24 -20 25 19 -44 -2 16 -37 -14 -45 2 -27 -6 1 -7 -18 -25 -36 13 -4 -21 -24 -9 -15 -35 33 -2 12
6.30729A2k4J9m0N4j2Ml5K9j8Jrk1L8J0j1J5j7L5l2n6L4j7L5n6M4Rl9L1j5L4k2m4K1K5j3N8o4L
$$ 12 -12 7 -33 21 9 13 -22 7 -11 -10 -19 -40 -2 8 -3 12 -5 30 -2 -58 -24 -41 -6 -62 -18 -9 -48 -17 -32 2 -20 -64 -43 -18 -31 27 -37 -34
6.28796c4L1K3k4k8O9j4m1J2l1J6OJ7jk8kJ7J5jMj4j3J9l6K8J0J9j9L6j0Nn4J8k9M3m7L7o2K3K
$$ -34 -3 20 -4 -32 37 23 -18 -6 -37 -21 -15 2 1 -27 -29 -12 3 2 6 -8 -21 -2 -38 -10 0 19 0 36 26 31 -23 -5 -34 9 -38 -1 -63 -40 -38
6.26812c8L5Mk4K7j2l9O4k6Ol0QJ7Lk9N5n0PK9o9P3j1jn1N3n0N3m7NL1K8m8j4K5oJ5j8J8j9K5
$$ -38 -3 1 -23 4 -8 -47 17 -9 -3 -33 -25 -8 -5 -34 21 -29 -22 7 -62 11 0 -1 -52 1 -49 4 -43 -38 -7 21 -27 -41 -16 -22 -7 -25 -7 -26 -1
6.24828ap5M1LN5Pl7jo6K6N0lj5K4rm7L7Rk1K4J5k2K2ml3lJ3ql5R6l7j1J0o3N7l1MJ3J6J3n0M7
$$ -1 -76 -35 -32 23 30 -7 -8 -74 -48 2 -1 -16 8 -1 -48 -11 -2 -23 1 16 -6 16 12 -21 -24 -11 -19 -54 42 5 -6 4 -59 -2 -33 -29 -16 0 13 -37 10
6.22743A0l1jJj3TJ5K7Kj1j9K1J8n2N9m5O8q2O4l9M1j6j1K2k6J9lm2PL8k7Qj7L8n0N3k1NJ8po0
$$ 10 -21 -22 -21 -34 -47 -32 -5 -3 -14 -33 -12 6 -46 13 -32 36 -46 18 -21 20 4 -7 15 -11 8 5 -37 -30 8 -19 -11 -28 10 -40 13 -8 -3 15 8 -52
6.20708e2N8j6j9KK8J4k1mJ1Kl1lj2L9K3o9L1K2j5K7k6rJ7Rl4O1l6j7oO2n6L1k3J4j8j3K5j5N6
$$ -52 6 -10 -29 -27 1 15 -6 -10 1 3 -28 -31 -43 -4 19 -50 -19 3 -12 15 -11 -20 -3 6 -28 33 -3 -20 -26 36 -20 11 -12 2 -16 -29 -4 -19 37
6.18724C7p4N3k5k3QK4n5L5j3j4J3L3l0P0k6Jk9J5Qm6L8pPk4j5N1n7L1J8mo0N5j6J3qJ9om5Q8
$$ 37 -37 16 -9 -32 -24 0 -55 -20 -33 -47 -34 -1 -31 39 13 14 -15 0 8 -38 0 -7 0 -24 -39 12 -45 -14 4 0 -60 -5 -21 -8 -16 3 -3 -48 40
6.16740D0o6M0k0L0k3j2k4l7L9J8%J6k6%M9kl7L0m5K1j4J9kO%lm4M1J4N1q4P1l1o9O2m7K4k2L5
$$ 40 -26 14 -6 24 1 -11 -35 -72 -33 -15 -15 1 -25 -25 24 22 -15 15 -30 -9 -23 -4 -6 0 0 -3 -47 -6 8 59 -25 46 15 -54 8 -39 -15 -37 -2
6.14756bm0L0NL4k4n6R1n8K0l8N0n3L8m5K8J5oLk9K1K9L8m0Qj0j2J0p3P5l5j9K4qQL0qjJ4l3K5
$$ -2 -42 -12 -7 27 3 -53 38 -20 0 -38 12 -41 -3 -48 -20 -5 -11 -8 -37 -16 13 51 11 19 9 -3 7 -66 9 -26 -45 -21 -29 -21 9 1 0 14 -19 6
6.12721FK0p3N2o3N9o4O3l2Qj8M5l5oJ5Rl0N3ql0mK4kKj4k5L5Qj8TJ9NP4k8m7kJ8j2NK3n8L2K1
$$ 6 26 -47 5 -58 1 -63 0 -32 -24 -42 3 -32 -38 -23 -14 -44 9 1 -29 -33 -9 -11 -9 -23 -48 -13 -5 -23 -41 -22 -17 57 29 -18 -20 -2 -14 -9 14 -44 -12 9
6.10584Il0M0nn3K9j6rJ5l6M1j2rL5n6K1J2L9j9nk9K7qK2oL3p2N9l0k2orQ0p0N1k7J6l9J1RQM0
$$ 9 -21 19 14 -39 -10 -26 -35 -20 -56 -15 -27 -36 -1 -57 -36 -24 15 -4 -9 -38 -11 -19 3 -3 30 -42 17 -13 -35 -41 -50 30 -40 11 -16 0 -39 -28 -19 -11 29
6.08499B9k4L6p0JTJ0M1o2M8j6qo3P8k3J7j5L2o0K9k6J4%L2r1P7K4n7J9Kjk3K8j1j3M1j8J8l4
$$ 29 5 41 -29 -28 -27 -17 24 -38 10 -6 -14 -77 1 -22 -5 -20 12 -48 -19 -45 -31 -31 1 -90 -13 11 -46 -27 -25 -26 -49 -21 -32 -45 -4 -22 -4 -38
6.06566c8K3RL0l8K0j2m8M7Qk6k1N2Pl9K0J5l9J2j0O0r2K5K7Nl9P4p1P9p5L0K9m4K3j5Kj3K8k8
$$ -38 -15 -6 24 -14 6 -6 -54 -7 1 -25 -46 6 13 -26 -6 9 -30 -18 -28 32 -60 -35 -8 -3 -42 32 -39 40 -35 -5 24 -20 3 -12 -10 -23 5 -23
6.04632b3L4m6L3j7J4J5p5J28r5K2k6J8K7o5O1j8mj6L8Ql8KOKj3L7m3N6o3N9n0L8m8O0n3M0k4
$$ -23 11 -35 -2 -19 -5 10 -65 63 -32 -10 -36 -18 9 -56 5 -13 -17 -33 5 13 -25 -23 -17 -15 -28 9 -34 22 -41 18 -32 6 -42 18 -35 5 -19
6.02750a9K7l9K2qK1J8n8Oj5K9J7k0O5n3K5o1J5QL1o0J6L0l3J8mJTK8l8N3j00K6N3l3J0%K3o9
$$ -19 8 -31 -9 -17 4 22 -36 -30 -45 -16 1 -19 46 -7 18 -43 -28 -20 11 -49 -33 -3 -36 -18 -22 -21 -20 8 -30 23 -77 -51 2 -31 -21 -21 2 -67
6.00817f7L9K8Rl3J9Tn0N4k6%k9MJ8J4l1K6l5P0m2j1J1J5k6j0K1pL4q4N3j3K6PJ0n5O5o8K2%J5
$$ -67 -28 0 9 -24 -5 14 -36 18 -8 -8 -37 -33 -15 -1 -32 -6 -41 29 -13 -24 -13 2 -24 -34 -13 -20 14 -70 -17 -30 -4 3 13 -42 23 -45 -23 -23 -8
5.98833hj3mJ7j6j2jQL7l6j6jL3l1K6lL0K7m6om5M2j9K8ol0P2o4L6k5K7k6L7m5pM1m1L6l6J0L
$$ -8 -21 -25 -8 -24 -36 -37 -29 8 -28 -44 -45 -12 -43 -17 -20 10 37 -9 -15 -60 -18 -37 -9 -15 -45 27 -37 -1 -26 1 -25 12 -33 -40 1 -40 -4 -40 -30 -27
5.96798b7L3LJ3o3J0K5Lj6j2J9l3M5j4j8J3m0M2L7l8l1M2k3N5m3J8m8J3L9j9l8K7Rk6K5J1PmJ3
$$ -27 6 9 22 -41 -31 -6 -3 -19 -31 -12 -45 0 -14 -32 -19 -59 -17 20 -18 -49 -7 -30 25 -18 0 -48 -35 4 -15 -53 -26 -17 -43 -18 -7 0 -4 9
5.94865Ik6ML6j02L2M3j4Mm0Q7m3Pj9OMK8k1J0Lm4K3m4L9l2M4J8k4l2P0q3O4p3KM4K5l7M1n4L6
$$ 9 -17 -13 23 -79 -47 -4 -18 -14 -54 33 -10 -3 -22 -16 -12 16 -5 5 8 -36 -13 -57 -18 -50 -6 12 -12 -44 26 -57 7 -66 -64 -20 5 -32 9 -45 -9
5.92881iJ9ol2m3%P1j2J9rj9nqL0k5ll3P2k8l3L8J6K8m8l0oJ2K1l8L0L2J5p6N7k4L9p5N7p2O8
$$ -9 10 4 -28 -71 -71 0 -12 7 -2 -21 -26 -34 -4 -29 -32 -65 7 -21 -54 -16 0 28 -20 -50 -56 -44 -23 -61 -31 1 16 -60 -3 -27 12 -63 -6 -78 -10
5.90897a0J4rm3M4J0j1k4M7k3k9L4%p3Q3n7P4n6Qk7L0J5K0m3OQJ9Jn7O8k6K8m3K9p5O8m2L3nk9
$$ -10 4 -5 -48 -4 6 -5 -29 18 -5 -34 0 0 -73 10 -47 27 -29 -21 -48 -18 -3 17 -26 -20 -12 7 8 -49 19 -7 21 -22 7 -68 0 -42 -9 -14 -43
5.88913d3K7K8n1M8k3jK2Pq3O8k6L6n4N2j9PRm8J8Oj9pP3o5kO0j4j6M1q0M9Mk8LL5k3k9K9Qj8%T
$$ -43 -16 12 -39 9 -14 -15 7 14 -69 -1 -27 9 -45 7 -12 -5 4 -44 -26 -20 -39 -46 27 -38 -40 20 6 -10 31 -49 0 4 -24 -21 14 -9 -38 -9 -1 -19 -19 -19
5.86777a9M7k1kj2k5N0oj9k1KL1o4O7kM4o0J6k8J6Nj4J5Oj7K9mpl5Mj2M1L4p3nM1kj4NJ9m1J3
$$ -19 28 7 5 -7 -32 18 12 -7 -28 -26 5 -59 8 6 50 -10 6 -22 -6 -1 -15 0 6 -11 18 14 7 -28 -24 -36 5 39 -34 -39 2 0 -14 -9 10 -31 -18
5.84691a8J8k0oL6p3M5j9J4K5m4O6n6J9jj6J4M5l1PLq4N5l0N1m2kOJ4RJ3%rj6J1j1J1qJ3qk0N8
$$ -18 0 -20 -26 10 -63 -18 -37 -23 2 -42 24 -32 -13 -14 -30 -16 29 -2 5 8 -76 -21 -51 0 -42 -44 -38 -24 -15 -2 -2 -11 -27 -16 -27 -16 -24 -11 -19 -39 19
5.82605A9n1N8k6l3k5M3j3M2j3%j8pn5Q7l1j0OL9m5K5KNl2L3kJ6k7mTj5M1m3K9KPm5O4l0%k0O
$$ 19 -32 26 0 -33 -58 -15 -28 14 1 1 -17 -24 -79 8 -23 -33 -27 12 -33 -8 -6 -1 -33 0 -2 14 -13 -17 -21 -36 5 -38 -9 -7 0 -45 19 -11 -11 -31 -25
5.80520b5k9M4J4mjKj9Pk9R2p9J9K0m3j1K1k7O2m3K5k4K8o3O3nk4L6p2O1k9L5j4j2k3PJ1J3Qj0
$$ -25 -54 -10 4 0 -1 1 -18 -11 -40 52 -27 -8 12 -31 -42 -21 -48 14 -29 -4 -28 0 -63 0 -5 -29 7 -65 -4 -33 2 -12 -24 -47 -40 -29 -16 -8 -18
5.78536a8OKl6KM0l0PkK3k2pPN1l9K6l7L3j8k1L6lPmk2M1r9P2k1qK9nm0J2K6J5Pl3K3k7L3ok3O
$$ -18 -12 -10 -46 -44 -4 -34 -27 -29 -6 -28 -35 -28 23 -16 10 -27 6 -12 -33 3 0 7 3 -19 22 -77 -5 -26 -34 -5 -10 -50 -38 -12 3 10 -23 0 -27 6 0 -23 -17
5.76348a7J7K6m1J9rK0Lp1K2J9QJ9k0K5n2OmJ9J7nj1j4K5J8k7l6J7N2m5N5j03R2n1L4LL0mm5O8
$$ -17 0 26 -15 4 -5 15 18 -53 -31 -12 -4 15 -5 20 -32 -26 -30 -11 6 1 -10 -24 1 19 -8 -44 -27 25 -20 35 -68 24 -27 7 10 40 36 -9 59
5.74364E9oO0k0N6j06N3JRk2K8l7M6K9k0j7l7J6j8J2pK5J3n6j1qJ4K5m2l5K6m3MP2n1oJ4J0m0
$$ 59 53 113 93 149 43 96 97 106 84 112 75 121 150 130 113 76 92 74 86 79 104 117 61 50 42 56 81 39 4 30 -13 -9 63 12 6 20 30 -10
5.72431a0k0L3k0J8l8L2MNm1J4K0k7K7l9K9j2K2jj0TL7j7rnM7k7k6k9L4NLrkj0M2m3K4l7M3K9
$$ -10 -30 3 -17 1 -37 -5 -1 4 -37 -23 -3 -30 -3 -42 -13 -25 -3 -4 -14 -24 13 -4 -13 -18 29 2 -24 -53 -19 -14 -11 -20 -22 -32 10 -33 -9 -46 -3 26
5.70396B6n4lL2ml6M2j7j2jL5j4l4M3k8K5k2jTj3K8NL8k0ko2N0k2K7j6J9qNRj2Mk7M3k8J7m2k2
$$ 26 -28 -31 1 -3 -39 3 -14 -26 -27 8 -6 -40 3 -25 0 -22 -23 -24 -37 -9 -4 34 14 12 -50 0 -22 5 -11 8 0 5 14 2 6 -21 22 -6 11 -31 -53
5.68311e3Q6k0l1J8J5m8Q2n2KLJ3m6M9k7M0q6P1l6K7J9m7J6J5p8N6j4J4K9l7kk3K5k4j5Q0l0n8
$$ -53 33 13 -18 0 15 -33 49 -3 -1 2 15 -31 18 -9 31 -55 16 -20 7 26 -21 -5 10 -68 -12 -26 -12 17 -20 -22 -45 -20 -44 -59 21 -9 -67
5.66428f7P3l8K6k4K7m2M5l6M3l6%j3MJ3%K5k9O8o5J4l4M0MJ6o8K4M3k1QJ8m6K8k9J1M5o4P4q8
$$ -67 6 -32 -6 -30 -3 -45 0 -36 7 -29 -29 -42 -38 -25 -25 0 -29 39 -26 -12 -46 -6 -2 14 -54 -30 13 -8 0 18 -28 0 -29 -18 27 -37 37 -51
5.64495e1N9l4L2l7k0K0J1m7L1N0m8L2L0n3K4ol1M1j2L4j1m8L1o1Q4l7k8M6k9j8k4LR8j5l2J6
$$ -51 8 -26 6 -31 -51 -31 -20 -67 -36 14 -34 -2 28 -25 -1 -7 -38 3 -9 25 14 -34 -3 -64 20 -17 -45 1 -28 -46 -70 -67 31 16 -16 0
5.62664@j6kJ8mk8J1K8l7K5rm0L2J4OkQ%k4L4j8J3m4O7m2k3L1jj2mO7o3L3Jj0m5N9j9Qo4J1O9
$$ 0 -16 -18 0 -4 -32 -21 7 -30 -5 -14 -54 -22 -8 -2 -4 4 4 -20 14 -4 9 -35 32 -10 -33 -2 -3 -15 -19 48 -15 18 19 9 -36 23 4 12 -52 -41 28
5.60578B8l3k3O6j4k5k0J3j5J8k0N8n2Rl1K9j1MNqj5M0k9j2J9K4oQk7OL8m5%O6l8Ol5K5j6Rk4
$$ 28 -5 -28 38 24 -1 -21 -8 -23 -5 -25 33 -19 -10 -41 -12 -23 -19 -14 -22 -37 3 -26 -38 -19 5 -1 7 -20 -14 24 -21 -21 45 7 13 -22 3 -13 -4 -28
5.58543b8J6j6pQ5m5k1ojL3o9K2%K8rkj4OK2j0oN1o6j1pL2k0L4j0k6qK0K3j0OL5n3M7n1O0o8L3
$$ -28 -12 -28 -35 50 5 -16 -22 -23 10 -59 -37 -37 -9 -18 -20 -34 -28 -6 -16 -22 29 -37 -48 -55 -23 -43 -9 -19 -45 -53 -33 -10 -20 -14 21 -32 15 -36 24 -44 -11
5.56458a1J1Mk3L9l4J0k8lM0j7j5K4q7J01J8k6rk6L2k3L2m6M3l4K7l8L9l6J9Kj0J3M4r4O7l3NT
$$ -11 0 4 -19 20 -14 -4 -32 -35 5 -12 -27 -3 -90 11 29 3 -6 -32 0 -23 9 -37 6 -28 -1 -39 0 -36 -17 -15 -25 -12 32 -62 5 -28 -23 -18
5.54524a8k6O5n9O7p3Q4o2K5k9N0l3J8J3n2OL9l8Km8R2j6L9o8L0l1K3j0oK3l5K1m3QK1OJKn7R9
$$ -18 -44 21 -38 29 -44 40 -22 3 -26 24 -9 9 22 -30 -24 15 -23 -21 -69 23 7 46 -22 8 -23 0 -10 -16 7 -28 -7 -50 -42 -21 -15 -14 -12 -69 30
5.52540C0n9N3o6J2KM1l1pQJ6m1L1rN5j6j9j1J2nmpl6L5J3Oj4kj6rM3k9K8j8%K5p1O4m3N3o6K4
$$ 30 -29 24 -42 -30 -28 13 -18 -25 -17 -1 -42 -11 -20 35 19 0 -11 1 -4 -8 -15 -51 -16 -3 3 -11 -13 -29 -38 5 -24 4 -14 -14 11 -60 4 -39 14 -52 -28
5.50455b8rN4p4K1pN6m1K8m2K1J8m5N3n7J9j8M7Nk7KL7p7N9k4J3RJ9j7J2Tlkj8J0j7LL1m7J0J3
$$ -28 -37 17 -57 -36 -43 13 -28 0 -42 -21 -3 -48 5 -52 -33 -51 -4 1 -26 -24 13 -64 -5 -29 -16 -7 12 -5 7 19 16 14 -4 6 -11 -8 23 -24 -14 -1
5.48420aj7m3L9k6N4l2j9RM5Ln4Qk3L1MOj8j5J2J8j1Lj9N6j1l4L5k0j1K0Mk6K7j3k7MJ2J4J6m1
$$ -1 -18 -61 -22 -48 6 -26 -45 -36 9 12 -42 -34 -57 -26 -22 -16 -34 -49 -37 -19 -30 -27 -46 10 -1 -35 0 -20 -31 -11 -7 -33 -6 -19 -46 -42 -30 -16 0 -41
5.46385d1J7L1o0L8J5m4j3K2L2j5J1k7jM4l3K4p8R2m7QLk6M7ll7J8rN5q0P1m2N5q8P2n0O8n0M1
$$ -41 -24 7 -53 -15 0 -44 -57 -35 -3 -18 -7 -34 -35 9 -24 0 -78 14 -33 -25 -22 -48 -1 -4 -41 -23 -32 23 -57 14 -28 27 -61 11 -39 29 -21 20
5.44452B0m8j8L4NJ%K4m8ML1n3L7JK5Om1L1n6PJ8N2p9M2Pm1L3l5K2K5qljk5K9l9K6Nl5N7p1N5l
$$ 20 -28 -46 -12 -7 -6 -6 18 -30 -26 5 -48 -11 -10 15 21 -20 11 -45 -38 -20 32 -47 -5 2 -39 -6 -41 -19 6 -2 -5 -6 -31 -2 -41 -15 -10 -45 12 -59 -4 -7
5.42315gj4TL7k0l4O9l4J7j1L0j7k5j0K5k7L1j6j1L7k5kj4K2k7NQ4n2l1K2k0O0J0q7O0l8JL1m4
$$ -7 -21 -35 2 -18 -52 17 -17 0 -11 19 2 -23 -33 -8 -35 -4 -20 -31 6 -19 -21 -35 -13 -40 -35 49 -3 -34 -12 -32 28 38 -49 11 -27 -26 5 -39
5.40382c9Nk1N0kK5o3j6N1l6O8n9L4k2K5j7KJ8RKm0k0M3m5L4%qJ7K7k0l2j4K8n0P3o2P0j2kOL7
$$ -39 -34 -55 -5 -7 18 -45 -61 -10 -46 22 -37 -3 -25 0 -17 -15 3 12 14 -26 -46 -3 -48 -14 -14 -22 -5 22 2 -30 -44 -16 -66 7 -55 15 3 1 7 44
5.38347D4n1l7RK3k8J1L1m4k0M7K2l2J0k9N6j3NJ1l4k2M2ql2O1n9L8k1k2%J1K6Nn4N0nJl9O2m7
$$ 44 -7 -44 -35 -12 -40 -29 2 -42 -62 -15 7 -25 -15 -44 12 -1 4 15 -19 -41 1 -7 -39 22 -37 1 -20 -42 -42 -31 -5 0 -54 -4 -9 -8 -47 15 -32
5.36363c2L4k9K8Pk8qJ1l0J2O5r1N1k1L3JL1l3m3J9kM6j8Qm7M1k6J2j8K7K4n9L7pK3n1JK6Lk8
$$ -32 2 -27 1 8 -20 -28 -17 -47 -35 30 -61 -10 -31 2 3 34 1 -42 -23 -25 21 3 11 -36 5 -21 -9 -27 0 24 -35 2 -5 18 -33 -32 -6 -3 -31
5.34379c1L3pj8m2N3n3K4K1KJj2j7mL5m5O5n1O0l4MK5k7j0K0lm9P9l5Mj6oK7J9k9j7K3oK0o1N3
$$ -31 2 -5 -23 -65 -12 -65 -41 -20 -18 -17 -29 -46 -50 -15 -60 5 -46 14 -20 -16 9 -18 -28 -8 -11 -60 19 -16 -12 -28 -34 -7 12 -17 -34 -11 -17 3 -58 -5
5.32345el0L9J1j2o8M0K6K7m0NJk6K3J2j3pj7M8mjm9J7lK2JJ7k9J2m2L0J2K8q8O0%nKkOopj0K5
$$ -5 -35 4 15 3 -65 -25 1 28 -12 -7 -6 -32 -9 3 -10 -17 -34 14 10 9 -40 -23 -26 -4 -3 14 -15 -3 -45 -15 -3 25 -63 -3 -3 -8 -6 -8 -2 -8 -15 -25 0
5.30157@rj5l4M6Mj6j2MM0lj7l8L8%l7M1j9Lmk2O4m7Pn0P8j5KJl4M7j6M4p2O6m9L7l3L2l1K3jK
$$ 0 -9 -24 -58 -12 -8 -24 -36 -32 8 5 -12 -50 -12 -12 -49 -8 -27 -24 -28 -50 14 -33 -26 -76 2 -13 -11 -10 -44 3 -13 31 -41 25 -24 13 -20 12 -19 4 3 5
5.28021ERlj3j0l5L1Nl8N2n3J6M3o6L4K3L1o7K8m4M8nRj4nQj7J2k3K2j4K6j6nL2Kl6L0j9Mj8rm
$$ 5 14 11 -2 -12 -47 -16 -11 -49 3 -50 -34 9 -57 -23 0 31 -36 -8 -52 -4 -9 0 -14 -19 -11 -28 -16 -39 -17 -31 -5 -21 -26 6 8 -28 2 -17 -13 -31 -40 -44
5.25884d4N1l1K8j6J2l3M7q%k7oK3k8%L9Nj2Oj4j3K1n9L7K9n1N0NPp3K7J5moK6rk3N6p9M8J3J2
$$ -44 7 -24 4 -12 0 -33 14 6 6 -21 -27 -4 -32 -32 7 12 0 6 -8 -21 0 -59 -22 7 -44 6 11 18 -55 -28 -13 -17 -23 3 -6 -29 27 -52 -4 9 21
5.23798B1m5K6%Qml6M9N7j33R5l7j8RJ5k4m1K5l0L2J1Tk3k5O3o0P8n9RJ9j6k0K1J0k5O5n9K6p2
$$ 21 -24 2 2 10 6 -30 19 76 -57 38 1 -17 -8 7 -17 -58 -33 -63 -31 -20 -9 -32 -57 6 -54 24 -35 -26 -7 -23 -43 -22 -12 -37 28 -31 -5 -77
5.21865g7N3koJ7Nk9JJ2K5o2O0kj1P7j06O5n4L1m6MJ4m0R4j1o5M7J7pk6K7j6j1Tm9O8Jl7J8J9r
$$ -77 -24 -26 -32 -15 -10 -39 -38 -26 -1 -63 -3 -5 -16 61 -45 20 -34 -3 -49 -45 -31 -71 23 12 -53 -6 11 4 -22 5 -11 -22 -33 -82 -14 -13 -50 -32 -13 -22
5.19830b2plM0k2J3m3M4n4M2pj2m5P9l1pj2J3lOL1k9jJ1JQj9jJ4j9L9m9K5l5O0m6RkN1j8m4K6l
$$ -22 -29 -32 8 -14 -1 -44 0 -54 -12 -19 -31 -76 3 -28 -35 -47 -34 -37 -31 0 -29 -30 -19 -18 -10 -29 -30 -16 -35 4 -45 -20 -55 5 -41 -32 -34 17 -1 -45 -19 -22
5.17694b2J4l2J9oJ2Tm6O4J2k4qj3ok6L9qRpm1R0n1L3j6j2l5lJ6KM9Lo9K5j0mK9JK2q2O5j3K1
$$ -22 -8 -40 -21 -27 -15 -3 -49 15 27 3 -5 -18 -24 -50 -11 -19 -10 -17 -58 32 -19 14 -2 -14 -49 -52 -36 -34 15 18 -51 -26 -36 -40 -11 -10 12 -70 -5 -18 3
5.15608Cq5J01j1n9M8k6K5j4j2M6j6l8N2l3mj4MoJ4k8K4k1M4n5N1%l0L4Ol2j3K4l4L7Kk4K7k5
$$ 3 -82 19 8 -51 -3 -29 -4 -18 -30 16 0 -38 14 -19 -23 -37 -33 -39 -25 -53 -29 -50 -6 -61 -10 -10 -40 -6 0 -32 -45 -21 -55 -18 -16 -40 -13 -38
5.13675c8L6l6K1Lk0K7n%l5J1RN3r7O0oM1j07Q1k1M1q3L5QK6j9j0K4l8k3K6Rj3L2m4K0lOqL9Nr
$$ -38 -2 -38 -17 -14 -34 -7 -12 -12 -47 -36 -27 26 -71 -11 -17 24 -83 -2 -23 18 -65 -30 -22 4 -15 -25 -1 -39 -62 -36 -27 -40 -8 -52 -32 -35 -29 -37 2 7 -2
5.11589bM7p4lJ5qK2l4L5k1K9m1L0k6K2m1P6m5%NJ4k5j7J9M9m0Km5J8k0O5k9mK7l5J6L0Rq1L3
$$ -2 45 -29 -32 -17 -25 -3 -37 -2 -23 6 -35 -5 -31 -9 -50 26 -19 -19 -14 0 -25 -42 -23 26 -14 -12 -57 -39 -59 6 -23 -27 0 -35 -19 11 20 -61 -28
5.09605b8K8j6j9nK0o4M6J4K7n3M9m2K8l4K1k3N1m7M7j7J5OLl8M8n0pM0l8J6L2p9M2J3m1N2j4
$$ -28 0 -16 -35 -40 -20 -84 -38 -24 3 -50 -1 -43 -15 -49 -28 -51 0 -47 0 -17 -2 4 7 -31 17 -33 -40 0 -38 -22 10 -69 -27 -14 -55 -3 -17
5.07723a7L9l7j2l7O3l1L2j3QpoL2l1J0M3m5k1J0N6o4M7o8N2l8M0l6J9jj1%LPNl2k3L6K6Rl7%
$$ -17 22 -15 -27 -64 -1 -32 0 -13 -5 -12 -18 14 -17 -7 36 -9 -30 -20 36 -28 19 -49 3 -35 5 -31 -12 -13 -24 -24 -21 -14 -9 -41 -64 -28 -2 7 -30 -30
5.05688c0K0Lj8L5l8M0k9k1k3K3J2j0K0jRNk4%KlO3m8J4j2n5O1j8K5k4k1J3K4K0p6Q5p0M2l9
$$ -30 -10 -7 -25 10 -28 12 -17 -38 -61 -38 -26 -36 -16 -17 -8 -3 -27 -27 -25 -28 35 -13 1 -11 -66 -5 -23 2 -22 -43 -30 -6 14 -62 23 -47 -5 -44
5.03755d4J02r3N1j1n1L2J2o0O4n0N7j9L3m7K5k6j8N0nTM4m7k7%nN0m6JL0j4j2K4n1M0l3O8l4
$$ -44 58 -35 16 5 -46 -14 -2 -62 2 -48 9 -10 23 -24 1 -25 -43 7 2 -3 41 -6 -33 -33 -38 12 -34 -33 -3 -17 -29 -5 -56 -16 -49 19 -15
5.01873a5N6n1LTk5K5n3J2JTO7m5Pn5P7j8qm0L0Opj7j9N0pJ7j7K8n4K9mK2n3NM2k0J6jj1kj3J
$$ -15 41 -10 -7 -4 -29 -4 -57 -45 -44 -43 24 -21 -14 -69 8 -10 -18 -58 -28 -22 -29 -46 -65 -15 -22 -5 -22 6 -48 -19 -23 -1 -54 -49 -7 -27 -11 -12 -23 -25 -38 -37
4.99736c7L7m6O0k6J7Ql5Lj0PK7m8N7n6L3K7jn4N0o7P2m2j1J4N6k6J2n2J9k6L0j5n5N2K6k3J7
$$ -37 0 -46 14 -12 5 13 -22 -19 -29 -22 5 -43 14 -42 -9 18 17 -37 13 -54 18 -24 -35 -21 35 9 21 -31 -12 -38 -8 -23 -78 -26 0 -23 -6
4.97854fJ2j6rK4l2K0kLk3J3K3m1k7J6K3Rk4M9m0KJ8j3k7O4m8RnL5m8knP9o0rk6J04o1pJ8NKq
$$ -6 6 -10 -19 5 -27 -7 -9 -6 -29 -16 7 -34 -61 -45 -22 -13 -37 12 -28 -26 -8 -21 -48 16 -32 -23 -28 7 -41 -43 -48 31 -29 -38 -64 40 -21 -28 -10 -5 -3 -11
4.95717a1k0OL7k9mRJ3Mk1k4L7K8n9N1q6P6j5K9j8j5j1J9j4l0J3ProM3k8K3J2l3oKj6MNK9k1K3
$$ -11 -31 -25 12 -17 -21 -12 1 5 -16 -40 -3 25 -34 17 -69 7 -8 21 3 -12 -23 -4 -18 -48 -35 -28 -37 -43 0 -28 -5 7 -26 -32 -30 -46 -42 -37 -8 -29 -6
4.93632fj2J8m8L7jRm3k3M6j3M1m7J1kM0n4nN3l4L3j1m1kK2l3O2j5k1N4m7j2j7K7M9l6M%J7n9
$$ -6 -18 0 -48 -11 -12 -3 -46 -69 -23 -36 5 -42 -31 -33 7 -47 -52 1 -33 0 -11 -52 -54 -32 -65 -3 -18 -39 15 -32 -44 -61 -34 15 -21 -17 -17 0 -59
4.91648e9L8M5p0M8j5Lj5O%J2n6M9jj1j2JN8m6k6N4l5O1o7L9pqk9N1o4P6j3K0m0j0pJj5M8j3l
$$ -59 -21 24 -46 2 -13 -10 -25 -19 -19 -7 -63 -14 -15 -26 -38 -37 21 -25 -51 3 -32 29 -38 1 -6 -14 -43 8 -56 20 7 27 -13 -23 -30 -29 -44 4 -9 -12
4.89613a2n5L4J6Rk1Oj6J8LL4k3KL3n7L0p6M0qJ5L9j7M2r1L3jpj9M8o5L9lj7M6k5k3pL7J5To0
$$ -12 -67 -33 -17 -8 -29 -23 -39 -21 -18 16 -7 -5 28 -29 1 -75 -35 -43 -28 11 -6 36 -55 -22 -23 -30 -49 -1 -66 -27 -30 -47 -1 -26 -49 -56 -19 -4 11 -49
4.87578d9M9j4%l3N4k9%j0J1J2lNl7J1M1nk4mJ8oK4l2oK9j8K7n1j3rQ0p6P3n4O5k9l7K4Jm4L7
$$ -49 0 -14 -14 -47 7 -22 -22 -32 -21 -9 -12 -7 -44 -33 8 3 -21 -25 -7 -13 11 -21 -27 2 -16 11 -40 -53 -62 18 -58 15 -39 26 -3 -40 -16 -15 -59 -22
4.85543b2j1L3l1O4n7Mj6K0Nl6L2POo8O7n2L4jJ7l3K0J8n3L3l3JM5rm6M5J2m4J7j1J2J0k6K0jK
$$ -22 -33 0 -31 33 -24 -20 -36 -16 -11 -47 -15 -8 -2 -70 -3 -55 -21 -22 -5 -38 -18 0 -53 -20 -53 -52 -7 -16 -62 -17 -5 -49 -32 -43 -31 -21 -47 -27 -28 -26
4.83508b6Pj5j9O0j4JJ9l9K6m2K4K3n0KJ0N9l2TMKM5o6O0Nro7P9m2K2k3J8k0%J5j3j0M8k2j6J
$$ -26 -19 -34 -53 7 -7 -6 13 -26 0 -42 -18 5 -45 -43 -33 26 -6 -38 -34 -32 13 -53 7 12 3 -64 15 -27 -5 -28 -10 -30 -30 -15 -28 -38 10 -12 -28 -27
4.81473b7l5K4j3L9k7k2N6k1J3k4NJJ1KpklL2p0J7J1L4L2p2J9oK1qJ6l3K5J2k0oj8M4l8L1k0Qq
$$ -27 -62 -38 -51 -12 -39 -61 -5 -26 -13 -37 -32 -31 -20 -18 -25 -27 -30 2 -68 -51 -40 -6 26 -46 -27 -33 -12 -20 -4 -37 -12 0 -20 -26 -44 0 -38 -7 -27 -19 -27
4.79388b7J4L6o1M9l3J1QJ8o1M3m4M5oJ3n3L5mJ%k9jMK2J3L6l7Nn0N3j2TK6l8M0o3O1n7K9oM5
$$ -27 -13 23 -38 11 -22 -11 -3 15 -46 -3 -47 -2 -8 5 -48 -13 -17 -16 -16 -45 -46 -42 -20 -7 29 -8 -3 -53 0 -12 -24 2 -36 4 -59 2 -55 -26 -32 13
4.77353A3n3M0j6%Nj0K2j2l4K8RL8p9QN2k4j6j9KOK5k1K3J3k6lJ7Nj8J7Tl5j3M8no9K0J8K5l0
$$ 13 -40 0 -16 -16 -11 -21 1 -11 -45 -17 -8 30 -49 -41 11 -13 -29 -48 -46 -40 -15 -36 -13 0 -26 -29 -12 -7 -25 -8 9 -26 -39 9 4 -65 -45 -27 -2 -32
4.75318c2J9moj6n1N9j0PL8k7kn5J02o8J4J5m1L0Pk0L0l5pK1Tk2K8j9l3M7m7J9L5l7OK8m1lJ7
$$ -32 -13 -17 -23 -39 -90 -31 -41 -34 4 -23 -25 -80 22 -46 -32 -17 -58 -28 -21 -41 -11 -46 -53 -32 -11 -33 -5 -24 -57 -10 -57 -38 -3 -40 -34 -6 -47 -50 -33
4.73334c3L2kn5jJ2L9k7KPL8l6K7l1K3l5L8m0N6q5O9k8QJ1%pk7nJ9M3o3K1Nk1N3k5k0K1m3L3Qj
$$ -33 -1 -3 -58 -59 -47 -8 -35 -33 -26 12 -24 3 -28 -5 -40 -2 -42 14 -71 -2 -30 -22 -11 -11 -18 -45 -50 -31 12 -51 -30 -25 -46 7 -18 -38 -17 -60 -27 -19 -20
4.71248b0K3Opj7LJ5n1K8K1l4L8n7K6K0l4J2J3mj8%K3j7k3jL3m9O4j4J4p9Q6n6M7m2J7LL1l0nK
$$ -20 3 9 2 -15 -12 3 -48 -20 1 -33 5 -52 -26 -6 -40 -28 -15 -19 -37 -37 -14 -31 -54 -55 -22 -71 -7 -21 -7 -86 0 -56 -9 -51 -34 -31 0 -30 -35 -33
4.69214c3K2J6l2OK4k5k9K5km1O6k4r%j5J5L7k6L6M6r1JJ5n2K5K4J8l5N5j9mm6L0Mk6L2j4k5K7
$$ -33 -11 5 -27 -21 3 -22 -51 -26 -28 -69 -3 -27 -36 -36 -51 -36 1 -25 11 57 -34 -33 -18 -70 -45 -21 -3 -38 17 -2 -6 -52 -22 -18 -44 -12 -26 -51 -24
4.67230b4J5j8Pk4OJ%L7kk0l4L8p6R1Mo5M2J1j2M6l8j7K8l5NJ7Ol4O3m8j0J7J0J4j6l8K0j5k3
$$ -24 -9 -27 -20 -44 -38 -37 -37 0 -2 -22 -56 -18 -94 -3 1 -64 -22 -11 -23 23 -15 -32 -4 -39 -34 -17 -11 -45 18 -30 -40 -23 -13 1 -15 -53 -33 -48 -71
4.65246g1K0K7J3j1mQm7nN1k3OL0j4J1n7L1j7L1L0j8rJ9j1m4N1%j7TRlK0K4j5l2L8o7N3J0m7J5
$$ -71 -51 -24 -11 -22 -26 -18 -65 -70 -19 -42 -36 -6 -20 -9 -66 -35 -52 -21 9 -9 -18 1 -10 -54 -3 -3 -20 -37 -28 -31 -11 13 -2 -34 4 -63 -10 0 -47 -32
4.63211c2K8j8K0j1m3L8j9OM1o1K4koj6M2m1L3o8O7J7m6K4l6N2k4K0j2L2m9N1l7Oj0%k4L1M5k7
$$ -32 -4 -22 -2 -13 -56 -18 -37 -31 10 -51 -27 -29 -35 -51 -9 -50 -17 -85 -18 -1 -47 -23 -59 -7 -31 -11 -23 9 -40 11 -26 -20 -30 -30 -54 -23 22 -5
4.61278eKJ7k7J1KJ6l1nm5L8J7j2K6ok1K6j8o4P0J4K3n6QoM4kn3L2Qm8PO1o3MJ6m7N1jmJ1j9j2
$$ -5 -3 14 -13 -2 0 16 -15 -20 -65 -27 -10 -22 4 -2 -23 3 -15 -79 -9 5 28 -28 -20 -26 18 16 -37 -5 3 -45 -38 23 -40 -36 -20 -67 -16 -17 -21 -10 -29 -41
4.59141d1l5Q0j8J4k3k1j2M8j0J4k6K5nJ2l3K6Lm7OM5l1kk9P0n8j3K8K5j3%Mk0J8j6j3K5l1J5O
$$ -41 -76 4 -14 0 -23 -44 -56 -8 -18 -4 -30 -5 -10 2 -31 -5 -2 -49 -43 2 -29 -31 -60 10 -48 -61 -33 -8 -21 -21 -17 -37 -19 -35 -48 -23 -54 -39 -33
4.57157c3K6m4L1J8n4O5k5j5%L1K1m9K0Rn3M6k5QPJ6k8l6K9L3m2k5O5n1M1j2J7o4L1P0j06N9l9
$$ -33 -7 -51 -20 -2 -56 9 -16 -31 -31 0 21 -28 -8 1 -52 -6 -31 -23 -16 0 -28 -64 -35 -2 -44 -69 -4 -55 -14 -26 -9 -73 -42 28 -78 -19 -58
4.55275e8O2k7J2l1N8J2p9K8nOj6K5jj8J5l1K5JL9m1K9m2Ql1P4m0j0N1m9J5j9L4l8M7l5O1l9l
$$ -58 4 -23 -11 -42 16 28 -51 -23 -28 -22 -38 -13 -14 -32 -17 -48 -23 -22 17 -24 5 -37 -29 -60 14 -26 -36 15 -34 -19 -38 -4 -42 5 -30 31 -8 -11
4.53342a1m9N8j4rLJ7m2P3r3M4RJ9l6mK3J5n0M3o7L3K4j7Nj3K8n8L6K2mM7n2mkK5lJm5M8q8O3l
$$ -11 -60 -2 -16 -25 -22 -5 -47 26 -67 -23 -14 5 -31 -35 -12 3 -47 -4 -71 -38 -14 -31 -26 -39 -11 -69 -33 -11 -15 32 -20 -24 -26 -1 -4 -3 -48 0 -88 -25 -28
4.51256b8Nk6J7j3qJ0Qnj5K0k2J2L3j3J1m1JM9j2K5m9%J6LJ4Plm3M5l7O5q7M6m5K4M6k7j4J7m2
$$ -28 -23 -49 -32 -45 -53 -43 -35 -40 -55 -35 -57 -45 -12 -25 -14 -55 -54 -5 -17 8 -41 -41 -25 -22 -8 -1 -4 -47 -2 -39 26 -61 -15 -60 -36 10 -17 -31 -14 -56
4.49221e6K1K3k2ML2m6N1n0M1m1L7m7K8j1Ml4K5PJ3K8l9jj9N7m2pk9M8mj2L5m8O7n2L7j2j6l0
$$ -56 -35 -12 -34 -30 2 -44 7 -43 -2 -43 -6 -53 -25 -36 -32 -66 -41 -34 -21 7 -32 -33 -52 5 -37 -44 -73 -25 -29 -41 -6 -54 13 -39 -2 -14 -30 -60
4.47288f0J7L5n8N1o9Q8l2QqQk1qK5J0J6J2k9%j5L2n9RK8k6M2l7J6ok8J6j1M0qK7m5N1n1k8N1
$$ -60 -43 -8 -66 -15 -84 4 -28 -20 -28 -20 -41 -49 -24 -14 2 14 -15 -15 -30 2 -57 -48 -20 -46 -4 -41 -25 -31 -59 -43 -54 -14 -22 5 -40 11 -40 -68 -17
4.45304a7k8L9l4N4j11L3J2J6k2O7n3J7n3P9o2K0KN3n2K0JJ8k9l3J7LlL8J9n4M2l6K5JJ7m1J4
$$ -17 -45 -6 -40 14 -97 -64 -52 -36 -58 9 -44 -27 -80 -1 -63 -43 -41 12 -40 -20 -19 -1 -30 -63 -46 -43 -46 -8 11 -43 -1 -37 -12 -11 6 -35 -21
4.43422b1K1mOk9j4L6nj7L9o1K3k9rJ7J5KK2l5J9J5j6jJ3p2P1KK3k5k4lRJ7j5L8o3M1rK2r2R6
$$ -21 0 -4 2 -27 -41 -5 -10 -27 12 -49 -26 -55 -64 -47 -32 -30 -8 -43 -24 -9 -25 -26 -13 -85 -14 -12 11 -14 -38 -41 -32 -15 -30 8 -55 -14 -23 -1 -93 3
4.41387Co5O4pM8j13Q5p4N0l8M5p1M9n4M7nlmL3J6jp2K5mJ7Lj1J5l8P2l9j1k5O6o3JJ0L0j3K4rT
$$ 3 -62 2 -5 43 -70 15 -59 -9 -47 -2 -73 -24 -78 -31 -36 -39 -43 -10 6 5 -67 -42 -46 -29 -26 -37 -22 -60 12 -27 -38 -63 3 -60 -59 -49 -19 -32 -8 -17 -26
4.39301b6Oml3K5J1lkK4kk7L2m3M5k1k0J7j1PJ2j6J9o7M0L7j8j7J0Tj2jPJ4K%k4j2L7k6l2N4o3
$$ -26 -20 -24 -57 -32 -21 -24 -26 -2 -4 -31 1 -42 3 -18 -38 -21 -32 -25 -13 -29 -10 -77 -37 0 -18 -35 -25 -15 -27 -28 -21 -7 -5 -5 -29 -41 -4 -30 -62 -8 -71
4.37216g1P9o1L7on2N5mQj0M0jn7pLPJ1lJ1m6O1l4M5m3Pj9K9Ll6J5K5oK0m6O8p7OJ4oL2k1l4M3
$$ -71 8 -53 -16 -22 -74 -19 -23 -15 -25 15 14 -43 -50 -47 -40 -29 -32 -21 -67 -6 -40 5 -38 -31 -50 -21 -18 -54 -39 -14 -20 0 -46 22 -55 -49 -35 -41 -9 -30 -64 -21
4.35079b1ol2J9K2K6o7N6m0L1k6J0j4j2K9k9JK3Nmj5lN1l0Omjj2JK3qk6oJ5J0J8lk6Ql8M0j1K5
$$ -21 -27 -59 -40 -18 8 -59 -3 -43 -12 -38 -28 -42 -54 -25 -54 -53 -30 -25 -29 -44 -47 4 -26 -20 -24 -25 -37 -36 -13 -21 -47 -53 -38 -28 -10 -13 -39 -31 -69 -29 -40 -15
4.32942a5PpOj6J3k4OjM4l1jm4L5K1l0K9k8L2p4R3p7R0p6K4K2k7K1l5J0J6j8L3l2Q2j31N4J0L2
$$ -15 -8 -15 -9 -25 -12 -36 -30 -31 13 -18 -19 -63 -28 -7 -37 -8 -36 -4 -78 15 -62 28 -48 -24 -2 -29 -8 -43 -33 -17 -35 -2 -34 48 -83 -29 -19 13
4.31009A3n4M1m1N2l6j0N5r6P6Km7K3nJ9n5K5K1Jk3J5TJl5j2L5Oo2L8klN6p5M3J8m5Mm7Q7l0k2
$$ 13 -41 0 -41 11 -25 -35 20 -76 0 2 -45 -22 -27 -8 -63 -38 -17 -16 -39 -24 -9 -8 -43 -55 -20 -14 -76 -38 -40 -43 13 -62 -19 -1 -46 -42 -89 -2 -32 -54
4.28974e4K6m2K0L8%l3K8K4l1l7l8N9M2p8O4n4O9m0nL7K1l8J5l9J7j1RJ9k5K9k8K1Tl5PJ2On1
$$ -54 -28 -70 -50 -12 -12 -45 -17 7 -24 -61 -99 -40 2 -76 -12 -66 3 -37 -42 -5 16 -22 -7 -46 -29 -40 -31 -12 -37 -8 -36 -15 6 -29 -22 -10 -4 -55
4.27041e5J3J0k8M3j8RJ4k3j9O3p4M5l0J8M0o2O2o1J4noL9j3Kk3K5l5P1q9M1O2n2l3N2k8K5qm
$$ -55 -42 -32 -60 -17 -35 -26 -12 -35 -54 9 -65 -20 -50 -32 8 -54 8 -53 -39 -44 -50 -11 -24 -22 -45 -20 -55 16 -73 -32 30 -22 -55 -3 -31 -6 -14 -18
4.25108a8m6M5l7Q0r3K2L7n2L3j2N1j0m7K8Jm7O6o7N1LK7n2lJ1j3RJ3J2l8j5K6k7J5l1O7n6O7
$$ -18 -64 -19 -56 24 -69 -47 -10 -62 -29 -41 10 0 -47 -19 -18 -65 1 -66 -15 -12 15 -37 -40 -29 -42 -33 -20 -8 -46 -61 -35 -62 -47 -78 -11 -67 0
4.23226@l4L6l6L8m2K9J2k4Rj7plJ2LK1l7L7jj0j2k1pML9l4J3M5j6l9L8k5mM6n7lJ7k2L8lJ9k0
$$ 0 -34 2 -34 4 -38 -9 3 -21 -12 -29 -36 -39 -27 -24 -3 -40 -3 -4 -14 -26 -47 -54 -50 -11 -45 -32 13 -3 -42 -4 -29 -33 13 -44 -47 -30 -52 -14 -17 2 -18
4.21140a8pj9LK9j6Ok7M6k1m0N1m3L7k0l6M1k5RJ7M7l4jL3j6j5Lk4kOJ7mj0lJ4jk3M3mk1k3L0
$$ -18 -25 -44 -41 -12 -28 -22 -49 -3 -24 -64 -13 -56 -19 -39 -75 -34 -59 -50 -33 14 -20 -21 12 -4 -19 -16 -40 -42 -36 -19 -23 -33 -36 -22 -23 -46 -3 -7 -28 -51 -21
4.19055b1j0j1PJ0Rm2mM8k6M0m3NOk4K2j9KlM8k8J8k0J6Jk0N0r0L8k7L6K2l3K5j6J2k2Pm3R2n6
$$ -21 -31 -42 -35 -25 -16 -58 -62 -14 -40 0 -43 -38 -32 -56 -34 -53 -51 -54 -6 -34 -16 -36 -20 -19 -39 11 -79 -41 -68 -32 -10 -43 -18 -34 -22 -44 -37 -80 12 -44
4.17020d4j4L0k1J0k4J6m2O7pq2P9o3Q7j3nj7LK4k1nOL0j3KL3n7POk4L1kn1J6N0l0N2p5L0mkn
$$ -44 -58 -28 -49 -39 -63 -47 -89 -22 -29 -111 -32 -95 -8 -21 -26 -43 -40 -16 -37 -42 -36 -6 -19 -17 16 -41 -34 -28 -52 -21 -23 -74 -58 -8 -38 14 -61 -31 -35 -37 -42
4.14934d2k3O2j1rm8N3o9O4LM2j8p4J6j0oN2J0ql3Ll6P3%k1mqoM0m7L8J7n6L5n0N0m7O9mk9Oj
$$ -42 -65 -3 -14 -23 -71 -18 -87 -23 -20 22 4 -70 -54 -64 -70 -18 -8 -16 -49 -46 -82 -9 -9 -30 -34 -42 -48 -8 -55 -17 0 -56 -21 -71 -21 -68 1 -3 -32 -26 -27
4.12848b7J2m0O5j7lJk0J4l7L9Om2MJ6j8K1nm2K8MJj3N7k7J6k1l2J5J7%PKJ4Km1J1K6Mk6Pn0N2
$$ -27 -15 -55 10 -7 -10 -9 -29 -15 -52 -13 -7 -49 -45 -29 -47 -26 -31 -73 -45 -41 -40 -53 4 -23 -7 -28 -60 -45 -28 -28 -21 -19 -5 -3 -44 -33 -7 -3 -29 -22 -72 -20
4.10712b0k0NJqK6K0l4Lrj5J9%n7P0j5J7j0%J7l0KrO5p5M5k3J1L7l2m9J9k6N5J3kKj6Rj3j2n1
$$ -20 -40 -35 -34 -42 -16 4 -30 -27 -36 -51 -32 -32 -89 -19 -34 -17 -27 -27 -10 -40 -38 -47 18 -57 -12 -35 -24 13 -19 -68 -49 -75 -20 -7 -9 -7 -23 -14 -27 -39 -90
4.08626i0P2j9k8O9j8Rl0rM2j5j8N1o0N3j7kJ9l8M2n5M8k2LKK0km1M9n8L5j6k9J7L6jK2Rl3k9
$$ -90 -18 -37 -65 4 -14 -5 -35 -44 -2 -17 -35 16 -44 9 -8 -10 9 -29 13 -42 6 -16 -13 -11 9 7 -34 15 -43 -8 -24 -53 -36 0 -1 21 30 -3 -32
4.06642c2O8p3M6j1L8n4M5M8r1J7j5M6OK4mR4P2L7N2Nn7M5o7p8M1%k5K6m2nN6j05K7ko8M6k3j1
$$ -32 36 -37 9 -2 36 -18 27 75 -16 1 -14 32 38 62 58 152 224 261 313 318 261 306 239 161 202 202 177 203 161 156 212 107 134 132 64 110 87 76
4.04709G6K3j5k1j8Jm2O0o2J5J8l0M3j7m6K6Tk4N6Lj8Q1L2Q5J01J59J79J37J09j2j18o7j47l1
$$ 76 99 84 63 45 46 4 64 2 17 35 5 48 31 -15 11 37 13 69 72 54 135 167 252 353 512 691 828 937 925 807 740 593 562
4.03030E62l2KLN8k5o2j6n0l1o4jk7j5k4o6J1o3m5J2o8m0l3L2pLkOk4K2qJ9k1N5J8N2O8J14R4
$$ 562 530 532 535 593 568 506 490 440 409 345 344 317 302 278 212 223 160 115 127 59 19 -14 18 11 14 12 18 -6 16 8 27 6 61 79 131 199 313 407
4.01097D07J65J72J25R3p7p0j50n9p8J9j2K4j6M8j07o4k5l3k5Tj9K8p7j6j7j04k8k0q8N0j6j7
$$ 407 572 744 869 962 885 815 665 606 528 547 535 559 543 591 484 420 395 362 337 312 293 321 244 228 211 107 79 59 -29 21 5 -12
3.99469a2J2LmL5l5jKJ1Mj7M4j9L9j8J37j0O1K6L3Nq1K7q4j7N5k7Oj8Pj8m3l8P7n8j5l1L8rk8
$$ -12 0 3 -1 34 -1 -2 0 11 15 -2 42 23 62 44 181 171 232 258 291 296 215 242 158 141 196 169 175 157 164 146 103 65 142 84 69 38 76 67 39
3.97485C9j7nm9O5r1J4Q4j06L7KO2j32O2J3MNk0kK0j0RJ0j9o8O0J3k9L3p9J00k4k6QM4l2k9j3
$$ 39 22 17 -32 33 -58 -44 40 -66 -29 -27 35 -97 -35 -22 -18 -13 -33 -35 -15 -25 -16 -6 -25 -93 -33 -20 -49 -16 -95 5 -19 -45 -37 7 -25 -54 -67
3.95603f7M9n2O4oM5p4L2l3O1k6%j5K6k1n1oP4l0J4k5L2p2J9K3j5lK3L5m6JL2k5QJ1J2l7K5l3j
$$ -67 -18 -70 -6 -12 33 -41 -9 -42 19 -7 -7 -22 4 -17 -68 -74 0 -30 -16 -41 -9 -81 -62 -39 -54 -57 -34 1 -45 -44 -12 -37 -29 -18 -6 -43 -18 -51 -52
3.93619e2M1l5LoK7k2j7k5O0n7O4loj3j0M0m2L3k5J4l4O0n0LJ5ML7k4K7k6mm0L5K5k4l0kM3j4
$$ -52 -11 -46 -43 -49 -22 -44 -61 -86 -26 -83 -19 -22 -28 -41 -51 -11 -53 -20 -45 -31 -65 -5 -55 -52 -37 -33 4 -20 7 -19 -23 -63 -28 -3 -27 -57 -59 -16 -30
3.91635c0J3j2K5k7K1l8L3lj2NTm3N7NMRj0N0k1L6LQj7M3qo4M1k4J3l8PJ0j7O8o1J5l8N3n8OK8
$$ -30 -17 -29 -4 -31 -10 -48 -15 -18 -30 -25 -20 -63 -6 -1 3 12 2 52 31 67 70 78 61 104 96 32 73 49 62 24 31 41 24 92 31 46 8 61 3 9 37
3.89549C7l7J0l2L5n0L0nKo1M7To0K1q6J27q3M1l7M9l3L2r4K8M0l2K6k8K8k2N1k3M2p4nj3K1J7
$$ 37 0 10 -22 13 -37 -7 -12 -10 -71 -24 23 -37 -16 -102 25 -58 -17 -54 -5 -38 -6 -100 -72 -32 -64 -38 -66 -38 -60 -9 -32 10 -64 -69 -82 -61 -44
3.87667d4j6O2m4J5l6j2O7n1L2Kk3K0l9J6j0L4m4N6K0o1L7k6Mk7O2n8K7k9K1j1JN4l5l6L8jj1J
$$ -44 -60 2 -42 -27 -63 -75 -8 -59 -27 -25 -48 -28 -67 -51 -61 -27 -71 -15 5 -56 -19 -45 -41 -68 -6 -64 -37 -66 -45 -56 -55 -1 -36 -72 -34 -35 -46 -45
3.85734d5rJ3l7K8M3l5J2rjL0m9J8l7N8ql4oK1oL8j6l8J6L4m6J6lToK9k0mm0K1mN3k9K5n6L5k8
$$ -45 -54 -41 -78 -50 -7 -42 -30 -39 -40 -10 -59 -41 -78 -20 -28 -62 -68 -47 -53 -15 -31 -69 -53 -19 -65 -49 -52 -55 -61 -32 -52 -56 -96 -75 -79 -26 -55 -30 -86 -51 -79
3.83648g9O9k9L5q3O5K6q9N7j3k3J0J2qj6J9L1K0o0L2KJ8l5j0L0j2J0l4K7mj0J0j9J7j2M0m4K0
$$ -79 -10 -39 -4 -87 -22 4 -85 -28 -41 -64 -54 -42 -50 -66 -47 -16 4 -56 -24 -22 -4 -39 -49 -19 -31 -21 -55 -28 -32 -42 -32 -51 -34 -46 -6 -50 -30
3.81766c0jlm4M1kj4L0k6K3l6J1J4PK5n0%j1P7p0P7q9M9L8n5K1k2L0k9qL5k5L0m8K1K4k4%M3m4
$$ -30 -31 -34 -78 -37 -39 -53 -23 -49 -26 -62 -51 -37 -30 -5 -55 -55 -66 11 -59 18 -71 -22 16 -39 -18 -40 -10 -39 -47 -12 -37 -7 -55 -34 -10 -34 -34 9 -35
3.79782c5KK1j4j2J7Jp3P0jj9rMk5J1O2j17J17p3N7n8Q2o3J8m0P4l5J2j3m4M7lPJ2o9L9oJ6qj
$$ -35 -33 -12 -26 -38 -21 -20 -93 -23 -24 -43 -52 -48 -73 -62 0 -117 0 -73 -16 -74 8 -55 -37 -77 -3 -38 -26 -39 -83 -36 -39 -32 -20 -89 -50 -56 -40 -48 -49
3.77798d9J3l3J6KJ1lj8K9lJKK0l2J3Q%q1R3m0K7l0L2l6%J5JTj4Oj9L4K1m9M2l0Rj6M2k2qK2k
$$ -49 -36 -69 -53 -51 -40 -43 -61 -32 -35 -34 -32 -12 -44 -31 -23 -23 -104 -11 -51 -24 -54 -22 -58 -58 -43 -42 -41 -55 -49 -68 -34 -13 -62 -20 -50 -41 -57 -15 -37 -45 -23 -25
3.75662b5j5kL1k0L0l9Nj5J2qJ3j4J7rJ1J8PJrK1k6kJ8j0Q4qN9K9TP0k4mp1K4l2NK3j7k6JJ6l0
$$ -25 -40 -42 -11 -31 -1 -40 -35 -50 -38 -46 -33 -47 -30 -39 -28 -10 -3 -2 -11 10 -16 -18 0 -10 74 66 125 154 183 253 229 225 154 178 146 151 174 157 131 132 148 118
3.73525A18Kn1M7p0M0k6j2Tj0o0O1j9Nl3K0k3K7%l0j4J2LK1J5o1M3K1n1L5K0k6l0j3L0r%N3r3
$$ 118 120 69 116 46 86 60 48 36 26 -34 27 8 13 -20 0 -23 4 4 -26 -40 -28 -25 -4 11 -50 -7 14 -37 -2 18 -8 -38 -51 -21 -30 -30 23 -70
3.71592g0Q7n3K5j8jm6O8nK8n1k1R7p4O7m7L3j7Pj0k5N7j7k0L4k1P8q3N2K4J3qj7lj4L6lnKM8
$$ -70 17 -36 -11 -29 -30 -76 -8 -13 15 -36 -57 40 -34 33 -14 19 2 9 -1 -26 31 14 -6 28 7 85 2 54 78 91 83 66 63 49 85 82 77 79 127
3.69608A27j0J6J3K5K0L9k3K1O2L9TRO1KR5J9J16Rj8J20M3R6P7Q9R8J22J24J10K25J41L36L45
$$ 127 117 133 146 171 191 230 207 228 290 329 368 377 438 440 535 554 670 679 661 781 824 920 997 1086 1184 1306 1430 1540 1765 1906 2242 2587
3.67980B587M80N92R20J199J731K402K937L574L539L257K839K412J170j525k494k287j610r61
$$ 2587 3067 3659 4579 5778 7509 9911 12848 16422 19961 23218 26057 28469 29639 28114 25620 23333 21723 20762
3.67064B0762m10j23Q0l50j026j329j241r26r53r17j016r75j029j037j307j290j230j148r54
$$ 20762 20352 20229 20309 19959 18933 17604 16363 15437 14484 13567 12551 11576 10547 9510 8203 6913 5683 4535 3581
3.66098C581o31m61l59k93j96j84j40j30q4q3j32m2r1m5k9o2k9m4m5K7l9n5Nn2K2l3K9q1J6l2
$$ 3581 2950 2489 2130 1837 1641 1457 1317 1187 1103 1020 888 846 755 710 681 619 590 546 501 528 489 434 439 387 409 376 405 324 340 308
3.64572C08J2Ok5m1K3l5k0J8l8O0n5rk1K2oKJQ8n7L1q3Ml5K5J7m4K3K1j5MjLn7MJ1k3N5l7k7p
$$ 308 320 326 301 260 283 248 228 246 208 268 213 204 183 205 199 201 202 290 233 264 181 185 150 175 192 148 171 192 177 181 180 183 126 130 141 118 173 136 109 102
3.62537A02J5k5qJ6j6J9k8l3M2J4kk8K2o0P0m9Q3j3l6M1n3O1j3l2O0k2O5l3J4O4k4k0M7Ro3L9
$$ 102 117 92 84 100 84 103 75 42 84 98 96 68 90 30 100 51 134 121 85 126 73 134 121 89 149 127 192 159 173 237 213 193 240 249 186 225
3.60705B25n2k1L2m9K0L4l7Nmm3L3n0K6m8J5l7N8kj2j1Nl0K2oL7J5l9Rj0Rl0kJ7l8Pj2pN5o0J9
$$ 225 173 152 184 135 155 189 152 157 153 110 143 93 119 71 86 49 107 105 93 82 87 57 79 73 110 125 86 95 85 94 64 62 79 41 48 36 29 84 24 43
3.58671D3l8L3J2k1%lK0p6O2m7N9Mj1Nm9M1l0L1kl3nMN8q5O5m8OL2k4KJ5J8n7L6j5J9l6%N7p1
$$ 43 5 38 50 29 29 26 46 -30 32 -15 44 48 37 42 -7 34 4 35 33 0 -5 -1 57 -28 37 -11 -5 27 3 5 20 38 -19 17 2 21 -15 -15 42 -29
3.56636b9K3J3k9L0K2n3M1l8N3l3L1J5o3jKM9m0L8k6k0L1k6k3N0n4M7J5n0L5l8K2%j1k0M1oJ9
$$ -29 -6 7 -22 8 30 -23 18 -20 33 0 31 46 -17 -18 -16 33 -7 31 5 -15 16 -10 -33 17 -37 10 25 -25 10 -28 -6 -6 -17 -37 4 -2 17
3.54753A7m8L2J2j3m4M5QoM0n8k3N9j2QqM1l3m2J0L6k8L2j4K0k7m1N0O3l4jk2LK8q4L3PP1o7J2
$$ 17 -31 1 13 0 -44 1 9 3 43 -15 -38 21 9 17 9 50 17 -25 -15 21 -7 25 11 31 4 -37 13 76 42 41 19 22 50 -34 -1 6 77 10 22
3.52770B2k7K0j4J3K4K2rn1MlO6r0O6o1K8J4j6Rjj3K5kk6Lqpn7O1j2L0j7J2NRm3M7njL2k6J6M
$$ 22 -5 15 1 14 38 60 51 0 4 1 67 -23 43 -18 10 24 8 17 16 3 28 26 0 3 -5 -12 -69 -8 -20 10 -7 5 10 19 -24 23 18 17 49 23 39 43
3.50633D3j4J7Nk1oj6M4k9L6o1Q2l7O2p2O8m7l1P1p0L6J8l7K0p0N8k8K0k2L4j6N6l7j9NQL4m1
$$ 43 29 46 51 30 24 8 52 23 59 -2 80 43 105 33 101 54 23 94 24 60 78 41 61 -9 49 21 41 19 53 37 93 56 37 42 50 84 43
3.48751D3M4n8L0jrJ1L2J7qLK7L1j3k9j4P6J0K2NL3M7L7mL0M0M6P2K1Q1K2R2M9R0P9J35J36P1
$$ 43 87 29 59 58 49 60 92 109 101 104 131 162 149 120 106 182 192 214 219 252 299 336 332 362 402 448 520 541 622 644 736 785 875 954 1089 1225 1296
3.46868A296J67J13J87J89K66K68M22N23O67R06J056J424J701J962K161K250K259K222J847
$$ 1296 1463 1576 1763 1952 2218 2486 2908 3431 4098 5004 6060 7484 9185 11147 13308 15558 17817 20039 21886
3.45902B1886J361Q51L48L5l91p00q41r17q02q44p75q10p19q32r40r63j027r34j051j041j098
$$ 21886 23247 24098 24446 24481 24090 23390 22549 21632 20830 19986 19211 18401 17682 16850 15910 14947 13920 12986 11935 10894 9796
3.44834I796j012j045r81r77q47p94n81o20m38l55k90k03j81p6p4j35o2r7l8j06K7j17k2p2n1
$$ 9796 8784 7739 6758 5781 4934 4140 3559 2939 2501 2146 1856 1653 1472 1396 1322 1187 1125 1028 990 884 911 794 772 700 649
3.43562F49k5o1Mo5M4k0k4n0pj3ql7L5n4k1n4K2j0j9k0K8k2k3L2k4Nl2j1%j7J1n9L4K3l3L9k9
$$ 649 624 563 567 502 546 526 502 452 445 432 424 387 422 368 347 293 315 305 286 266 294 272 249 281 257 262 230 219 219 202 213 154 188 211 178 217 188
3.41680A88J8m7J7p2N3K2m8L0rj2J2l1PlLoL2l7n4O9n8P7l5J0l3L5m3kK7m6Q1l7L1j5TJ1JL6qK
$$ 188 206 159 176 104 157 179 131 161 152 140 152 121 128 125 128 122 154 117 63 132 74 151 116 126 93 128 85 83 110 64 145 108 139 124 109 120 121 157 149 151
3.39645A51Pl9O8j1J0J4L2j3j5p4N5k6j1J9Jk8j2Kj6l2L7J2n3L5m8L6m0K7j2m5L0J7K4l2K7m4
$$ 151 158 119 187 176 186 200 232 219 204 130 185 159 148 167 168 140 128 130 114 82 119 131 78 113 65 101 61 88 76 31 61 78 102 70 97 53
3.37813E3O0m3J7k2L0m3L6k3O1o8L2p3K7j4L3KnJ6K5m2J5K3j3k1l5P0m9k6P7m2Ko2N7j1K9JJ8
$$ 53 113 70 87 65 95 52 88 65 126 58 90 17 44 30 63 65 60 76 101 59 74 97 84 63 28 98 49 23 100 58 60 -2 55 44 73 74 92
3.35931I2k5j1l8K9l5K1l6NM0J5r9J7K3K6KMlMn6K0J6j1m7R0p0jj8L2J3Rl0L4Kk8O1o1N9p8M6
$$ 92 67 56 18 47 12 33 -3 2 42 57 -42 -25 -2 24 26 30 27 31 -25 -5 11 0 -47 43 -27 -28 -46 -14 -1 8 -22 12 14 -14 47 -14 45 -33 13
3.33947A3q8N1J1lL4M3n7%k5L2Om9J8L7m5K3M0k5J3pk1L6k2L1j2j0M4n9RN7K4L7n0jM7KN7KL9
$$ 13 -75 -24 -13 -16 18 61 4 4 -21 11 17 -32 -14 23 -22 1 41 16 29 22 1 37 15 46 34 24 68 9 18 75 99 136 86 85 132 134 191 193 232
3.31963B32K1M5L7O9L9L3O2J38O7J28J42K27J65K51L28N18O67R19J226J725K049K126K045K119
$$ 232 253 298 335 404 443 476 538 676 743 871 1013 1240 1405 1656 1984 2502 3169 4088 5314 7039 9088 11214 13259 15378
3.30742A5378L365M602L684J899O66l57o24o88m87M4M87J101J521J225N72k0l15l22M0K42K16
$$ 15378 18743 23345 27029 28928 29594 29237 28613 27925 27438 27482 27969 29070 30591 31816 32388 32368 32053 31731 31771 32013 32229
3.29674C2229J01J84K50Lm11r47j551j826j970j762j553j305j186p74o49k36l59l97m36m08k62
$$ 32229 32330 32514 32764 32767 32356 31409 29858 28032 26062 24300 22747 21442 20256 19482 18833 18597 18238 17841 17405 16997 16735
3.28606A6735p75j328j111p41q38m90n41n97k27n61l52k08l95m40k23l40l60j91k86k72k54r8
$$ 16735 15960 14632 13521 12780 11942 11452 10911 10314 10087 9526 9174 8966 8571 8131 7908 7568 7208 7017 6731 6459 6205 6107
3.27487F107k93k96k64j10k62k98k95j40p9k26l42k72j06m0j01k03k81k39j26j44j48j89j86
$$ 6107 5814 5518 5254 5144 4882 4584 4289 4149 4070 3844 3502 3230 3124 3084 2983 2780 2499 2260 2134 1990 1842 1653 1467
3.26317A467l14j38k12k8j23rr0M2j31L9l7L4k8Nk8JPm3j2j1N4l5rj9L4l3O1p5J0J7L2k5K1QT
$$ 1467 1153 1015 803 775 652 643 553 595 464 503 466 500 472 477 449 450 457 414 402 391 445 410 401 382 416 383 444 369 379 396 428 403 424 432 440
3.24536D40J22l3MN8Lrj7N0nLo9RJ5k5J9r4L4nP7n8Nm7M1kq9jk8N2k6K3n3Q8oj5K5o5m2Jj6l1
$$ 440 562 529 533 591 594 585 568 618 613 616 547 556 571 546 565 471 505 500 577 519 524 477 518 516 427 426 398 450 424 447 394 482 476 461 486 421 379 380 364 333
3.22501C33k0LlM5j8n2l6J8j3k7k8M3q6K6J5l5L8k4N3o7M5k9Jk8M5m1Pk7m0P8o3O9o4K2LlOM1
$$ 333 313 316 313 358 340 288 252 270 257 230 202 245 159 185 200 165 203 179 232 165 210 181 182 154 199 158 165 138 98 176 113 182 118 140 143 140 146 187
3.20568A87n7RJ2ok7PNOj5K3l2l3L9M3l6nK4o7O0k3j2J6kL5k0m0j9L8L6j3ok7J0qRL0k2JJ6qo
$$ 187 130 139 151 145 118 125 130 136 121 144 112 79 118 161 125 120 144 77 137 114 102 118 116 151 131 91 72 110 146 133 127 100 110 102 111 141 119 120 136 128 122
3.18482A22j4K9Jj4J5K1m6J4K2m3J8L0k1jPLK1J1QL4K3L7QN7j3pK1r0LM3l9j0k5P7o4P9p3M0l3
$$ 122 108 137 138 124 139 160 114 128 150 107 125 155 134 133 140 143 164 175 183 217 240 277 285 342 329 322 343 253 256 299 260 250 225 302 238 317 244 284 251
3.16498B51J1j9lK2m5J4k8K0j7pRm9M4PkK9m5J00k0P4l5m5k2Qj7l4J9k5L1l3l8RlPK2kj8k9J8
$$ 251 262 243 240 262 217 231 203 223 206 199 208 159 203 210 208 237 192 292 272 346 311 266 244 252 235 201 220 195 226 193 155 164 161 168 190 188 170 141 159
3.14514A59j2n5M6p3k3M7Rr0O9PJ1k5kN0K4o7K2j6%m2M6kQJ2K8m7J7j9L8m7M2p5R0n4JN8k9k0
$$ 159 147 92 138 65 42 89 98 8 77 84 95 70 68 118 142 75 97 81 81 39 85 83 91 103 131 84 101 82 120 73 115 40 130 76 77 135 106 86
3.12581H6J4M1n0J4LK1l3J1M5Ok3M0JM1k3P2k2L4j7Oj5OJ5m9J8k2m6O2k3l3j5M8j0jl8rl0kK2
$$ 86 100 141 91 105 108 129 96 107 152 158 135 175 176 217 194 266 244 278 261 267 252 258 273 224 242 220 174 236 213 180 165 213 203 202 164 155 125 123 145
3.10597A45l0K8j6%l1K1N6p7N3m9J1Lk1OJ6o8M7l2M9j9l6K2L7m9K6pPRk2nk9M5j3Ml4L8l4K4n5
$$ 145 115 143 127 127 96 117 173 96 149 100 111 114 93 99 115 47 94 62 111 92 56 78 115 66 92 85 92 101 79 74 45 90 77 81 47 85 51 75 20
3.08613B0K5J3k1M4PJ7L6n1K0k9QK7j0k2J2J8J2TM8j2oO0lLK6N8n1j8mK3po7M8j9%j9qJkl8kM6
$$ 20 45 58 37 81 88 105 141 90 110 81 89 116 106 84 96 114 126 138 186 174 168 228 225 228 254 312 261 243 239 262 255 188 236 217 217 198 190 191 189 151 149 195
3.06477A95o6jp2R8p3K6jl1JQk3KK9l8L1n9J8K8m8M1ol1L5m3P5l9Oo7N3j4L2nm3L2J5L6n5J5j6
$$ 195 129 128 56 154 81 107 106 75 76 84 61 63 92 54 85 26 44 72 24 65 59 28 63 20 95 56 62 -5 48 34 66 61 18 50 65 101 46 61 45
3.04493D5M9m7LqL6m0M0l6K1K6o7L8j7J0Nl6N2l8Pj5rN8m2j3M2j3KL1l5j2K2l2N4k5nJ1K8l5K5
$$ 45 94 47 50 42 78 38 78 42 63 89 22 60 43 53 58 22 74 36 43 28 19 77 35 22 64 51 53 84 49 37 59 27 81 56 51 62 90 55 80
3.02509H0j3J1j3K9K3m3nL1ok7j1k4pO6l8QL4k8j6K4k8J5j2k7QM2m7k4P7n0Oj6jK0m6O5k9Q0o6
$$ 80 67 78 65 94 117 74 69 100 94 67 56 32 25 91 53 61 95 67 51 75 47 62 50 23 31 73 26 2 79 29 35 19 18 38 -8 57 28 108 42
3.00525D2OmK2l3m5N8K1Pl7J3JrjMJ3j5M3Mj9m3M1lQOJ6O2l7QkN8m9k2lK7J1K9j0l9l5M2j4l8
$$ 42 48 44 66 33 -12 46 67 74 37 50 51 42 41 45 58 43 86 90 71 28 69 66 74 80 96 158 121 129 127 185 136 114 111 138 149 178 168 129 94 136 122 84
2.98388H4P9o6K3m2k3k2P2n7J6l7J1TJ7k7mM1p2O9o0O5p0J0J7L3l2J9j7k3J3j6j0K9pOKn1L6L5
$$ 84 163 97 120 78 55 33 105 48 64 27 38 49 66 39 35 76 4 73 13 78 8 18 35 68 36 55 38 15 28 12 2 31 24 30 32 -19 17 52
2.96455E2jj2m7N4l8J7J3J7j9MM6o6Jj4L5j3ok2NM1m8L9J7o9J0o7J37n2J4j8L4l1J3p1J4KL7L
$$ 52 51 39 -8 46 8 25 38 55 36 40 86 20 21 7 42 29 23 1 6 47 -1 38 55 -14 -4 -71 66 14 28 10 44 13 26 -45 -31 -29 8 11
2.94522A1J5n4K8J4K4Rmj6j0j4J7l8O0n7N9n8N1k2J8j9K3J3p0R2n0Lk0M6n3N7om5N2lj8m6M3l5
$$ 11 26 -28 0 14 38 47 43 27 17 3 20 -18 42 -15 44 -14 37 15 33 14 37 50 -20 72 22 25 5 51 -2 55 49 4 56 53 35 -11 32 -3
2.92589cN8m6kK5j1k9RK4MJ2m1K8J4qK3m9LL6k5M3k5nm9M5Nj3M2j5k8jk1L7m0K5NL4m4j6L7K3
$$ -3 55 9 7 32 21 -8 1 25 29 41 0 28 42 34 57 8 11 47 22 65 40 35 -14 31 36 23 65 50 22 21 0 37 -3 22 27 61 17 1 38 61
2.90554F1m0K4J3m9L8Lm2M2l4L5p3P4k5Rk3Rj0L1ql1QJ6j6oJ8Jk3J9QnK9o4M0m8N8n4L0k9M5N
$$ 61 21 45 58 9 47 50 8 50 16 51 -22 52 27 36 13 22 12 43 35 4 12 28 12 6 24 25 2 21 29 24 53 -11 29 -19 39 -15 15 -14 31 36
2.88519C6k7j2P4k1j1j6J2j7nO8r7K0N4j0L1mm9J3lK3k2Kj5j8j1O1jk3lK1J3l0pJ9jkLJ4l7Kl8
$$ 36 9 -3 71 50 39 23 35 18 13 81 -16 4 58 48 79 75 26 39 36 59 37 39 24 6 -5 56 55 32 29 50 63 33 26 45 44 42 45 59 22 24 -14
2.86434a4L2L5J2n1Nk1L1L2nRk2l9j2M5J2j2J1k2M4k1m8M5mk6M0l3M3j6TJ5j9J2L2lj4N6k0k1
$$ -14 18 53 65 14 19 -2 29 61 56 65 43 4 -8 37 49 37 48 26 70 49 1 46 42 16 56 23 66 50 34 49 30 42 74 71 57 113 93 72
2.84500G2N8l8Q3l2M8j7j2O4Tm2j0k2rk5M2l9M9j9m1QlK2Km9lj7Krkk0pJ0k5J4J2j7lk6TJ4k7
$$ 72 130 92 175 143 191 174 162 226 290 248 238 216 207 182 224 185 234 215 174 182 179 201 203 154 151 134 136 127 125 105 98 108 83 97 109 92 89 63 37 51 24
2.82415B4j7P5k5j9K7k2K3j1j7J4k0L9o2M1J2K8l6K8n0M1k6K3Jk3K2J7m3K2K4Ol3N8l6J6l9L9R
$$ 24 7 82 57 38 65 43 66 55 38 52 32 71 9 50 62 90 54 82 32 73 47 70 71 48 70 87 44 66 90 96 63 121 85 101 62 101 110
2.80533A10QN6l9M1k6O7k7Pk5Q8n1O3j1J01L9k5O0JP2k7O1O8N5K9R7L8O9P8J72O5J14J19J65
$$ 110 118 174 135 176 150 217 190 197 172 260 209 272 261 362 401 376 436 437 509 482 543 611 666 695 792 830 899 977 1149 1214 1328 1447 1612
2.78854A612J70J37K63K68L80L84N17Q23R05J210J540J873K081K311K319K335K174J588J022
$$ 1612 1782 1919 2182 2450 2830 3214 3731 4554 5459 6669 8209 10082 12163 14474 16793 19128 21302 22890 23912
2.77887B3912N58L23k24o37q43q30q16p79p75q29p34q74q90r71r80j045j059j036j131j031
$$ 23912 24470 24793 24569 23932 23089 22259 21443 20664 19889 19060 18326 17452 16562 15591 14611 13566 12507 11471 10340 9309
2.76870I309j090j009r77r16q45o57o41m66l43l70j73k95n9j56j36q8p2j05m3q6k1p1l8k6r7O2
$$ 9309 8219 7210 6233 5317 4472 3815 3174 2708 2365 1995 1822 1527 1468 1312 1176 1088 1016 911 868 782 761 690 652 626 529 591
2.75547E91j05K2l0M0r8M9j5m1Rk7joJ4n6K8p6J4L1m4K6k1Nk2Kj9kj1qj2J7Lk2pJ1k3J8k7j8K
$$ 591 486 508 478 518 420 469 454 413 422 395 394 388 402 346 374 298 312 343 299 325 304 309 287 289 270 268 257 249 237 254 257 235 228 239 216 234 207 189 191
2.73563A91l8M4K6pm5N0k9l6N0n6O5l7J5l2J3pJ0N9n7O9l4K8l2LTJ3J9qK0J8k3K0P1p5J0K1k4
$$ 191 153 197 223 216 171 221 192 156 206 150 215 178 193 161 174 167 177 236 179 248 214 242 210 213 216 229 248 240 260 278 255 275 346 271 281 302 278
2.71681B78L3P5p3L5K7J6p7L1Mk8j0j6K3j2mj4J1j4l5kqj1K3p3M7m4J3ok0K2k5j7J6j6k2K3Nqo
$$ 278 311 386 313 348 375 391 314 345 349 321 311 295 318 306 302 288 299 285 250 248 240 229 252 179 226 182 195 189 169 191 166 149 165 149 127 150 155 147 141
2.69697A41j9J7j8J8m0L1k9L8n5M1p1M5l1K2n2M3j7lL3j0m5M9Kj7qJ3k1L1rMJ0m9J5Pk6J3J7m7
$$ 141 122 139 121 139 99 130 101 139 84 125 54 99 68 90 38 81 64 61 94 84 39 88 90 73 65 78 57 88 79 83 93 44 59 66 40 53 70 23
2.67764B3R0o3pRON3o9L1K9l0k2Qk4K6K8qn5M5k6M1n3J0o7J12o0N1k8rj6L7j5J6j2j7J3L0oj5
$$ 23 113 50 43 52 58 111 42 73 102 72 50 58 34 60 88 80 25 70 44 85 32 42 -25 87 27 78 50 41 25 62 47 63 51 34 47 77 71 56
2.65831E6K8L5o0k6L1oL4m9K8r%J9j8J7o9P3mm7M9j4j6MM1l2L0n9M3J8p3P6l7M0o9P5j3j8lrL0
$$ 56 84 119 59 33 64 58 92 43 71 62 62 81 63 80 11 84 80 33 82 68 52 56 97 65 95 36 79 97 24 100 63 103 34 109 96 78 75 66 96
2.63847I6j1J6L4k1o0K7k5N0n8J7K2qj2J1L1k8Ok7NK5l3M4n7K6k0K5o8N3m3K7qN5l6NJ8j7n7O7
$$ 96 85 101 135 114 54 81 56 106 48 65 87 79 67 78 109 81 87 60 65 90 57 101 44 70 50 75 7 60 17 44 36 91 55 60 78 61 4 71
2.61914G1j2K1l5j7K4NJ6On1L6j9J3NP5n2j0nJ5LK1m1K2l7j8J9j0J4K4j7M3n7kk0K9m7P3p9QN2
$$ 71 59 80 45 28 52 57 73 79 28 64 45 58 63 138 86 76 71 86 89 110 69 91 54 36 55 45 59 83 66 109 52 50 30 59 12 85 6 14 66
2.59930F6m3L5kj7K5j2k4J1j0k1L7Jj2oK2M0m7M6k2j4Ml0RJ6l2K2qJ7l3M3nJ0o4J9K0LK5rk4L4
$$ 66 23 58 56 39 64 52 28 39 29 8 45 46 34 28 50 90 43 89 67 53 57 27 36 52 20 42 34 51 18 61 56 66 2 21 41 44 69 60 36 70
2.57895G0L1m5j5L3k0J1j9%J3j1M3k8J6j0k6Nl0P0m4L8J6j9jN8LpM2kj1LJL7p5N2mj1KJ9Mj6k0
$$ 70 101 56 41 74 54 65 46 46 59 48 91 63 79 69 43 48 18 88 44 82 98 79 78 136 139 132 174 172 161 164 165 202 127 179 175 164 166 185 189 173 153
2.55809A53m3K4j9L1qJ2p6N5n8lJ1mk9K7k0L2j2lqnM6o0J6k1kTqj2mMoK2j7K1j8M5n9kOpkL6j4
$$ 153 110 134 115 146 138 150 74 129 71 68 79 75 46 73 53 85 73 70 62 57 103 43 59 38 36 34 26 14 10 14 8 30 13 34 16 61 2 0 6 -1 -3 33 19
2.53622A9k0J1J4M9p3M0k2k8N7l1L2k0qoj7M8k6Tk7Q5l2M5rl2j3j0L9J5kJ7qL5rK9k5K0L5Qj0
$$ 19 -1 10 24 73 0 40 18 -10 47 16 48 28 20 14 -3 45 19 -7 -34 51 19 64 55 23 10 0 39 54 52 69 61 96 87 116 91 111 146 154 144
2.51638A44n6N1K6L7%K2N2JL8J3J04J5J43J05J25J40K37K71L19M16M87K83J00oL1O2L30L07M82
$$ 144 88 139 165 202 202 224 276 277 315 328 432 447 590 695 820 960 1197 1468 1787 2203 2690 2973 3073 3067 3098 3160 3490 3797 4279
2.50162D279M90N81P53R05O86J26k68l05k3K45M00M94N79O75P43R07TJ07n82p90m72j88Q4K27
$$ 4279 4769 5350 6103 7008 7694 7820 7552 7247 7224 7469 7869 8363 8942 9617 10360 11267 12174 12281 11699 10909 10437 10249 10333 10560
2.48942A0560K11J74J75J78K11o4n57q54o42m25k57j53k20k12l01l38k99k51m59m88n38m35l07
$$ 10560 10771 10945 11120 11298 11509 11445 10888 10034 9392 8967 8710 8557 8337 8125 7824 7486 7187 6936 6477 5989 5451 5016 4709
2.47771D709k54l12k94l90m16l19l45k37k05j27k38n3k20r7j48j84j51j12j16j10k1k9n3k1l1
$$ 4709 4455 4143 3849 3459 3043 2724 2379 2142 1937 1810 1572 1519 1299 1202 1054 870 719 607 491 381 360 331 278 257 226
2.46500B26P0m3k7p9O2jj7m0J2K0J%o9O6K8l0Jm5J3K8k6MKK8o4K6j0K5Np4N5m9j1L6k7nL6j1j5
$$ 226 296 253 226 147 209 208 191 151 163 183 184 184 115 181 209 179 180 135 148 176 150 154 156 184 120 146 136 161 166 92 147 98 87 123 96 91 127 116 101
2.44516A01L7j6K6j1RpM3k6n1K0J2J4k9N2j8j6L2j9j3J7J9J7j0k6kJ6ol6K1K5L2k9nlK2k7k9N5
$$ 101 138 122 148 137 146 139 182 156 105 125 137 151 122 174 156 140 172 153 140 157 176 193 183 157 155 171 165 129 150 175 207 178 173 170 192 165 136 191
2.42583A91Jlm2M7jPTj7J0J7N0Ll7K4m4Nk6OK0j8J8l3L4o2K9j3l2k4K6Jj1k2L9m6L3k9j1k6M1j
$$ 191 192 189 147 194 193 200 207 190 200 217 267 270 233 257 213 218 192 198 218 200 218 185 219 157 186 173 141 117 143 144 133 111 150 104 137 108 97 71 112 111
2.40548A11J8m2K2M4n5J8j8J8m0Jlj1L9k4L8L9rK7qJ3K3n7k5ok8K8l2R8q5O5o7M9K0q2RJ9N1q
$$ 111 129 87 109 153 98 116 98 116 76 77 74 63 102 78 116 155 146 173 165 178 201 144 119 113 85 113 81 179 94 159 92 141 161 79 88 107 158 150
2.38615A50n1j2%m4P0q2N7m5L1K0k3K3l2J9j1l3O1n6O8o2L7K9n7J9mJ9j2mM9J4o4JMO3j7k3o2
$$ 150 99 87 87 43 113 31 88 43 74 94 71 94 62 81 70 37 98 42 110 48 85 114 57 76 72 91 79 75 124 138 74 75 79 142 125 102 40
2.36732D0O4j9K0l7M1l1k0N7n3O9q1J0j9K9k3N1k2n2N4PM2o3k5J6M3Qkn2N2l0LqM3p0L5j8L1l3
$$ 40 104 85 105 68 109 78 58 115 62 131 50 60 41 70 47 98 76 24 78 85 127 64 39 55 98 106 104 52 104 74 77 69 112 42 77 59 90 57
2.34799E7J8QLRl0k6k4K8K6rJ9k3jK9k9J4k5Pl9L7j9P%l2K7J8rJ1Tm5L3%oNml2J1J8jJ4LJl1N3
$$ 57 75 83 86 95 65 39 15 43 69 60 79 56 55 84 55 69 44 51 12 49 30 37 37 5 32 50 41 52 63 18 51 51 45 50 46 14 25 43 42 56 59 60 29 82
2.32561H2m9J4j9nO1n1J8PK7o9L5mK4l1J8k1jkj5N4j7pl0JJ8K2l5mj8M4j2Prj5L1%m7N7j7Jj8
$$ 82 33 47 28 23 84 33 51 58 85 16 51 47 71 40 58 37 36 34 19 73 56 49 19 20 38 60 25 21 3 47 35 42 33 18 49 49 2 59 42 43 25
2.30475B5K0j8L1Jk2K5j5j7M1p2M9j2m2N3j9%nk5K0J5KN4n5N0o6J4j9P7k8o7N6qJ9o3O3j3qj0%
$$ 25 45 27 58 59 37 62 47 30 71 -1 48 36 -6 47 28 28 23 -2 18 33 35 89 34 84 18 32 13 90 62 -5 51 43 62 -1 62 49 41 31 31
2.28491C1N2q3J0M2%j1k5L9k2Qj2jk6N8pk4j0nK0L3m1nL6J0Pj7L4m5K7k2L5lMjPm6NN3%jrK2l8
$$ 31 83 0 10 52 52 41 16 55 33 41 29 28 2 60 53 29 19 14 34 67 26 21 57 67 74 57 91 46 73 51 86 83 87 86 93 47 52 105 105 104 95 117 79
2.26304G9K6j7J1K6mjkl2K3m9K8J1K2q0K6j3JJ2MJ7J5l4qNM3r1O7l3j5J4JmK9q5L0M2l7KpL2m0
$$ 79 105 88 99 125 121 120 118 86 109 60 88 99 121 41 67 54 55 67 71 88 103 69 61 66 109 18 85 52 37 51 52 48 77 -8 22 64 27 29 22 54 14
2.24218A4LJ2k4J9L1l2Lk0k5PM3k2rO8l7j6L9m4K0K2l9J7k5M7l8PL6j2l7j0J5M2mk4j0K7Jl8j8
$$ 14 17 29 5 24 55 23 26 6 -19 -12 31 9 0 68 31 15 54 10 30 52 13 30 5 52 14 21 57 45 8 -2 13 55 51 27 17 44 45 7 -11
2.22234a1O1m3rJ0L6l0J5k9L1j5qL8m8M4k5L0n5M6pk3M1l3K3j1j0pK1k8lkK2n4Q0l5O1m9K7n1N
$$ -11 50 7 -2 8 44 14 29 0 31 16 8 46 -2 42 17 47 -8 38 31 8 49 16 39 28 18 11 32 4 1 -1 21 -33 47 12 73 24 51 0 5
2.20250EoK6j9k3L8%j9L2L0n4j6K8m3Q1mJ1n8%K7j5J1rK9p0Q2kPn1K1l3N5l3mrJOJ3l1P1k6m7
$$ 5 -1 25 6 -17 21 21 2 34 64 10 -6 22 -21 60 56 67 9 9 36 21 32 23 52 -18 64 62 69 18 39 6 61 28 24 15 16 22 35 4 75 49 2
2.18164BK0kk0Mj3lL1J3m1K9J9o0J4M5l0L4m9L4rN4l0jlj5TJ6m7M8kJ1%JNl5nL7M6p9j9j0MM3
$$ 2 22 20 0 4 -9 -12 19 32 -9 20 39 -21 -7 38 8 42 -7 27 18 72 42 41 38 23 8 24 -23 25 23 34 34 35 40 5 0 37 83 4 -15 -25 -21 22
2.16028B2M2%p1Rj3N2j5mj9K0k3K7nJ1jn8M3L0o2L9n8L8j4J8j1K6j0m6P0m2M5r1O7k5J5M1ll8
$$ 22 64 64 -7 2 -11 41 26 22 3 23 0 27 22 33 32 -26 17 47 -15 24 -34 4 -10 8 -3 23 13 -33 37 -5 40 -51 16 -9 6 47 44 6
2.14095Fj5K0j4L4l9L6k2mN4m4j3L4p3Q7l5M7k2k7k8O4m3L1n4OL5N0j4p3L8M1j5Tk4l3L6PRk5
$$ 6 -9 11 -3 31 -8 28 6 2 56 12 -1 33 -40 47 12 59 37 10 -18 46 3 34 -20 -14 21 71 57 -16 22 63 48 33 9 -24 12 19 28 3
2.12162CM5k4Nk3J6K6l0pJ8mj0K7J1m2OJPj3kRJ2j4J5Pk4J6n5L5K5nk1M2%n9KJ8L4n3O7j3n8O4
$$ 3 48 24 29 6 22 48 18 11 29 25 15 42 53 11 17 18 25 12 10 19 31 17 32 39 15 31 -24 11 36 31 10 52 52 -7 -5 13 47 -6 61 48 -10 54
2.10025E4q7R2m1K2l2L4m0NM4m6K5K0m8Oj1M7m4L5j6K1j7k2M4k8j7l4P3o6R0n5PJ9k8K4m4L7q6
$$ 54 -33 59 18 40 8 42 2 7 51 5 30 50 2 8 -3 44 0 35 19 40 23 1 45 17 0 -34 39 -27 63 8 15 34 6 30 -14 23 -63
2.08143f3O3J4%NKJ4n1N2L7o4m1N4rqL1Nm2J6J0J2m4PK1k0K3K4p0M2j6KK0j7M2k2J8k0ll0N8l0
$$ -63 0 14 14 19 21 35 -16 36 73 9 -32 22 13 5 36 41 -1 15 25 37 -7 0 21 1 24 48 -22 20 4 6 26 9 51 29 47 27 24 -6 52 22
2.06108B2j8K7nJpM0j6k1jL8o3K7l2pJ1J3N0n6J9K9n8K7lnm4J34j12O7m3K6m0K6M6k9m7O1o6K9
$$ 22 4 31 26 27 20 60 44 23 22 60 -3 24 -8 -15 -4 9 59 3 22 51 -7 20 17 12 -32 102 -10 57 14 40 0 26 72 43 -4 57 -9 20
2.04175B0rl1L4j3L6n0Q1n9K0m3M0k0K2l2lL0j4K2m8O8l6J8m4N9m8O3j08Q8j2j7L4m6K1J6J8r7
$$ 20 11 -20 14 1 37 -13 68 9 29 -14 26 6 28 -4 -7 23 9 31 -17 51 15 33 -11 48 0 63 -45 43 31 14 48 2 23 39 57 -40
2.02344d0M8pQK5k4k2L8K2n6j3K9L0ok7jRLJ4k7l6J2L1J2J6o4j8O8l9J3k5L0J0knRK9l6K8Nl1
$$ -40 8 1 9 34 10 -12 26 48 -8 -21 8 38 32 5 4 13 16 30 3 -33 -21 10 22 38 -26 -44 24 -15 -2 -27 3 13 11 6 15 44 8 36 41 10
2.00309A0J7m4ON5n3K5K8j6pq1Q3J8l9M2l7P3l6Q%l8O8qJ9n3OK5L4J8L0m4K2m3J9K1RKN8rP9K2
$$ 10 27 -17 -11 44 -9 16 44 28 21 -60 23 41 2 44 7 80 44 52 52 14 82 74 93 40 46 71 105 123 153 109 131 88 107 128 137 139 197 188 267 289
1.98274B89J54J48K01K38K55N98J028J258J20p88r47k90j48K62J51K39Q3j58l14k76r6l6r4j33
$$ 289 443 591 792 1030 1285 1883 2911 4169 4289 3501 2554 2264 2116 2378 2529 2768 2851 2693 2379 2103 2007 1971 1877 1744
1.97053A744r8r9j47k05j74k59k32j78r7m4p3On6K5j0j9k8J2LK4k3nK0o9K6L0lm9M5o3N1Ll9K8r
$$ 1744 1646 1547 1400 1195 1021 762 530 352 255 211 138 144 88 113 103 84 56 68 71 95 72 67 87 18 44 74 71 22 67 4 55 58 19 47 38
1.95272C8QJ2n3M1oJ2oJ1l5K7j1nJ1nQ1q0l9L2K2j3j6k9M5m4J8lj7TK1J8l5O6j7k5L8L0n1kj7J
$$ 38 46 58 5 46 40 52 46 57 22 49 38 33 44 39 120 40 1 33 55 42 26 -3 42 -2 16 13 -4 -21 0 18 -17 49 32 7 45 75 24 22 5 6
1.93238FJ8L5Kj5l4M3o4M6k4k8k1N7n3J01m7K8m4QoJ4j2P3m8l9J0L4k6NkM6k2k5N5m4KL1l8NK7
$$ 6 24 59 61 46 12 55 -9 37 13 -15 -36 21 -32 69 22 50 6 14 8 22 10 83 35 -4 6 40 14 19 17 63 41 16 71 27 29 60 22 27 54
1.91254E4l4J7Lm0L3k4j1L6J8Tq2L6J4lL2l0J0pk4Mj0N3n1L1l5RM5k1l0J0k2KJ8j1On8M4j6P3l7
$$ 54 20 37 40 0 33 9 -2 34 52 70 -12 24 38 35 67 37 47 40 16 20 10 63 12 43 8 17 62 41 11 21 -1 1 19 8 14 -44 0 -16 57 20
1.89219B0K6K2q8K7k8M1J3ml7J6J3j9M0l3j9N4k3JTK2Qk8j7N2l1l6j3M6PmJ8m1qQ6o3J7jK0l0K0
$$ 20 46 68 -20 7 -21 20 33 29 -8 8 21 2 42 9 -10 44 21 22 23 45 53 25 8 60 29 -7 -20 26 33 29 47 6 -2 84 21 38 37 57 27 47
1.87184D7l9M2j8Jj6TL1k7J5K6Koj3K1k7L1K6j9l9Kpm9K7K1J0m2M3m5O3j5K2m1L3l6lO8j8l2L0
$$ 47 8 50 32 33 17 1 32 5 20 46 48 42 29 50 23 54 80 61 22 24 17 -32 -5 16 26 -16 27 -18 45 30 52 11 44 8 5 73 55 23 53
1.85200E3K8l2n7N5l9kK0Rj9L6o5O4Mp0K1L7l3mJ3mN2o6O5j07N7J3%nJ4J6j3oj8J6l1L2l8lM8j0
$$ 53 81 49 -8 47 8 6 26 35 16 52 -13 51 55 -15 6 43 10 6 19 15 67 1 66 -41 16 29 29 24 38 54 41 35 17 33 2 34 -4 -7 41 31
1.83165C1mj6K5ljk2M5n2jL1m0K9J4l3%J5n6M3K2kk1m0Q9p0J5J9%K3n2M6l6K8j7rj8M2l0J1K6M4
$$ 31 27 11 36 33 32 10 55 3 2 33 -7 22 36 3 3 18 -38 5 27 25 4 -36 53 -17 -2 17 17 40 -12 34 -2 26 9 0 -18 24 -6 5 31 75
1.81130G5p4L3l7K2nJ9KRo0P4n7M9l9k1N1o8K7J5%M6n4J6j2N0o1l1L5L3k4j8j3QN7lm7K1l3K2pl
$$ 75 1 34 -3 19 14 33 35 44 -16 58 1 50 11 -10 41 -27 0 15 15 61 7 23 11 61 0 -31 4 37 13 -5 -18 -10 47 44 -3 18 -15 7 0 -3
1.79095cJ6k2M0o6M3mk0MmM0l8M8k6PTLj2KK3J8k1Rl2J8m6K4J1L7r1K3J2L7l7k8K4M1l0J1j7Nj6
$$ -3 13 -9 31 -35 8 4 -16 -12 -16 24 -14 34 8 15 22 25 13 15 38 56 35 44 12 30 -16 8 19 56 -35 -12 0 37 0 -28 -4 37 7 18 1 6 -10
1.77010a0K3J3k5J8l2M7m9K6m5N7ok3L4k0jL2J7l8N6l5o4N0k1N1k3kPk0K2Oj9L2l2l%M5m8m0L1k
$$ -10 13 26 1 19 -13 34 -15 11 -34 23 17 -6 28 8 7 39 56 18 74 39 -25 25 4 55 32 30 37 17 39 45 26 58 26 23 23 68 20 -20 11 9
1.74975Ij9J0Pj1K1j7O3m7%m4L4K8Qm0Nj6P0m9k0nL3OM2n6Nk0NN3m8K3nk%j1k2K0k3rN2Ok4K0p3
$$ 9 -10 0 7 -4 17 0 63 16 16 -28 6 34 42 2 7 -9 61 12 -8 -13 20 26 68 12 17 -3 2 55 7 30 25 23 23 12 -10 10 -13 -22 30 36 12 32 -41
1.72787d1O8n9N4k1K0l0K2j5J9K7p2O1p2Q5n4M0J2l2J9k6K9l5N6o2L9m2mK1k6PM2ok8QoJ0M1m4j
$$ -41 27 -32 22 1 21 -9 13 -2 17 44 -28 33 -39 46 -8 32 44 12 31 5 34 -1 55 -7 32 -10 -14 7 -19 -12 30 24 -4 4 -2 8 49 5 4
1.70803Dm8L5QOM0j4mK0n1pM3l1k0O1m4QoKO3m5k0jl0J4j0P1oK1m5j3L0k4Oj1K0lmk4K7l9K6o1
$$ 4 -44 -9 -1 5 45 31 27 47 -4 -11 32 1 -19 42 -2 6 0 2 65 20 0 -1 -31 -17 -27 44 38 59 14 1 31 7 13 2 22 19 15 -9 18 -21 5 -56
1.68667e6J08j5k2j7L3rl4J2K6%k7K5k6KJ7Mj2l7j8N6j0j8M1k6k7M3nPl6J9j9M7j3jp0O4K1j6l0
$$ -56 52 37 15 -2 31 22 -12 0 26 26 -1 24 -2 0 17 21 9 -28 -46 10 0 -18 23 -3 -30 13 8 15 -21 -2 -21 26 13 12 -58 6 27 11 -19
1.66683a9PM8j6n2K8j8L4K2nk3j2L8l7M9k8Jk2K5k3MQqK0j6J5Rj7nL3k4j7j5P9j8k8Ll1K8j3K6
$$ -19 -12 36 20 -32 -4 -22 12 34 29 6 -6 32 -5 44 16 17 -5 20 -3 1 9 1 21 5 20 29 12 7 40 16 -1 -16 63 45 17 20 -11 17 4 30
1.64648C0k1K1nj7L3q5J9l4P4JJ2l9O1k2k1j2j3M2l3mk9N9j6K4K9p4j2j7Q0l4k5L7%lJ3j4jM0p4
$$ 30 9 30 25 8 41 -44 -25 -59 15 16 28 -11 50 28 7 -5 -18 24 -9 -13 -42 17 1 25 54 -20 -32 -49 31 -3 -28 9 9 6 19 5 4 44 -30
1.62664c0M4k7J2JpK2Llj2LK0k0K4j8kL1k2j9Nk6N2oJ7k2m9K9mL7k2j1pL0o0P7l9j3K7Ok1jlK3
$$ -30 14 -13 -1 0 -7 15 18 15 3 6 26 6 30 12 10 41 19 0 5 -21 31 25 42 20 -29 0 -4 33 11 0 -7 23 -37 40 1 -12 15 21 0 -1 -4 19
1.60527A9j6K7j5m2O6j3m0M1l0J8MK7k0K8n9rM8k2KN0j5n1L9j7j2J2Ok8O0q3L7Mkk2JM7ql7L4j4
$$ 19 3 30 15 -27 39 26 -14 27 -3 15 19 46 26 54 -5 -14 34 12 14 64 49 -2 37 20 8 20 26 -2 58 -25 12 16 14 -8 -7 40 32 -5 29 15
1.58493A5l5J0K2p2J43q4Pl0oL3oL0l2N2o2O2q9O9j2ONj6Nj6O0r8Q8n7K6j8k8N6%m0L4J1rPj5j6
$$ 15 -20 -10 12 -60 83 -1 6 -24 -30 3 -3 27 -5 47 -15 47 -42 27 15 21 26 10 15 -1 59 -39 49 -8 18 0 -28 28 28 -12 22 33 24 31 16 0
1.56458@J8K1m2J2J4k2j0pM0m7Q1r7Q9p0J7K5k6L6n0J2OJ2j7lK7m8M0NTn6P8j7j4pK1j5J9kl4K1
$$ 0 18 39 -3 9 23 1 -9 -16 24 -23 58 -39 50 -20 -3 22 -4 32 -18 -6 0 12 -5 -8 19 -29 11 16 21 -35 43 26 12 5 26 11 30 28 -6 15
1.54423A5j3K6p5M7KM1k8nK7l8j1J7J8k3PJ1Qq2N7M9m3TjM9pll4J7MJP1o7rJ5k1K1K7l3K6l4M6
$$ 15 2 28 -47 0 2 43 15 10 37 -1 -12 5 23 0 7 18 26 -56 1 50 7 -36 -37 12 5 2 -32 -15 -11 -10 61 -6 -15 0 -21 0 27 -6 20 -14 32
1.52337C2J1l5K7j7L8q4K7PJ4m5N0p6M7N0q4O2k0MLPJ8m9J0K8k9k3J7j4O9k2pl1L2k1M4j7j2K1
$$ 32 43 8 35 18 56 -28 -1 6 20 -25 25 -51 -4 46 -38 24 4 8 11 18 36 -13 -3 25 -4 -27 -10 -24 45 23 16 -15 17 -4 40 23 11 32
1.50404C2k8k5J7OL0k1m4J9R8o2M8q7M4o2P5n4N0j4l1JpL2j3K1j7M5j7m1Oj7K5J6j6pPJ4Nl4k7
$$ 32 4 -21 -4 2 32 11 -33 -14 84 22 70 -17 27 -35 40 -14 36 22 -9 -8 -15 17 4 25 8 53 36 -5 1 -16 9 25 9 2 9 23 28 -6 -33
1.48420c3L1J2L6n5qK7j8K1JKL2l3j0J6KjNo2O6q1R3n3L9kk9PTj4m4K1%L4%om9O2j6K1l1M7o4N4
$$ -33 -2 10 46 -9 -17 10 -8 13 14 16 48 15 5 21 23 22 27 -35 31 -50 43 -10 29 27 -2 5 12 -2 -46 -25 -25 9 9 3 -46 16 0 21 -10 37 -27 27
1.46284B7k9O6m9Mk5jL1j7l5K6Rm1R3l3k4K5k4L8l6K6n4rM4m0L0k1L3%l9L9j9k8K6pOJ3JPM6m5
$$ 27 -2 64 15 19 -6 -7 24 7 -28 -2 7 -34 59 26 2 27 3 41 5 31 -23 -32 12 -28 2 -19 14 14 -25 14 -5 -33 -7 -14 -8 5 6 13 59 14
1.44249A4K1j2m3N1m8L3l6M5J6k6J4j4j7lJ1m9J00o1MNj9J1M5k3j3kJ2RQk9pJ5m5L6MJ8Rk9rJ1
$$ 14 35 23 -20 31 -17 16 -20 25 41 15 29 15 -2 -5 6 -43 57 -4 0 5 -14 -3 42 19 6 4 16 25 33 4 -3 12 -33 3 7 25 34 5 -4 7
1.42214Gl9K1j7L1lJ0K8n9J6nL3K5l1J3l1Pj3K2l0Q1m7m0K0OM6k5pj9L2l9k0K2mj0J5L6k1J2j2
$$ 7 -32 -11 -28 3 0 10 38 -21 -5 -10 23 48 17 30 -1 6 -7 15 -15 66 19 -21 -1 5 51 26 19 0 32 -7 -27 -5 -9 -19 -4 32 11 23 11
1.40230A1j4k8M8j2Nj1M4pk6oJ0Mnj5K2m5L8n7R9m5K6l0NL1l6J9l5K5j1K4k1lOL6n9L0k6Q3l6o2
$$ 11 -3 -31 17 5 10 -1 43 36 10 4 14 18 13 -2 20 -25 13 -44 55 10 36 6 11 42 6 25 -10 15 4 28 7 4 10 46 -13 17 -9 74 38 -24
1.38195b4K1L2k8kL0o1N3L1j9j6NJpRk5K7m2L2J3qTn8MR7n2J3o6J01l0j2prK1kJ2l3K2l4J0N6n9
$$ -24 -3 29 1 -1 29 -32 21 52 33 17 22 23 16 25 0 27 -15 17 30 22 14 -44 -40 57 5 18 -48 53 23 11 4 -5 16 14 26 -7 15 -19 -9 47 -12
1.36109a2QmPpJ8J7k2Ml0K2%Rl3J6T%M2o7M0m7P4o1j5J8m8O9l4J6K5L3o7K3k5L3Rm4N5m4M8k7K9
$$ -12 -4 -8 -1 -8 10 27 5 9 -21 1 1 10 -23 -7 9 9 51 -16 24 -23 51 -10 -25 -7 -55 14 -20 -4 21 54 -13 10 -15 18 27 -17 38 -6 42 15 44
1.34024D4p7M8Kn2J3L6K1l3K8oj2j8N3m4K0pJ7m1K9m5K0Rj6L2j0M0m9M5m7Ljlj8J2J1q2R4lNoj3
$$ 44 -33 15 17 -35 -22 14 35 2 30 24 12 -6 47 3 23 16 33 -8 21 -24 -4 5 -11 21 11 51 2 47 0 3 2 -1 -19 -7 4 -78 16 13 18 12 -1
1.31938aJ1Pl6qj8N0mL8n4J8L8n2K6k8ML1l4N0k2K4q3K1j8J13r4O4n9jJ3lM3m1L6lk7K7n2OJ7M9
$$ -1 10 17 -19 -27 -45 5 1 39 -15 3 41 -11 15 -13 -9 22 -12 38 16 40 -43 -22 -40 73 -21 43 -16 -17 -4 -7 36 -5 31 28 1 28 -24 -18 -1 48
1.29903D8oLTm2k5J2L4l2N3m6%mM5k5K7m3LN7l0M3q7K7J7Tm0L0Pm5L9k7L7Nq1O7m5O1m8J1PM0l7
$$ 48 42 45 48 6 -19 -7 27 -5 48 2 2 -2 43 18 45 2 5 62 32 75 -12 15 32 49 9 39 46 1 40 13 50 55 -26 41 -4 57 9 20 27 67 30
1.27817C0nL1q6O2m0O7l6LnJ7l9J5PL5j6kk7L0l6N9%l7Rm5N0k6O1l9k7oM7l2K6KOl1L2jmpM2q4
$$ 30 25 56 -30 32 -8 59 23 26 21 38 -1 14 21 56 40 38 11 41 5 64 64 27 36 -9 41 15 76 37 10 4 51 19 45 47 53 22 54 53 49 42 84 0
1.25681@J05m0k6pK9k4K5LNk7rkJ6Tk4Mj3L6j1RJTKoNK8k4J5n6K5KjK4j5k7O6j1m2J05o9kJ3L2
$$ 0 105 65 39 32 61 37 62 65 70 43 34 32 48 64 40 44 31 67 56 65 66 67 69 63 68 96 72 87 31 56 58 57 81 66 39 105 94 52 157 88 86 99 131
1.23493A31m4K2rN0l9K4n7L5o%Lj4M1m7k7O2j0J3k7M6l8k2M2j0k1l2L8m1O5l4JO1r2R7j15N6o0
$$ 131 87 109 100 150 111 135 78 113 107 107 110 96 137 90 63 125 115 128 101 147 109 87 129 119 98 66 104 63 128 94 95 156 64 161 46 102 42
1.21611D2N8Nk8N1l3jj8K8l4J2m4K7MP6l1Km1N0n5L5n2K3m7J5L6k7J1J9Ljk1L0J0p7P5l5k7K6K1
$$ 42 100 105 77 128 95 94 76 104 70 82 38 65 69 145 114 116 75 125 70 105 53 76 29 44 80 53 64 83 86 85 64 94 104 27 102 67 40 66 87
1.19627H7j1%Nk4N1QNR8R7J22K13J70L00R5j99j63j73o9QN0J1mN5m7j08n5l0%m4l4j5o4j3j1n5
$$ 87 76 76 81 57 108 116 121 219 316 438 651 821 1121 1216 1017 854 681 612 620 670 681 677 732 685 577 522 492 492 448 414 399 335 322 311 256
1.17847B56p3j2j13P2k8j2l7K8Kj3L7K2j5k7N0M4jN7R0J07J53L60L78M99N92j53m59l76j72o4N
$$ 256 183 171 58 130 102 90 53 81 83 70 107 129 114 87 137 181 180 237 327 434 587 947 1325 1824 2416 2263 1804 1428 1256 1192 1197
1.16270A197l1P5J00m5j12k31k7qk7m7p4p3k7q3q2j21j07n1o1k2j7l9L9j8ln5O4Km4PL4K8TJ5O2
$$ 1197 1166 1241 1341 1296 1184 953 926 918 891 844 770 697 670 587 505 384 277 226 165 143 126 87 126 108 105 50 114 116 72 79 113 141 169 184 246
1.14489B46N3J89J02K19K37K21j68j98j53j32L0RK7j0O1m0p2q7mK1m7q7P1j36K3q4k6o0l1o5Jj
$$ 246 299 488 590 809 1046 1267 1099 901 748 616 646 655 682 672 733 693 621 534 530 551 504 417 488 352 375 291 265 205 174 109 110 109
1.12861A09m5Pkj6J0mPJ2k9J2L1o2L8l3%k2K0jk1N8p5L1oL3m1L2l6LJ0Ql2L0n4M2KQl6P1k6J7K3
$$ 109 64 71 69 53 63 59 66 78 49 61 92 30 68 35 35 13 33 32 11 69 -6 25 19 52 11 43 7 10 20 28 -4 26 -28 14 16 24 -12 59 33 50 73
1.10776G3n5Ql3L2k7NN8k9KK6k0RLK6l9o%J5L7m9m8L8J7k3NkL2n9M8k2Ol5K5Pq%oL5j3j9QrL6q
$$ 73 18 26 -7 25 -2 3 61 32 34 60 40 49 52 78 39 33 33 48 85 36 -12 26 43 20 25 23 55 -4 44 22 28 -7 18 25 17 17 11 46 33 14 22 13 49 41
1.08537D1l0lJ9k6O0m6J4k2M4l7J0M1l5Jj4L9j2K8p2K8N0n9M6n8K2M7n6L5o3J10j13L2j8N6l9L2
$$ 41 11 8 27 1 61 15 29 7 51 14 24 65 30 31 17 56 44 72 0 28 78 19 65 7 29 76 20 55 -8 102 -11 21 3 59 20 52
1.06706E2j6j1loK2m1N3m2rMK5J8qk2K6n0O0n5LOJ5K3pMl7j7O9l2K2k5j4K4kk2K0NN4n4J2m4rM6
$$ 52 36 25 22 16 38 -3 50 8 -1 3 28 46 38 16 42 -8 52 -3 0 6 21 44 37 41 4 -13 56 24 46 21 7 31 29 7 27 32 86 32 44 0 -9 37
1.04569C7j0L1k4j2K3n%l8K2pJj1J7QJ6j7ql3ML5J6m0K1%k8rL9l2K8ljl9M0K3m7M6l5K9M5p9k6
$$ 37 27 58 34 22 45 40 40 2 24 17 18 7 24 32 48 31 23 -10 -6 29 45 5 26 26 -2 -11 28 -4 24 21 20 -19 21 44 -3 43 8 37 82 3 -23
1.02484b3P5j3km7N3p8L6J9K0j8J5L7n0j7j8K4k7L9j9J5j2K0k0QK2k1kj2qM7o2N0rK4m5K8k9N4
$$ -23 52 39 37 -10 43 -35 1 20 40 22 37 74 24 7 -11 13 -14 25 6 21 9 29 9 17 39 18 16 4 -4 43 -19 31 22 46 1 29 0 54
1.00550E4n4M1l9K0j6K3l2O9m1L5j04Q8o2N0NJ7pm4rJ7M7k1M8k5l9NL2k6ok9jJ5O%j2LK1m2N8m7
$$ 54 0 41 2 22 6 29 -3 66 25 60 -44 44 -18 32 37 54 47 3 -6 11 58 37 85 60 21 26 58 32 26 -3 -4 11 17 17 5 8 29 -13 45 -2
0.98516bj1N3l6M6o7L4n1K2j4K6J8jpJj9J0L7l7J5M6m3J5LMn4j8P4k2N0n6Qj3M9n5J2n0P9qj5M3
$$ -2 -13 40 4 50 -17 17 -34 -12 -26 0 18 17 10 11 -8 2 39 2 17 63 20 35 38 42 -12 -30 44 22 72 16 24 11 60 5 17 -33 46 38 23 66
0.96481F6n5O8q8nK3J6J1o2M7m1N8l8K0k6J8l3K6krL3m3J7rM3j6Jj2qL2p0L3K0l5N1m9M7J4m7p
$$ 66 11 79 -9 -14 9 25 36 -26 21 -20 38 0 20 -6 12 -21 5 3 -6 27 -16 1 -8 35 19 20 8 0 32 -38 -5 15 -20 31 -18 29 43 -4 -11
0.94497a1M3j5K7j5Jm7N5kQ8o1M7Oj3j4K1m3j4J8N3m8J8Qo2J6J1J2m0l9N4Jj6j4J3J8m2K1lJ4r
$$ -11 32 17 44 29 30 -17 38 36 124 63 110 116 103 89 110 67 53 71 124 76 94 102 40 56 67 79 39 0 54 55 39 25 38 56 14 35 32 46 37
0.92513C7K6m8J9Rj4k0k2O7l1J0J3J9Rp2Q1J6O4J3L3L0k7qRq5mM4m8K0pJ3n7lJ1J2l3N4o2J3O5
$$ 37 63 15 34 43 29 9 -13 54 23 33 46 65 74 2 83 99 163 176 209 239 212 204 213 128 124 168 120 140 133 146 89 86 97 109 76 130 68 81 146
0.90529A46r5j9PL9r8N1j0lK3lK0k3j8noK8j7K6p8N1JM1J4j0J3RK3TK9l8k9TrK3k0J4K9l7m2N2
$$ 146 51 32 39 78 -20 31 21 18 41 38 58 35 17 12 6 34 17 43 -35 16 17 58 72 62 75 84 107 130 159 121 92 63 54 77 57 71 100 63 21 73
0.88494G3l9Rok5M4m6N4J9q8M7m2J0J1K9m5K1k3M7n2K5MrJ4j4lJ6O3p6RlK9m9L2K2l3O5o1K3j6N
$$ 73 34 43 37 12 56 10 64 83 -5 42 0 10 21 50 5 26 3 50 -2 23 27 18 32 18 15 31 94 18 27 24 53 4 36 58 25 90 29 52 36 41
0.86459D1J0M1q1O4m0J4k5nJ1K0mJ9l2Jk3J7N9k7rnJ9j7j6N7ol8L2k4J3j4RK6nMM8k0Rm7M6m5%
$$ 41 51 92 11 75 35 49 24 19 30 50 46 65 33 34 11 28 87 60 51 46 65 48 32 89 83 45 77 53 66 52 61 87 82 86 134 114 123 76 122 77 77
0.84373G7M1qLn6L3L7j4lm6L3rj2PJ7m1j4P8n1k2J8j8l3J0j3J0TM4l0j2K9L0o8O4m0L1j1l4K3J1
$$ 77 118 110 113 57 90 127 113 110 64 97 88 76 83 100 59 45 123 72 50 68 50 17 27 14 24 34 78 48 36 65 95 27 91 51 82 71 37 60 71
0.82389G1J2m9L8k5J6k3TR6n6l3L8m9L3L5mn1K9N2n8K0l2m%j6K3Lj%qk5K6k4N7k5l2nJ1j1J9Rl8
$$ 71 83 34 72 47 63 40 17 113 57 24 62 13 46 81 77 26 55 107 49 69 37 33 33 17 40 43 42 42 34 9 35 11 68 43 11 6 17 6 25 34 -4
0.80304dK1J4n4L3j0%M2j7l4QJ5mk7j7M7jl4M0L7o8mj3O2lm4J7J1m2M8K7m9l3L0K5rK3k3K2j6P
$$ -4 17 31 -23 10 0 0 42 25 -9 -1 14 10 -17 -34 13 12 -22 18 55 -13 -17 -30 32 29 -15 2 13 -29 19 46 -3 -36 -6 19 10 33 10 32 16 23
0.78269B3j4j0j1L0ok0jk4L3%K9p1L8LJ0j8K1j4L2j5o1Q1l9J8J0k0L3k9L3j6l8j8J8O3n8j0qK2
$$ 23 9 -1 -12 18 12 -8 -9 -33 0 0 29 -42 -4 -1 9 -9 12 -2 30 15 -46 35 -4 14 24 4 37 8 41 25 -13 -31 -13 50 -8 -18 -26 -4
0.76336dj1M1nRj7o3M8n1M1L7k4j5J3L2Qk5nj6N0l2j6k5K9JMJ0K0o1L7p2K2LM8l0K3l8L9k2J4L2
$$ -4 -15 26 21 30 13 -50 -2 -53 -12 25 1 -14 -1 31 39 14 9 -7 43 11 -5 -30 -1 0 4 14 34 -27 10 -62 -40 -37 11 -19 4 -34 5 -17 -3 29
0.74301B9j2Ol0oj3M3nrK5l8L0o7M4l3O2k8M0j13P7j8J6k0L4k2NLM9n6kl5J03l8k8lJ2PmJ6o4L5
$$ 29 17 23 -7 -13 -26 17 12 3 28 -10 20 -47 -3 -36 26 -2 38 -75 2 -16 0 -20 14 -8 -3 0 49 -7 -9 -44 59 21 -7 -10 2 9 5 21 -43 -8
0.72266hK6n3N7j6N0q7K8K7m3l3N7J5l4jNj7M3j9k4N1l0Qm1P1n1L8n1L2lL0npm0P6k4kp1Q0p3N8
$$ -8 18 -35 22 6 56 -31 -3 24 -19 -52 5 20 -14 -15 -10 -27 16 -3 -27 24 -6 2 -39 32 -19 19 -32 0 -3 27 22 15 -25 51 27 25 -46 34 -39 19
0.70231A9o7L7pmM1pk2j3QL1j9J7j4k8KM4o4N6Ll0J7Nn2R0o5K6Nj7kK7k4k1M9Kl3J4m%ok4K6qM1
$$ 19 -48 -11 -18 -22 19 12 -10 -23 -15 16 -3 14 0 -28 -26 18 -46 10 13 -17 0 5 -47 43 -22 4 9 -8 -10 17 -7 -28 21 23 -10 4 0 0 -6 -30 -4 -12 29
0.68044B9j4n3Q6j6m2L6n1K7k6rN2l1J4l3KTN1m3MK2m1N5l6K9k7lOjj9K4nJ5o1O3m5L3oO2r1L0
$$ 29 15 -38 48 32 -10 26 -25 2 -24 -33 19 -12 2 -31 -29 -27 24 -19 -15 7 -34 21 -15 14 -13 -16 -10 -11 -30 -6 -11 4 -57 6 -39 -6 -12 50 -41 -11
0.66009a1K9n4Q0p2Rk3P5k0nm1N5q3K0QN2o1K3K8j2j4N2k0j3j7J1n0M4nJ1pm6P2j5J8MQq7K4N5n
$$ -11 18 -36 44 -28 -19 -42 33 13 8 -33 22 -61 -41 -33 19 -42 -19 9 -3 -17 35 15 2 -15 -4 -54 -10 -15 -4 -11 -57 15 0 18 22 30 -57 -33 22 17
0.63974A7m9K1j9M6j3j8K3j9J3nj1l3MM8j6nJ1K7n3J9l0k6R3o6JMO1l6j9J7N5m8L1l8Ok2N9n2M5
$$ 17 -32 -11 -30 16 3 -15 8 -11 2 -3 -14 -47 -43 5 -11 -16 -5 22 -31 -12 -42 -68 25 -41 -40 -36 25 -11 -30 -13 42 -6 25 -13 -7 -29 30 -22 23
0.61990B3jo6j6L3L7l2j5L5j2O7o4n1lR8m6jQmk6K7n3K9K5Qqm5L5jj4R0q3J6jN0l3l2P2o1kM0J7
$$ 23 22 -44 -60 -27 10 -22 -37 -2 -14 53 -11 -62 -65 33 -13 -14 -6 -10 -36 -9 -62 -33 -8 0 -8 -53 -18 -19 -33 57 -26 -10 -11 39 6 -26 46 -15 -17 23 40
0.59904D0k7j9K2j2p2P7rk4K4P%olj4K3n7M9Pj4J3ll2oJ2K8q2R4k2kJLTl7J7l2O1k7K6J9n0mL8
$$ 40 13 -6 16 4 -68 9 0 -24 0 7 7 1 -2 -16 7 -50 -1 6 -8 5 2 -30 -36 -24 4 -78 16 -6 -8 -7 -4 -1 -38 -21 -53 8 -19 7 26 -24 -28 10
0.57768A0l2K0moL3j9%K4k2m0L6kKL7q8O2j7l4K0lM9k3k7K0poqJ7OL0Oj3n5L4J6k8l0J2j2M2Mj3
$$ 10 -22 -2 -6 -12 21 2 2 26 4 -36 0 -2 0 37 -51 11 -6 -40 -20 -23 26 3 -24 -4 -11 -17 -25 -8 -2 28 34 21 -34 0 16 -12 -42 -30 -42 0 4 -9
0.55631iqj6J3J8KorJ6m5K7j2K3j0K8k6J4l9J1K7n4O6j5J5r0J18l8J8kTo5O6qoj5J4J6Nk0m0M9
$$ -9 -17 -33 -20 -2 0 -6 -15 1 -44 -17 -29 -6 -16 12 -14 0 -39 -28 -1 -55 11 -4 11 -79 39 1 19 17 15 -50 16 8 2 -13 1 17 22 2 -38 11
0.53596A1l5J2jJ1j0k3M4J0k9J7Tl4rL5j1k3J4Tl4K9lm4N7o2P3l0Pn0L6J5j0Ok0Nj2M4mJpM3o2
$$ 11 -24 -12 -13 -2 -12 -35 9 19 -10 7 24 -10 -19 16 5 -18 -4 10 -24 5 2 -42 15 -47 26 -4 3 -47 -11 4 -6 0 -20 -15 -27 17 13 14 7 50 -12
0.51511a2M8l7J9j8%l5Ppkk1P4j7L6k4k8K6n5Q0k9j0L0k7k0L8nRk1J0o6L7K2n0K3M8k1oQl5Q5n0
$$ -12 36 -1 18 0 0 -35 -28 -35 -37 -58 16 -1 35 11 -17 9 -46 34 5 -5 25 -2 -22 16 11 20 -1 9 -57 -20 2 -48 -25 23 2 -4 4 -31 54 4
0.49476Dj1l3kO9l5j9L6J6oJ2j5k4L9k5k0K3mk6N4p1O4n3L7l1Nj1K2k0J9K8l9K6l8M1m2M3nj8J9
$$ 4 -7 -40 -42 27 -8 -27 9 25 19 31 16 -8 31 6 -14 9 5 -21 33 -38 26 -27 10 -21 -16 -27 -5 -25 -6 22 -17 9 -29 12 -30 13 8 -10 9
0.47492Ik8kK1m3L7Njj4J6k1K2rJ5j2rJ0m6O1mk9J7Rmj3Qj9L3l0K5k6L2n0P8p0M5j1j7qN1m0J7
$$ 9 -19 -21 0 -43 -6 -1 -2 -16 0 -21 1 -8 7 -5 -14 -4 -50 11 7 -22 -5 4 0 -13 -5 -24 9 -21 4 -22 10 -40 38 -32 13 2 -15 -23 28 -12 5
0.45406Eo2K2j0J0J8J6L4q8N5ql5K0l3O1L4q6O6m3J2K4m2M3j4m8N4m1j2L5NTk4K1%K7Kk3K2rk3
$$ 5 -57 -35 -45 -35 -17 -1 33 -55 0 -8 -43 -23 -56 5 39 -47 19 -24 -12 12 -30 13 -1 -49 5 -36 -48 -13 -8 -3 -27 -6 -6 21 23 0 22 13 -10
0.43422a0J0l2K6No0j5N8jj6J8j1K4%jm4N8l6J6J9pk3J0MNL4j4j6m0L3J1oJ6l9K5Pmj6K8j2qn0
$$ -10 0 -32 -6 -1 -61 -76 -18 -19 -35 -17 -28 -4 -4 -5 -49 9 -27 -11 8 1 -22 -12 -8 -3 31 17 1 -39 -6 5 -1 15 -24 1 8 4 -12 16 4 -4 -54
0.41336e4O5k9%K0m8J4LJlL4mOmk4J7L0j03M3J3LN9n6L3m0N5n6K5J9k8l7L1j9j3pQ2l3n5N4k8K8
$$ -54 11 -18 -18 2 -46 -32 -29 -28 -31 3 -1 5 1 -23 -6 24 -79 -36 -23 -20 39 -17 16 -24 31 -25 0 19 -9 -46 -15 -34 -47 -54 28 -5 -60 -6 -34 -6
0.39302fJ2j9PrTnpJ7M6k2j4k1J7j2QK6j1J1jk8pM8k9Nk7RL6m0K0K1j8mj9oO2j5Ql9L7l2j7M7j6
$$ -6 6 -13 -6 -15 -24 -29 -36 -19 27 5 -9 -30 -13 -25 -17 9 -2 9 8 -20 -27 21 -8 -3 -30 -21 15 -25 -5 16 -2 -6 -25 -31 31 16 24 -15 22 -10 -27 20 4
0.37114D%j0l5M5j4l4K9l9L7K2k9l2L7J7M1j0m8J6l1O5j12J08m5l8Q5j1m2J2k7L9%k9PP0p2L2K
$$ 4 4 -6 -41 4 -10 -44 -15 -54 -17 5 -24 -56 -19 -2 39 29 -19 -3 -34 31 -81 27 -18 -56 29 18 -24 -12 -39 0 0 -29 -22 48 -24 8 10
0.35232A0k6J9Pm1J6M3m0N7m5J8Nk3q%k5K8J0n8M0l3K0J8j3Lj8P4n1J6l0O9p3OJ3P7p6j7j3L5n2
$$ 10 -16 3 10 -31 -15 28 -12 45 0 18 23 0 -8 -8 -33 -5 5 -53 -13 -46 -26 -8 -21 -18 -36 38 -13 3 -27 42 -31 -25 -12 65 -11 -28 -41 -6 -58
0.33248e8M9QJj7N1J0m0K2o6K3j2M8q1M6K0l3kk2O5l3L9m6K9j1Q0j23L9m0K7N4m6K0rOj3nM0m7
$$ -58 -9 -1 0 -17 34 44 4 26 -40 -17 -29 19 -62 -16 4 -29 -31 -53 12 -21 18 -28 1 -10 70 -53 -14 -54 -27 27 -19 1 -8 -2 -15 -20 20 -27
0.31315b7j1M7o4K0K1moL4pk7j8J8m6P3j6M0q7Q8o7M0k5J0j9J9rJ8qjK5j0j9jp8O4K6j0l0R0o7
$$ -27 -38 9 -55 -35 -14 -18 -24 10 3 -24 -42 -24 -70 3 -13 27 -60 28 -39 1 -24 -14 -33 -14 -23 -5 -13 -14 11 1 -18 -19 -97 -33 -7 -17 -47 43 -24
0.29331b4K3k8K1l0K5l4R4j35J03qRm9N4j8k6JK3r2Q0j4M3l3K7n3Q7p4K7l9L4mJ0m0M6k6K1l3N
$$ -24 -1 -29 -8 -38 -13 -47 47 -88 15 7 16 -33 21 3 -23 -22 1 -91 -11 -25 18 -15 12 -41 46 -28 -1 -40 -6 -10 0 -40 6 -20 1 -32 -27
0.27449b7K2oj3L3j9m0P4n0J7MK1p2O5l8%J6m4P6m8N3q1L3j0K2n1L3TOj9j6N0k5j3Rk8N3l9N9m5
$$ -27 -5 -11 -24 9 -10 -50 24 -26 -9 -5 16 -56 9 -29 -29 -13 -57 19 -29 24 -57 -24 -34 -12 -63 -30 3 9 -10 -26 24 -1 -14 -5 -33 20 -19 40 -5
0.25465eRL0mo6L3j2M3o1J5K8%o1N1l9O3m3k4M1o7P0j3J7k0R%j1L5j4j2l0N0qLK1l8pk7L0J1J3
$$ -5 4 34 30 -36 -3 -15 28 -33 -18 10 10 -51 0 -39 24 -19 -43 -2 -69 1 -12 5 -15 -6 -6 -17 18 4 -8 -38 12 4 7 28 -10 -17 -44 -14 -3 10
0.23430A0K2ll3J9k9m3O1j2o4P0K1l7Ok9M6l1J0L0l0M5q4M3J1J0J3k5k0K1KMmqpj4j3N8n0K3nK6
$$ 10 32 29 -4 15 -14 -57 4 -8 -72 -2 19 -18 -12 -41 5 -26 -16 14 -16 29 -55 -12 -1 9 22 -3 -23 -2 0 4 0 -8 -15 -29 -42 16 -34 -11 -16 10
0.21395A0o4M3M0p0L1j5J3l0M9j8TJ3m3N6m0Q9o8L0m2N1J2m9L1l3L3m7N9l6J5mPk7J4K0k1K6o5
$$ 10 -54 -11 29 -41 -10 -25 -12 -42 7 -11 -29 -16 -59 -3 -43 46 -22 8 -34 17 29 -20 11 -22 11 -36 23 -13 2 -2 5 -22 -8 12 -9 17 -48
0.19513d8M8l8L2j1K8m1jK1%K4k0k2M9n2qM9k7J8n0NN6pOJK3k9NL3o1L3l9J7k6K3nQk8QL3K5l7
$$ -48 0 -38 -6 -17 11 -30 -31 -10 -10 14 -6 -28 21 -31 -39 10 -17 1 -49 -44 12 5 11 12 35 6 11 44 -17 16 -23 -6 -32 -9 -14 -6 -34 -26 7 32 -5
0.17427eK1k7m1K8L6m2Q9o5QnL1o0pM6l8K0M1l2KJ0l7RL3m7K2j4K1K2j9k7K2k8J8M1m3QNL0k8m2
$$ -5 16 -11 -52 -24 12 -30 59 -6 2 -3 28 -32 -39 7 -31 -11 30 -2 0 10 -27 -18 15 -32 -10 -24 -3 19 0 -27 -5 -33 -15 26 -17 -9 -4 26 -2 -44
0.15392d4M4l8L0J1L9q6O1oqj3J8k0K2j9j1j8J7N0n5K3Ll3pL7j2L2l3RmM3o5NL0j1lK1k7K2l7J3
$$ -44 0 -38 -8 3 42 -44 17 11 3 -10 8 -12 10 -9 -20 -38 -21 29 -26 -3 0 -33 -40 -3 -15 17 -16 -7 -11 32 -33 -28 2 -9 -12 9 -18 4 -33 -20
0.13357b0MjRm2N9kjj6J1k0M9m4J2o3O8j9nLJ1J7l4KM0m4L2k4jj7Ml1M7oN8l4lK0Pn5M1n1RK4j9
$$ -20 -16 -17 -8 -50 9 7 6 -10 1 -19 30 -14 -2 -65 3 -16 -21 -18 -7 10 -24 -22 18 -26 6 -18 -19 -36 -32 -63 -16 -22 36 2 -1 19 26 -29 12 -39 -30 -6 -25
0.11170b5L2j1k1Kj2M8ql3J9J4m3K1J8L4o4Q2k8j4j1J0L4n2j5L1J3k5%m7L6K2l6QN1o6K6J4LQj2
$$ -25 7 -4 -25 -23 -35 13 5 -28 -9 5 -38 -17 1 35 -29 53 25 11 0 10 44 -8 -23 8 21 -4 -4 -51 -15 7 -29 -21 30 -36 -10 4 7 15 3
0.09186CMnK0n6L4j4L9l6L3l6nJ5RlTm5k3M3J6k5M6n7L2J5Ll9L3mK4o4P9o0J8k6L5j5J3l2N5j9
$$ 3 7 2 22 -34 0 -14 25 -11 22 -14 -19 -4 5 2 -1 -46 -69 -26 -10 -35 11 -46 -14 1 4 -35 -2 -6 18 -46 33 -27 -9 -35 0 -15 -2 -34 21 2
0.07151BK9n6L5nk6Qj3JJ8J4Ql5M2l4K7J4m0o0O6j2L8n5O2j2rk5Pojl5P6k5j2p3O8JlJ1J6pkKJ
$$ 2 31 -25 10 5 -21 -13 -26 -25 -7 7 15 -20 22 -12 15 29 -11 -71 -5 -17 21 -34 28 16 7 -18 -11 -17 -18 -53 23 -2 -14 -87 -19 -18 -21 -10 6 -1 -3 -1 0
0.04964@k9j2K1Jj1j2KL7jRK1k9L4p7M0J4L1m6j1J3j0l1OQ4m8Ln2L4m1M2M4n8RJ3pL9n8Q7o1L6
$$ 0 -29 -41 -20 -19 -30 -42 -40 -3 -4 5 26 -3 31 -46 -6 8 39 -7 -18 -5 -15 -46 -40 44 -4 -1 -53 -19 -60 -18 26 -32 -23 -10 -17 22 -36 51 -10 26
0.02929B6l7oL3nj2j8M1p1L6K8L1p0mK1Nk3jJ6kqK0%J1K3n5lk0N4l8K5J7Nl4J1m5J5K7j4Mj1%L0
$$ 26 -11 -17 16 11 -1 -19 22 -49 -13 15 46 -24 -28 -7 -2 -25 -26 -10 -12 -20 0 0 11 34 -21 -24 -44 10 -28 -3 14 19 -15 -4 -49 -34 -7 -21 -17 -28 -28 2
0.00792Bk7L9k7j7j0M4j1l2M4m2K6j6RK8J7j0n5P9l2rj9LL6n1P4n8J8l2N2l8Qn7N5Rj0Jk7L6jk4
$$ 2 -25 14 -13 -30 -40 4 -7 -39 5 -37 -11 -27 -18 10 27 17 -38 41 9 0 -19 -16 20 -31 43 -15 3 -29 23 -15 -7 -64 -9 0 -10 -9 -36 0 -1 -25
-0.01243b5L0l8N0pm4O4k3m5O1k2N1o1J0Oj2j5m1K2L5j2k5J3j7J2J5j0mKLL6J7op3N3j9k1N3j7k5
$$ -25 5 -33 17 10 -34 30 7 -38 23 1 52 -9 1 7 -5 -20 -61 -39 -4 -16 -41 -28 -45 -33 -18 -28 -32 -30 -27 9 26 20 -53 0 -19 -40 13 -4 -29
-0.03227b9L5jOl7LM0l8QmQ%M5m6J1K6p2O8ql5l4P3q6N2l6L7%J2J6k0K6n9JL8L4r8L5j3M2K0l5K6
$$ -29 6 5 11 -26 -23 17 -21 -13 -17 -9 -9 36 -10 1 27 -45 23 15 -20 -54 19 -67 -15 -51 -14 -14 -2 14 -6 20 -39 -38 0 34 -64 -29 -42 0 20 -15 11
-0.05312A1k2k5l1J07p7M5k9N0l3K9n8O9k2n0K4k1J23p9pn1L7k2J7NJ5rm6M8qj4J1j6m3R2m7K0T
$$ 11 -11 -36 -67 40 -37 8 -21 29 -4 25 -33 36 14 -36 -12 -33 90 11 4 -47 -10 -32 -15 -10 5 -4 -50 -2 -10 -24 -13 -29 -72 20 -27 -7 13
-0.07195A3k4l%J3L1l9%k9M5k6J4kmk0O9p1M8o1M7jj3M1k9k3l2P5Mj6j3n3M9L3j4k4J5Pl1J5k4M8
$$ 13 -11 -14 -14 -1 30 -9 -9 -38 7 -19 -5 -7 -11 -31 38 -33 15 -46 1 0 -13 28 -1 -24 -56 19 23 7 -6 -59 -10 23 9 -15 0 7 -24 -9 -33 15
-0.09229A5k4j1J5LK7l6J1%l8K2n0O9k3J5j3K9j6j2M9o5L6k2nJ1k4K8j6M7o1M2o1Q1n2qK0Nm3M1L
$$ 15 -9 -20 -5 -2 25 -11 0 0 -38 -16 -66 3 -20 -5 -18 11 -5 -17 32 -33 3 -19 -24 -13 -37 -9 -25 22 -39 3 -58 23 -29 -37 -17 -12 -55 -14 -11
-0.11213a1l0J7K0j2N2p3M7l8J4j7L1o%k7O0o8N1k8K3j6K9qm2J7Qok8N3K4n4jl2N5l4J8n4N8j2j0
$$ -11 -41 -24 -4 -16 36 -37 10 -28 -14 -31 0 -6 -6 -33 27 -41 10 -18 5 -11 18 10 -32 -15 -7 -13 -41 12 36 -18 -19 -51 4 -30 -12 -66 -8 -20 -30
-0.13197c0%J1K1j9L8l8K3lml1L7ql9M2%K7m9k2N2k5KJ7k7rN7m4L7m6L9m6L8l6oM3n0P3m7Qk0K6n
$$ -30 -30 -19 2 -17 21 -17 6 3 -1 -32 5 -3 -42 0 0 27 -22 -44 8 -17 -15 2 -25 -34 23 -21 16 -30 9 -37 1 -35 -41 2 -48 25 -22 -14 -34 -8 -13
-0.15283a3j1L8m8N2l4L6l5K1n3J7M1m2Q2p7PM3o2oK7J9k7M8l2mj3K9lm0M4l7M1m8O0n6L6rJ4qM
$$ -13 -24 14 -34 18 -16 20 -15 6 -47 -30 11 -31 51 -26 -19 24 -38 -44 -17 2 -25 23 -9 -13 -26 3 0 -40 4 -33 8 -40 20 -36 0 -9 5 -3 1
-0.17267Ak2M9mk3l9J8K0Rk5RJ9j3K7ok3krL6n1OK9j5k5J1J9m2K0Rk4O4m1J2l6K8L2j3n3L6PK4l4
$$ 1 -21 28 24 1 -38 -20 0 9 -16 -7 12 -1 26 20 -3 -5 -14 22 -29 -23 6 -9 -34 -23 -4 -46 -26 -17 -41 23 -18 -6 -42 -14 18 5 -48 -12 -5 19 -15
-0.19353a5J4k0M0l9K2k4J3K5l1N0m1k2n4O4k2L8pJ4j4rk0N3p5M9l1K0k9Q8r1P5r1P1j3M5l8l5K0
$$ -15 -1 -21 19 -20 2 -22 -9 16 -15 35 -6 -28 -82 -18 -40 -2 -9 5 -9 -18 -38 15 -60 -11 -42 -22 -51 37 -54 21 -70 1 -12 33 -5 -40 -20
-0.21235b0K2l1%K5m1J2K0O2n3K4p6O0l5K3ML5o0K0J7l9N5k4j1KK8o2N7j2j1k3pL8l7M7k5j2lMm
$$ -20 2 -29 -29 -4 -45 -33 -13 49 -4 20 -56 4 -31 -8 -4 31 -29 -9 8 -31 24 0 -11 -9 19 -43 14 2 -9 -32 -39 -1 -38 9 -16 -28 -31 -27 -31
-0.23219c1M7n5N0l3QMJ6o5O5m7M1mm8J8L2Kk2K2nNk3J2J1j3L2o7O8l4M3j0j9m3O2q1N3j3K0J6m8
$$ -31 16 -39 11 -22 -14 -10 6 -59 6 -41 0 -4 -52 -34 -2 0 -22 0 -5 0 -23 -11 0 -13 19 -48 20 -14 29 19 0 -43 19 -62 -9 -22 -2 14 -34
-0.25203c4M4k5j3J5Pk5j8J7KK9JqTPj1K0Nl7L0m4P3l7K7n8JJ0L6m5K6KkOoRo0N3L1k2Kj4LN8m8
$$ -34 10 -15 -28 -13 -6 -31 -49 -32 -30 -1 0 -8 -16 -9 -20 0 5 -32 -2 -46 27 -10 17 -41 -40 -30 6 -39 -13 -11 -13 -7 -13 -4 -64 -11 20 -2 0 -14 -11 47 -1
-0.27390aL0o9M2n1K3J3l9M5opnL5j0ok2L7pnLOrj4J7l9M1j1K6m8P2m7j6J6K8k7Oj3m0M6k2J2J6j
$$ -1 29 -40 2 -49 -26 -13 -52 -7 -13 -20 -25 10 0 -6 -28 9 2 -3 0 6 -3 -17 0 -39 2 -9 17 -31 41 -6 -22 -6 22 -5 1 -12 -52 -6 -28 -16 0 -1
-0.29527anlrK6l9J8J3m4M5J2oRj4j5NJNOm8L8qK3K7p1O1o5L4K4n8ON8o1N7m8j3MQ7p1Qm0N6pl4
$$ -1 -6 -9 -18 8 -31 -13 0 -44 1 13 7 16 2 -13 -8 -7 -2 4 -44 -6 -14 9 36 -35 26 -39 -5 19 -39 -33 25 -36 21 -27 -40 -36 51 -20 -12 -52 4 -3 -37
-0.31715c7K0mM1n8K5J9ml4N7l2L7j14N5mK6j6O5o3J2m5N8k8K9j5m2P2%k7rJ4N0n3L0k9Mnj3j1M7
$$ -37 -17 -21 20 -38 -13 6 2 -32 25 -7 30 -84 -29 -33 -7 -23 42 -21 -9 -54 4 -24 5 -10 -52 20 20 -7 -16 -2 48 -5 25 -4 0 -5 -18 -29 18
-0.33698A8l4PRj3l6J8K4J0Ol1oJ9K1j3J3L0j3n7M3k4J7L3j9l0K5l8qJ5K3l9L8k7K4j7mj0L0rk4
$$ 18 -16 -9 0 -13 -49 -31 -7 3 9 -22 -28 -9 12 -1 12 42 29 -28 15 -9 8 41 22 -8 17 -21 -29 -14 9 -30 8 -19 5 -12 -16 -26 4 -5 -29
-0.35682b9J8k2N9Ko1k8M4k2K0lnN7l6L0n3N9q6O6PJ3k1p1O7n7O9m9j3O4l3j4M4o0J2k6L8%K7r2
$$ -29 -11 -33 26 28 -33 -61 -17 -39 -19 -22 -27 30 -6 24 -29 30 -56 10 17 30 9 -62 5 -52 17 -32 -45 19 -14 -28 16 -44 -32 -58 -20 -20 7 -85
-0.37616h5Q5l2K3o4P1J3J9p8N5k6ML%Nj1L4Nk3lp1R5l6J5J4m1kL7qm3pJ9L6k9k6P6m4J2n6Q0k0n
$$ -85 0 -32 -9 -73 -2 11 30 -48 7 -19 -15 -12 -12 -7 -18 16 21 -2 -5 -76 19 -17 -2 12 -29 -31 6 -2 -45 -52 -33 3 -26 -52 24 -20 -8 -64 16 -4 -9
-0.39701ijJ6L5m0rol0L6k6l1OP3m4M1j0J4m2O5q2L3J6K5m0Ql3M7j4ok8O6m8J8j7J9kJ1k4Onj0T
$$ -9 -10 6 41 1 -8 -14 -44 -8 -34 -65 -59 14 -30 11 1 15 -27 38 -44 -11 5 30 -10 -2 -35 12 -2 -8 -36 30 -18 0 -17 2 0 11 -13 -7 -12 -22 -32
-0.41787c2K0K9nj6K2Nj7o7N4l4L1J7l6K9n4J00j3j8l8K0qMkmj4LmM1k3j2nqJ3TK7l0K3n2K3J8j7
$$ -32 -12 17 12 -4 18 23 6 -61 -7 -41 -10 7 -29 0 -54 46 33 15 -23 -3 -11 -7 -9 -13 -27 -24 -28 13 -10 -22 -27 -35 -22 -9 18 -12 11 -41 -18 0 -17
-0.43873a7K1pJ7l4k0mM4lK6j6mm3l2L1qO1OK1m2J6m2K7l4J8J1l4O1k5K7m2J4k5j9KJ4TJ6Rj3mL
$$ -17 4 -3 14 -20 -40 -44 0 -3 23 7 3 -40 -72 -41 -49 12 18 39 -3 13 -29 -2 -36 -18 -7 -41 20 -5 22 -20 -6 -31 -50 -48 -34 -20 -4 5 -8 -12 -9
-0.45958ij9L5k9NM2m9L5m6jL9K1k7TM2k5J5kj0j1K1j2PJ9K3n2m6O9N1o8M3r1Q1j7l0J2j3m0jM6
$$ -9 -28 7 -22 -17 25 -24 11 -35 -36 3 24 -3 -30 12 -13 2 0 -10 -21 0 -12 -5 14 37 -15 -61 8 59 -9 34 -57 24 7 -23 -11 -24 -64 -65 -19
-0.47942a9K9jl5RL0l3N3p1%K8qTL5j1l9k5N4L0k1j9L2j8J2nk8O7n4NMRk8j2O4j2L6n5ok3KK0m0
$$ -19 10 9 -26 -17 13 -20 33 -38 -38 -10 -18 -26 9 -2 -41 -66 -12 18 -3 -22 10 -8 4 -1 -29 38 -16 -11 -7 2 -26 -38 26 14 50 -5 -11 -34 -32 -12 -52
-0.50028e2K1l1M4K0n5M9l0TP2j8J0m9P4o8O1k3j3l0P9n0j4N2n6K7j5O0n2OQj7K4K3n3M4l7j2M2
$$ -52 -31 -62 -18 2 -53 -4 -34 -64 8 -10 0 -49 25 -43 18 -5 -18 -48 31 -19 -33 19 -37 -10 -25 35 -17 -11 -3 -20 4 27 -26 18 -19 -31 11
-0.51910A1l5J8ljj8M5j1l0qK5j2L4Rl1J8l1Qk7nM8m3K0J1K2l5J3j0L4j7J4k1lRK4j7o1O8j2n0J0
$$ 11 -24 -6 -9 -10 -28 17 6 -24 -32 -7 -19 15 24 -7 11 -20 -12 -39 -44 4 -39 -19 -8 14 -21 -8 -18 16 -1 13 -8 -11 -2 22 5 -56 12 0 -50 -40
-0.53945d0PM0k6j5L6KrK8p4P7n0Q7q1L8n1O3n3K2m5N8p7M4Mj5J4k9j3K4J8k4J2j2K0pJ5K6o2O4
$$ -40 -33 7 -19 -34 2 4 -5 23 -51 26 -24 63 -18 20 -31 32 -21 1 -44 14 -63 -19 -15 -30 -16 -45 -58 -34 -16 -40 -28 -40 -20 -27 -12 14 -48 16
-0.55878A6l5J7Lj1q3N1J3OQOTk8M8k4Ml0L3K4n0k2P0k0l6MM6n2L7k8J7K2j9K9l2M6k9k5J3k3R1
$$ 16 -19 -2 1 -10 -93 -42 -29 -23 -15 -9 -3 -31 17 -7 -3 -33 0 24 -26 -48 22 2 -34 -30 16 -36 1 -27 -10 12 -7 22 -10 36 7 -18 -5 -28 63
-0.57862F3j00K9Pj4l3L4L3j1l8O1l7lK7l9K6k7%J1ol9N0K6m4PkK8nPJ3k4J8m3OM5m5Ql3J7M5np
$$ 63 -37 -8 -1 -15 -48 -14 19 8 -30 31 -6 -9 18 -21 5 -22 -22 -11 -17 -56 -6 20 -24 -17 -19 9 4 11 24 0 18 -25 -19 26 -19 -11 -44 -27 18 13 6
-0.59948Fj6L6m3J7K0m0K0J3J1p8M1JK6m0L6pn7O0m3K5pJ5jK7o2J7M2ml1l2O8m1M4k8j4KK5k4K0
$$ 6 -10 26 -17 0 20 -20 0 13 24 -54 -13 -12 14 -26 10 3 -54 6 -37 -12 -19 -4 -5 22 -40 -23 19 15 -16 -48 20 -21 23 -5 -19 -17 8 -16 4
-0.61932DJ5k4o5O9J2l7K4Tl0n3N0K0j5K3m1rM8j0o2Q2l4m9J3J02p3pL0o5N6m9N5k7j9O1m3M1k0
$$ 4 19 -5 -70 -1 11 -26 -2 22 -8 -61 -11 9 -6 17 -24 -33 15 5 -57 25 -9 -58 -45 57 -16 -23 7 -58 -2 -51 4 -23 -42 19 -24 17 -3
-0.63814cj1j8K7j0J%nj2M6n8Q5j31Q8n4M4j1RlM0jm1j7K4J5J8k7%j3PJ1nK8o0O1o4N5m6Q8o4J2
$$ -3 -14 -32 -5 -15 -14 -14 -19 -31 15 -43 42 -89 -1 -55 -11 -22 -13 -16 24 23 -18 -35 -11 4 22 -5 -5 -18 -11 0 -5 23 -37 24 -40 15 -31 57 -7 5
-0.65849El3j9P6k0j3K7o9L7l0Q9p6K5koj9mL2p8Q2k1MkJl4K3L6m8N1o7P5n8K2K6l8NqL8o6L5rKJ
$$ 5 -28 -47 29 9 -4 23 -46 -9 -39 50 -26 -1 -3 -9 -28 -32 0 -78 4 -17 -13 -15 -14 -48 -25 11 -37 14 -53 22 -36 -14 12 -26 -21 -29 9 -57 -22 -31 -29 -28
-0.67986b8J7j2K8K5l6Lj0l3K2Ql2ON1m8J1M8j1n1N1nK2o2K4J6ll9L3N9n4Oo1J10m8L2l8k0nK3j7
$$ -28 -11 -23 5 30 -6 -3 -13 -46 -24 -16 -48 -42 9 -39 -28 20 9 -42 9 4 26 -36 -12 4 1 -38 -5 54 0 6 -55 55 7 39 1 -19 -24 -1 -18
-0.69970a8J1M0n2M6j8LpTL8k1kk5k2K4K1%j4J2k1k6P2n9J3j4PKpK3j4kK0l0l5P7k5qK9nk5k8P0
$$ -18 -7 33 -19 27 9 12 5 -2 36 15 13 -12 -34 -10 11 11 -3 9 -12 -38 34 -25 -12 -26 -19 -17 -24 -1 -15 -17 3 -27 -62 15 -10 -18 11 6 -19 -47 23
-0.72055B3n8qN3l3qK4Pk0J4l5L1lk5O3m8K0J5kk9K6kl7J1Qj1K3mL4j7o5L4k9Q8m6l2OrO2m2J9O
$$ 23 -35 -43 10 -23 -31 -7 0 -20 -6 -41 -10 -13 -38 25 -23 -3 12 10 -19 7 5 -32 -21 -13 -24 -1 -5 29 12 -53 -19 -48 40 -6 -38 -32 -41 21 -21 -2 4
-0.74141Dj5J%nj5orO7n7K3k6P1j3m8L4q3R1J0j6n5M4Kj2j1j2JM0Mn3O7n4L1M7q5K2Tn2O5k6m0N1
$$ 4 -11 -10 -10 -15 -30 -36 -45 22 -35 -12 -38 33 20 -28 6 -77 14 24 8 -47 -3 -1 -13 -24 -36 -35 5 9 -44 23 -31 0 47 -38 -16 6 -46 19 -7 -47 4
-0.76227DOm3PJ6J7n3N2n8N5m6P6k3j6J5j4J2K8n3plM4m5m4L2M5m7LQ1m4J1rj1n8O5j7k3N6jk0Jk
$$ 4 10 -33 -26 -10 7 -46 6 -52 3 -43 33 10 -6 9 -5 7 35 -18 -25 -28 16 -29 -73 -41 4 -43 -40 41 -3 8 -1 -12 -70 -5 -22 -45 11 10 -10 -9 -11
-0.78312a1J0KJ2m2M2l4K9nJ6n8O0m2L0l2Lj7M6l4K4k4K9j5L8l3m1K1MO2o5M7k8pOJ2n4L2j5K0j2
$$ -11 -1 1 13 -29 13 -21 8 3 19 -39 21 -21 9 -23 -20 -37 9 -25 -1 -25 4 -11 27 -6 -47 -26 -22 40 -25 22 -6 -13 -7 5 -49 -17 -32 -12 -24
-0.80296b4k9N3l7P9m1j6J7j8J9mrpJ7j2lpJ6k9N9m7j7l1J04n4K1l1MKm6M2O3k2J5j6m4L3j0Qn1
$$ -24 -53 0 -37 42 1 -15 2 -16 3 -1 -10 -17 0 -12 -15 -22 -6 -35 24 -23 -40 -71 33 -21 0 -31 -27 -25 -71 -29 34 12 27 11 -33 0 -10 -2 -53
-0.82280e3N3j0lkL1p7K6J9j5L3k7M1n9N3m8J9J7oLkrN4q7O0l0K5l0K9k2L7m7N1j8k1ol6M2Kj4P
$$ -53 0 -10 -13 -15 16 -61 -35 -16 -31 2 -25 16 -43 10 -38 -19 -2 -8 -5 -7 -16 38 -49 11 -19 6 -24 5 -17 20 -27 24 6 -15 -21 -57 -15 -13 -27 -20
-0.84315b0K7k1ML3m4j4nJ2k0N3j6o9R0J0j6j5k2j0M9l0mK8k9K0j1l8K0K3j2TN0jm5K0K2l2j2J7
$$ -20 7 -14 -10 23 -21 -35 -40 -28 -48 5 -11 -80 10 20 4 -11 -33 -43 6 -24 -28 0 -29 -9 -20 -58 -38 -15 -27 -39 11 10 -35 -15 7 -25 -37 -20
-0.86248b0M0k5k1k4J5Q4p3Q4j08O8n2J1J3k4nM6o2L4N5j1n1j0J8M0o4M6j8M9q5L0L6m7K0Rl7LJ0
$$ -20 20 -5 -26 -50 -35 49 -24 60 -48 20 -32 -21 -8 -32 -37 9 -53 -19 36 25 -26 -36 -18 22 -42 4 -14 35 -50 -20 16 -31 -11 -2 -39 -36 -26
-0.88131b6L3p1R9q6M8QRm1L4Ll5J7kK6M6r7M7m1N0k6j3k1J2M8m0K0l9J2k3K8J9JQl3J6MQk4J0M6
$$ -26 7 -64 35 -51 -3 5 14 -27 7 10 -25 -8 -10 16 62 -35 12 -29 21 -5 -18 -39 -27 21 -19 1 -38 -26 -49 -21 -2 -1 7 -26 -10 -6 2 -22 -12 34
-0.90165C4l0pJ3n4mN7l3J0oK6k3M1j0Qn9J5L8Lk2l1j6K0J1N0l6MrKm5Q3k5j6o1P8j7J3J2l5J7J2
$$ 34 4 -3 10 -44 -48 9 -24 -14 -20 6 -17 24 14 22 -37 -22 16 19 -3 -34 -50 -30 -19 31 -5 -1 -10 -8 -53 30 5 -11 -72 6 -11 2 14 -21 -4 8
-0.92200HmLpK0k4j0mrk0K5j3kj4K4LN9m7L9p2M2m4K5Jk1N2k5j4JK2J9n8J3MK2K5k1K8m1L7p3N0
$$ 8 4 7 0 20 -4 -14 -18 -27 -47 -22 -35 -37 -51 -27 -24 35 -12 27 -45 -3 -47 -22 -21 -42 10 -15 -29 -28 -6 13 -45 -32 -28 -6 19 -2 26 -15 22 -51 -1
-0.94286aj3J4qn1J1J4M2o0RK3QL2k9M2m6J3l7J0J6oK7j3j2LjL1Lk1M1o7l4KR4nn6K6j8J4m2M5J
$$ -1 -14 0 -8 -59 -48 -34 8 -52 -43 -20 -12 20 -9 33 -13 0 -37 -27 -11 -17 10 -3 -15 -12 -13 18 21 0 41 -26 -60 -58 36 31 -25 1 -17 -3 -45 0 1
-0.96372AL0nj9j0k3L4PJ8n4M6j1l8K8Jj5oj0N2l4k3J1J8l8O6n6J1qkK3J2J4n9jJ2J9j0j1j8K4K1
$$ 1 31 26 7 -3 -26 8 15 33 -21 25 14 -24 4 5 -10 -16 -26 26 -8 -31 -20 -2 -40 26 -30 -19 -27 -29 -6 6 20 -39 -40 -28 -9 -19 -30 -48 -24 -3
-0.98407cL9l6k3J1L5o6O3k3J2ojk2M1k0j7K1k4L4nl8J8nj2L7%nJ8o4L7qlK5m0J2m0O3kKqrj9M0
$$ -3 36 0 -23 -12 23 -43 20 -3 9 3 2 -20 21 1 -16 5 -19 15 10 -28 -10 -15 -27 10 10 5 23 -41 -4 -12 -15 10 -30 -18 -58 5 3 5 -3 -12 -31 9
-1.00543IJ3m4M8J2k8n6L8N1m9K8p0N5k8P0l3rj4k3Oj2N4k6qJ2qjlK4m9K8K4k5k8K3JJ8p1L0oJL
$$ 9 22 -22 26 38 10 -46 -8 43 -6 22 -48 7 -21 49 16 7 -7 -30 -24 -36 18 -8 -16 -4 -12 -13 -16 8 -41 -13 11 -14 -42 -19 -18 0 -71 -41 -47 -46 -43
-1.02629d3L0K4l4K3J1pn1Q5Nk6j2kk8K4j4TL9Nk3K3J3m0J1J8j8j3M4l0K7n9k4M3L2k7Mk8N0o3K7
$$ -43 -13 11 -23 0 11 4 -47 38 43 17 5 3 -25 -1 -15 -29 10 15 -8 15 28 -12 -1 17 -1 -14 30 0 27 -32 -56 -13 19 -8 -4 -32 18 -45 -18
-1.04613a8jL6j21J10l5P2q1O4n7J6Q3o8Lm3P1m0lJ3ll6K5j2L5k8Jj2K4k7K4QL1l1k8J6J0j0k8J8
$$ -18 -19 17 -104 6 -29 43 -38 26 -31 -15 68 0 3 -40 31 -9 -12 1 -2 -38 -13 -25 10 -18 -17 -29 -5 -32 -8 0 31 0 -28 -12 -2 -12 -40 -22
-1.06546b2L6L3m7m1K0J7J2m7K5N1k4m3N1o6N5k6JLnKJ6k5k0K1k1M9Rp2L7N2o1K5pn0OO4l0M3n8
$$ -22 14 47 0 -41 -21 -4 8 -39 -14 37 13 -30 21 -45 10 -16 -15 -12 -17 -15 1 -24 -44 -23 -44 5 14 -58 -21 31 -30 -5 -12 -62 -56 8 -22 21 -37
-1.08530c7L5l5O5q3Q2m0MTRM6p4J0k0N0m2J6%rL5o6J2M1j2o%n3Q2j5L0k6pl8O4p1O2pl3J9J1Jm6
$$ -37 -2 -37 28 -55 27 -13 -9 -5 4 50 -24 -14 -34 16 -26 -10 -10 -19 16 -50 -38 3 -9 -15 -15 -68 14 -1 29 3 -4 -42 22 -49 13 6 -27 -8 3 4 -42
-1.10616d2L0J5Rk7J0kQk2M3l3j7lJ3kj2n0P3J0L4n3L7n9lM7j8m5J4J1j7Q2m3lJ6K0j1K6p2MjL7
$$ -42 -12 3 12 -15 -5 -7 1 -21 22 -11 -28 -31 -18 -20 -32 -82 -9 1 35 -18 19 -40 -43 4 -14 -59 -45 -34 -51 31 -12 -15 1 21 10 36 -36 -32 -33 4
-1.12650DK4p9K5K7o0Q8o4K8QK9n4K1kj5K0Qk0j3K3m1L1j9J4K6j4%J6J8n1M1L1n6qNL3n1K6n4N5
$$ 4 28 -51 -26 1 -59 29 -35 -7 1 30 -24 -3 -5 -20 0 8 -12 -25 -2 -43 -12 -31 -17 9 -5 -5 11 29 -22 19 50 -6 -14 -9 24 -27 -1 -55 0
-1.14634@K0n3j2N6Mj1o6O2n2O4q4O6l1N8l2PL5j7j6J9km6PJ8J5n6%N4Pk0J8Pn6mM0J9p4N2K1l7
$$ 0 20 -33 -45 11 15 4 -62 0 -52 12 -72 -6 -37 21 -11 -4 31 14 -2 17 15 -31 -24 -6 9 -47 -47 7 14 -6 12 19 -37 -41 -1 18 -56 -4 17 -20
-1.16669b0L5L2n0j3Nj3QMj0%qL8l1KM5k5K3k2j0J6Pl3L1rJ2n9M5j9lJ1j2j6L2L4n3j3J1K2j3kKT
$$ -20 15 47 -3 -16 -11 -24 -16 -12 -22 -22 -30 8 -23 -21 24 -1 22 0 -10 6 13 -20 11 2 14 -45 0 -19 -22 -11 -23 -39 -7 27 -26 -39 -28 -6 -19 -21 -19 -17
-1.18806a7L7j6j8J6m4L6m0M2k7O5k1Okk6QK4K3o7J7k7jK8qjk0K8j4MJ5n1M4k2L4J1j0Kk5qkKTj8
$$ -17 20 4 -14 2 -42 -6 -46 -4 -31 34 13 19 17 -9 -1 23 46 -21 -4 -31 -32 -4 -12 -13 -33 -5 -19 -15 0 -51 -7 -29 5 16 6 8 -17 -25 -27 -25 -23 -41
-1.20942d1L8j6K6m0M6m6K1K8k0K2k4j6K3P%kok3L6p4M9k6O8l4k2LM3n6P7k7L5m2k2rQJ8j6j8L0
$$ -41 -3 -19 7 -33 13 -33 -12 16 -4 18 -6 -22 1 8 8 6 0 -23 13 -61 -12 -38 30 -4 -26 -23 20 -36 41 14 49 7 -15 -24 -16 2 -14 -32 -2
-1.22926bj1j4J1KOQl2K0j3M6l7L2o1N5j0J8qk2M7j0l8j9K8n2J08o3Qo1Q5k9L9n6N8m7J0j5N%k5
$$ -2 -13 -27 -16 -14 -8 0 -32 -12 -25 21 -16 16 -45 10 0 18 10 -12 35 25 -13 -32 -4 -56 52 -11 -3 -64 21 -8 31 -25 33 -14 -4 -19 -14 -14 -39
-1.24910c9K8o9Q5j9k9j6L1pK7o0N1kJ5oqk8L1j0rJ5K3l8k0P7n9P4n8M2m0L7p4O0q5J11p8O4j6k4
$$ -39 -11 -80 5 -14 -43 -59 -28 -35 -8 -68 -17 -19 -4 -10 -18 -46 -15 -25 -34 -19 4 -34 -54 23 -36 38 -20 22 -18 19 -55 5 -80 31 -47 17 1 -23
-1.26844b3Lj0K4J1k3K4k5K2PN9o5nj9j8L5J2nj7K0l6J3L0l3N6p0J3k5K2NL4m3P8n1m3M3j0lPlj2
$$ -23 -20 -30 -6 5 -18 6 -19 3 10 69 4 -1 -20 -38 -3 9 4 -13 7 -29 -16 14 -19 37 -33 -20 -45 -23 -18 16 -27 51 0 -43 0 -10 -13 -6 -9 -21
-1.28878b1J6m8M0m3N6Kj9L9m4L2k4J5k0K1o3O0%Pj0OK8l2Rk0j6lN6J6j19P8j1K9l3k1N0mOk0L5
$$ -21 -5 -53 -13 -56 0 2 -17 22 -22 10 -14 1 -19 2 -61 -1 -1 6 -4 2 30 -2 7 -13 -29 -32 24 40 -79 -1 -12 17 -16 -37 13 9 15 -5 30
-1.30862C0j07N9pjJ7ok2M0m6Q7q2l3J5K0OJ1K4k9J5k4KnN5o0M7n2O1kk3J6k7M2n7OPN1m7Mm2O6
$$ 30 -77 -18 -25 -26 -9 -15 -37 3 -43 44 -38 -71 -56 -36 -30 -19 5 -24 -9 -33 -31 -36 19 -41 6 -46 15 13 -10 6 -21 21 -36 -30 -23 28 -19 -15 -57 9
-1.32897Io4N8l7L3j9J0K9j8k3J7Lj8RrNl0j3K7N7on3L4pK8o0J9PpL0k1N6p3J5Kn8O2N5n5K2n1K0
$$ 9 -55 3 -34 -1 -20 -10 19 1 -22 -5 -2 -20 -11 -20 -15 -45 -58 -31 26 20 -33 1 -6 22 -38 -19 -12 -19 11 -10 46 -27 -12 -10 -68 -6 49 -6 16 -35 -15
-1.34983a5l4O5j5j8J5NJ4k3m1M2%l0L7Jj4K1n4N2m4K7j1N3n6O4p2P0l6m8Q3m3QL0k6J9k5qn2M2
$$ -15 -49 16 1 -17 -2 3 17 -6 -47 -5 -5 -35 2 3 -11 10 -44 8 -36 -9 -20 33 -23 41 -31 39 3 -45 38 -5 3 33 7 26 1 -7 -59 -17
-1.36916a7K4ll1kL9l2K0J8k2j0J6KJ6l5L5n1kK6K2m0J1M3l7j8j3O8qn6P8k8j7m4N1p7O8JL3J1o9
$$ -17 7 4 -27 -29 10 -22 -2 16 -6 -16 0 2 18 -17 18 -33 -35 -9 13 -27 -16 27 -10 -28 -41 27 19 -37 41 13 -4 -48 3 -74 -6 -5 28 39 -30
-1.38900c0nM2Pm2m8P0k0qK8J1k0K5k2PlmJ4k2N8p3L0L8q2J6j0N8m5J4LKj8J0L3K2n2M2j5jm2PN0
$$ -30 -35 7 14 -28 -76 -6 -26 -34 -6 5 -15 10 -12 -5 -8 -12 2 -20 38 -35 -5 33 -49 -33 -43 15 -30 -16 -13 -11 -29 -19 14 36 -16 26 11 10 -32 -25 25
-1.40986B5o0L9oKk6K7k6L1j5Lk8J7JK6m0J4Nm6M7nL5o0OK7Ql1J9N0n5Kp%N0o5L8kn1QK3JKK3k7
$$ 25 -35 4 -2 0 -26 1 -25 6 -9 -6 -34 -17 -16 10 -30 -16 -11 -57 -10 -15 20 -40 -34 -7 1 -30 -11 39 -16 -14 -21 -21 29 -36 2 0 -51 -43 -20 -19 -17 6 -21
-1.43173b1k9M5J6r%K1n2L9j7k1NL4j9LJ1rJ3n1N8m0MOl2K3QRK4m6JL4m5O2k5J3l0N3l7mj2K4l9
$$ -21 -50 -5 11 2 2 23 -29 10 -7 -28 -23 11 -8 -5 6 -3 10 -41 17 -23 -19 -13 -45 -22 -14 -5 19 -27 -26 8 -37 25 0 13 -17 36 -1 -5 -17 7 -32
-1.45259c2L1L8J9n9k5M6l0j2J3l1M2m4L2k7L0jL9j2m8K6Nj5L4o0L0Mrk4J4K1lJ8kPo1K8j6K0k8
$$ -32 -1 37 56 -3 -28 18 -12 -24 -11 -42 0 -44 -12 -39 -9 -10 29 17 -31 -5 0 -15 19 -41 -11 -7 -16 -40 -26 -5 -8 10 8 15 -46 -18 -34 -14 -42
-1.47243d2M2J9n9O0k0J4j8j5K2l7P0o3M5%l4L4l8m4L5L6j3J9mj6M2j2k9Mk3j8J6nJ4L8m2K4k0K4
$$ -42 0 19 -40 20 0 14 -4 -19 3 -34 36 -27 18 18 -16 18 -20 -64 -29 7 -6 13 9 -7 35 23 -6 -2 -25 -43 -27 -32 -18 20 -22 2 -18 6
-1.49176Fm2Oj7L1lok4L7j2K5j6L2k5J8l6KK9Kmj0Pk3M4l6K4l7N0Rl1J0nl6NJ6j6J3N4r9P2l1Lj8
$$ 6 -36 -30 -47 -16 -19 -25 -49 -12 -24 1 -15 17 -8 10 -26 -24 5 7 3 -7 0 -23 21 -15 9 -28 22 31 0 10 5 -31 -26 -10 -26 -13 41 -58 14 -17 -14 -32
-1.51313c2K3j1O9n5j1PL0kk8kJ2k3N3n1K7k3M1j9p6P0jj3N2k4%J5m1klM1k4j8l0M4KM9qn2k3L2p
$$ -32 -9 -20 49 -6 -17 -10 20 18 -10 -12 0 -23 30 -21 6 -17 24 5 -71 -1 -2 -15 37 13 13 28 -13 -15 -18 23 -1 -19 -49 -5 -3 46 38 -14 -37 -5 -12
-1.53398a2J2j3mO5m8j9K3k1L7rqm1L5k0L0o7M1%j3J1k1K1M5l8L7n2P8o4N%k2P5p3N4n8M3nPl1J5
$$ -12 0 -13 -17 48 0 -19 4 -17 20 11 3 -38 -3 -23 7 -60 -19 -19 -32 -21 -42 -21 24 -14 23 -29 49 -15 -10 -10 -32 43 -30 24 -34 9 4 11 -20 -5
-1.55433eNm4N3k0PJ8j8k1j2K8n1K0L1o0Q3n4O4l5K8p4Q4k4M7n0j6K6L8n4lj8O6m9mL4n1L8L1k6
$$ -5 0 -44 9 -11 -4 14 -4 -25 -37 -9 -60 -40 -9 -69 14 -40 24 -11 17 -57 27 3 50 0 -16 10 48 -6 -9 -27 39 -10 -14 20 -31 7 38 12
-1.57366A2J2m0J7k5N3l1j1nK3m5K3J3Npk3L9lJ9l5J9kn0N0m0J9pM4l2KMQL1p2M0nLll6K8KK2k1O
$$ 12 24 -16 1 -24 29 -2 -13 -18 5 -40 -17 -4 1 -6 -29 10 7 26 -9 10 8 -42 8 -32 -13 -20 24 -8 -6 -2 6 37 -35 5 0 3 0 -36 -8 -6 16 -5 1
-1.59554AJ8p0J4N9pk0j4p4J00j0K7k8J8J5n5M9j0k2L7p4N6l9K0Nk9J2qJ7k6J6M2l8oL0m5K0jL3
$$ 1 19 -51 -37 22 15 -5 -19 -93 7 -3 24 -4 14 29 -26 23 13 -9 28 -46 10 -29 -9 -4 -33 -21 -29 -12 -38 -22 20 -18 -24 6 -39 -19 -20 13
-1.61487A3k5m6N1Nk7N8l9NK6o3K8KRj1L8o4M0OJ7k0l3L5n3L2k0N9qj6J6p1Q4m6KK6ml7L3j9M1k9
$$ 13 -12 -58 -7 -2 -29 29 -10 -5 21 -42 -14 -12 -3 -14 24 -40 0 6 23 3 -30 5 -48 -16 -36 23 15 -1 15 -56 28 -18 -16 10 6 -31 2 -17 24 -5
-1.63522eL5l7k4L1l6M6o4L3JL8m4OrM6J6lp3O5k5L4m2J7nl6JL0M6p8kL2J4k3Lk6Oo%L5m7O0m7M6
$$ -5 30 -7 -31 0 -36 10 -54 -21 -20 18 -26 -20 -29 17 33 30 -43 22 -3 31 -11 6 1 -35 -34 -4 42 -36 -38 -6 8 -15 -12 -38 -32 -38 -38 -3 -50 10 -37 9
-1.65658Ij7K3Mk4Nl2J8K3rm5K9K3n8L5J9%K5o5K9j4JRTQqk7K2LN7j18M5k5N1Lj8lrL5mj4J5jKk1
$$ 9 -8 15 19 -5 0 -32 -14 9 0 -45 -16 7 -51 -16 3 3 28 -37 -8 -22 -21 -12 -3 5 -3 -30 -8 -5 52 -66 -21 -46 5 8 -10 -13 -22 13 9 -5 10 9 11 -10
-1.67897a0m8O0j1K7n4k8O3k5K7lj0k4L8rNJ5j8mJKJ3m3K1J9j6TJ5jj1lM3m3lj4O9l8M0n3J0j4l0
$$ -10 -58 2 -9 18 -36 -64 -1 -26 1 -2 -12 -36 2 -7 -2 13 -5 -9 -8 -6 7 -36 -15 4 -12 -28 -13 -14 -25 -28 15 -28 -31 -45 24 -14 26 -27 -17 -31 -61
-1.69982f1N6%k8K8l0M2k1L0n2L0J3mjj2RK4o8O0j4On8J1N3j5K2o7P9m2K8kJ2j6K0m1j3J4Nk0M6
$$ -61 -5 -5 -33 -5 -35 7 -14 16 -36 -6 7 3 2 -10 -1 23 -45 15 1 7 -51 -40 13 -2 20 -47 32 -10 18 16 28 12 32 -9 -22 -8 -3 -23 23
-1.71966B3n4K5n0J08r0P1p8N3k6K5%k8J3k8L2k0M6n9L8j1M5q5N5JJ6k4K3k1mj2J5k0TnO7j8J3k9
$$ 23 -31 -6 -56 52 -38 33 -45 8 -18 7 7 -21 -8 -36 -4 -24 22 -37 1 -10 35 -50 5 6 22 -2 21 0 -4 -16 -1 -21 -41 -46 21 3 16 -13
-1.73899a3K0Om4RJ9j4Ml3N2%k1k8O5pm1K6k3k6%lK3L4oj7l0Q2k0j4m8L8k3N5o5L8l7L9j8J5J7n9
$$ -13 7 13 -31 -22 -3 -17 -13 -46 6 6 -15 -43 22 15 -26 0 -23 -49 -49 -52 -29 5 -1 -18 -48 34 14 0 -48 -10 -33 22 -43 -5 -42 -3 -21 -6 11 -48
-1.75934d8nO5K1m6l3P5j1n2M6m2J5Rj8rK4pnQj1L1k2k0J8jJ2Kj1L3k4kjK4opj2O9o1K6m7N1p0J9
$$ -48 -53 12 33 -13 -46 29 18 -34 12 -30 -15 -6 -24 -33 -9 -16 -21 -13 -24 7 -15 -35 -17 -18 -6 -4 -15 18 -6 -8 -9 15 9 2 -10 59 -2 24 -23 28 -42 -23
-1.78071b3oJ6J2rL1Qk7J9m3k7N0OJ0rk0oO1k5lj5nNorM0l7N9p3j0M4l1K4m7N6rk5K9K1k3m4L5nQ
$$ -23 -29 -13 -1 -10 21 29 2 21 -22 -49 1 7 17 8 -12 -18 43 18 15 0 -5 0 -6 -15 25 -12 47 -26 -36 8 -23 1 -46 10 1 -24 5 26 3 -41 -6 -11 -3
-1.80258cMl7M0J8l9km7M6K1m7O6p5L8j7K2j9K5l9K0j2N6m1k2K3N7p8M6k4L6l2J5k0L4l8K4J3j8
$$ -3 1 -36 4 22 -17 -19 -66 -20 1 -46 20 -55 -17 -34 -12 -31 -6 -45 -25 -37 19 -22 -44 -21 36 -42 4 -20 16 -16 -1 -21 13 -25 -1 12 -6
-1.82140fm7R6q7L2Rkj4pL2l8oN5m9J4Lj7QK0ok1L5j5%J1O6j26P5r7J22r3N2J6j5l7M9j3k4K8Pp
$$ -6 -53 43 -44 -12 -3 -5 -19 -26 6 -32 -38 17 -32 -18 -15 -32 -24 -4 -10 -31 4 -11 -11 0 66 -60 15 -82 40 -53 -1 15 0 -37 12 -1 -25 3 10 3
-1.84175Ck3nM1l2RTj4k1K2J1n4J19q8M2lj6Krk1K8j5lJ8k4K4j4K6j4K5n6O5m5LkPj1L3j1j9l3N9
$$ 3 -20 -25 16 -16 -7 2 -12 -33 -11 0 -54 65 -23 19 16 0 2 -7 -28 0 -15 -18 0 -24 0 -14 12 -2 23 -33 32 -13 -10 -12 -5 -16 17 6 -13 -46 13
-1.86261A3n1kL3K0q1P6j1mpj9M7j6Kn8M3J5rK9p0qQ6kk1L7o6kl2M2j7J5K1J6kJ4k5l5L8j6K9k2
$$ 13 -38 -40 -7 13 -68 8 -3 -7 -14 -33 14 -2 0 -58 -15 0 -9 20 -50 -58 28 26 5 42 -24 -26 -58 -16 -33 -18 3 19 17 31 6 -29 9 -7 22 0
-1.88296@m4M8l2M4k1NJ6k8j3J9mK0L3j03K8M4j2j4jJ6K3n7K3M2k8j7K7J6n9L5l7J1K5j3j1k4K7
$$ 0 -44 4 -28 16 -5 0 16 -12 -25 -6 -10 10 43 -60 -32 12 0 -14 -15 1 24 -33 -10 32 4 -13 14 30 -29 6 -31 -20 5 -8 -19 -43 -16
-1.90178a6J9k1M8m0Pj0KlPj7J9j6P%k0K8KL1n3L0l6K0j3j5K8L8k1jK%kJ3q0L0P8r7J8K7PJ4%k6
$$ -16 3 -18 30 -10 -3 -13 -11 -14 -7 -24 -5 -21 -14 -14 -34 -6 -4 27 -26 4 -32 -12 -25 -40 -12 26 5 4 6 6 4 17 -63 -33 45 -52 -34 -7 0 14 14 -12
-1.92315a2L6l3L7on7nN3oK7o9K8L7n9j0M5loj7N5q9L3J8qN5l7J1Lk4j9K7l0j3K0J8l9O7q2P7n6
$$ -12 24 -9 28 22 -35 -40 13 7 34 -35 -7 30 -29 -39 6 3 -3 -20 35 -54 -21 -3 -11 44 7 18 21 -3 -22 5 -25 -38 -18 0 -39 28 -54 23 -33
-1.94299c3M7j9k5mM3m4N0Op9P6n2J9L6mk5ll6O7m3N8k7l3L2k1L4j2k7L6Mm7M7k7J2mkpM1l1m6L8
$$ -33 14 -5 -30 -34 9 -35 15 21 -58 18 -34 -15 21 17 -8 -11 -47 20 -23 35 8 -25 7 -14 20 8 -19 17 21 -26 21 -6 6 2 0 -7 34 3 -43 -5
-1.96334ej0K0rPJ8pL6q9L8KNK5p3J7K5%j2j3N3k6k4RL5l2k3L2JM4qm5m1M2j0K2L0p0k0O9n8O9j2
$$ -5 -15 5 -4 3 21 14 50 -39 -1 1 6 31 -42 -25 0 0 -12 -25 28 2 -22 -13 22 -10 -33 -1 0 44 36 -9 -50 -8 -18 4 34 -36 -56 13 -45 24 12
-1.98419A2Pn4L0%Ok8N3l9j9j3P9n3L1Qlm3J2jJ5j9J4K0k0L9m8l1NLL6rl5L3N8p0K6m0kKM2j4Rm9
$$ 12 19 -35 -5 -5 1 -27 26 -13 -32 -45 34 -19 12 20 17 -26 -14 -15 0 -19 -5 15 -5 34 -14 -45 -40 -37 -1 -10 -45 -12 46 -24 2 -38 -40 -38 4 -10 -1 -50
-2.00556e0N1l6L7M4q3N0J1m1M9m2K2m2J4j8NJ5k7kM2j2M6l6J4kK3o0L4j0nL5m5O7o0J6j2Mj9K5
$$ -50 1 -35 2 46 -37 13 24 -17 32 -10 12 -30 -16 -34 -29 -14 -41 -43 -1 -13 33 -3 11 9 32 -28 6 -4 -9 26 -19 48 -12 4 -8 -4 -23 2
-2.02489Bl0Lj7K1JM5o3Qk6M7m2P1lRJ6k0p0M1k9L1m3L4k0M9j8%qm2O1J0k4oJ8k8J6j7LmL7m7K7
$$ 2 -28 -25 -42 -21 -20 25 -38 -30 -56 -9 -51 20 17 26 42 22 -48 -7 -36 -5 -48 -14 -34 15 -3 -3 -11 -53 8 18 -6 -12 6 -22 -6 -23 -20 -24 13 -34 -7
-2.04575gk0N5m0j6QN1l7L9l1kQJ4J5p5L5m1M6J5l3O1r8O1m0M2mJm0j4J5K5Pl2K8j6nJ4oL2lok7
$$ -7 -27 28 -12 -28 -20 31 -6 33 2 0 8 22 37 -38 -3 -44 2 17 -16 45 -53 8 -32 10 6 7 -33 -47 -32 -7 0 -32 -4 -20 -25 -11 -17 15 12 6 -21
-2.06660b1O3l5JLm1L4l5L9Ln1M2ORm1K3j3L6k0J8l6Lk3J0NN3p1N1l5OpQj1J9KK6l1J2J9mk5j1p
$$ -21 42 7 8 11 -30 4 -31 8 11 -40 2 8 17 -24 -1 -14 22 2 20 -16 -13 -36 -26 -21 32 -39 12 -23 -17 -24 -16 -27 -8 -6 20 -11 1 20 16 -9 -20 -27
-2.08797b7M7m2L6%l2O%j6j5M3oL3k6j5K5nOql8jM0k1pOJ8PrK4kj6M8o5J1m8OPN0J7pqj6pJ9J2n9
$$ -27 20 -22 14 14 -18 -12 -12 -28 -43 0 -6 27 1 -14 11 6 12 4 -34 -35 5 -16 -23 -17 1 8 -1 23 21 5 53 -12 -1 -49 -43 -36 14 31 24 16 0 -7 12 24 -35
-2.11086c5K6M0n8J0N9n9K9l3L6n9N6qk7J0kJ2Rpk1M0l6O0o8j1K6m0O5K1k5ql0lJN1qm0j9L4l2M9
$$ -35 -9 31 -27 -17 42 -17 12 -21 15 -44 12 4 -23 -13 -15 -3 6 -1 -22 18 -18 42 -26 -37 -11 -51 14 35 10 2 -28 -31 -30 21 13 -27 -46 -12 -44 5
-2.13121EKNl6J3NrNJ0kj0J2J3n3M2l9M5l0QK9l1J6J7J0j1rk5kJ8Lj8K1jj4k2j3mM0pj3LJ2J0J3q
$$ 5 7 12 -24 -11 -6 -15 -10 0 -2 -12 0 13 -40 2 -37 8 -22 -14 15 -16 0 17 27 16 7 -18 -20 -2 1 -17 4 3 -11 -33 -46 -50 -10 -17 -30 -27 -15 -5 8 0
-2.15359@N4q0O6p0M2k8N0n7m4K9MN2k6J7k3mJ8n1Q3k8oj1l0R2l6k0K3m6N3m8J6J2ll0K6m5K0nJ
$$ 0 54 -26 40 -30 12 -16 34 -23 -67 -38 -34 18 -8 9 -14 -18 0 -51 32 4 -2 -13 -43 49 13 -7 16 -30 23 -25 -9 3 0 -30 -4 -49 -29 -34 -33
-2.17343c3J4RK5nm2O8l7o4O3j5Oj5kM3k9m2Q2Nm3Njrl4N8oJ0Rq2P1j17J42k5lpJm2L7jmM8n7P2
$$ -33 -19 -10 15 10 -32 36 -1 -65 -2 -17 -11 -26 -28 15 -14 -56 26 31 -12 -7 -8 -17 -51 7 1 11 20 -62 9 -108 34 9 6 -1 0 -42 -5 -6 -10 38 -19 53
-2.19480E3p2M9n9K0K4J2l4kJ6l3Nk1O3j6nKJ4j9k8M3Rk2j6J0Pk0%L9k6Llj0J9J2k9J8k2L4l5k0
$$ 53 -19 30 -29 -9 15 27 -7 -9 7 -26 -21 -42 21 5 0 2 16 -3 -31 12 21 -1 -17 -7 0 -20 -20 19 -7 -4 -7 -17 2 14 -15 3 -19 15 -20 -40
-2.21515d0O8k4l5K3%jm6O0l8P2o6L6oj1mJ4M4k9k5K7m8O4m7j6KL7m7R3j10P6m1L5j7j4K1j1K3J8
$$ -40 28 4 -31 -8 -8 -9 -55 5 -33 39 -27 9 3 -8 -12 2 46 17 -8 19 -29 35 -12 -28 -26 11 -36 57 -53 23 -18 17 0 -14 7 -4 19 37
-2.23448C7n8RK8m4L0J0J9n5lJL5l4J7oKK1l6L0qj7k3M7J1Tn7M1k8J8K2m4M2m5M5p9R6m2k1OTL9
$$ 37 -21 -12 16 -28 2 12 31 -24 -27 -26 9 -25 -8 -14 -12 9 -27 3 -5 -22 -45 2 13 24 -33 8 -20 -2 20 -24 18 -27 18 -61 35 -7 -28 -22 -16 23
-2.25483B3l6K0J6j0o3O4l9M3j0M2p8K5j3Mj5J9N6q1M0k3M2n9L0KK7pk1J4Qlj7l0j3P6l3%J1rNk1
$$ 23 -13 7 23 13 -50 14 -25 18 8 50 -28 -3 -16 -12 -27 -8 48 -33 7 -16 26 -33 -3 -1 26 19 -2 12 20 17 0 -30 -43 33 0 0 11 2 7 -14
-2.27518a4O9j11N9K8p1M6l2lJ6L1p6M7J9J6n6K2j9N6j7pj1K7k5j8LN0rl1K1l5K5qL6o6OjL9m7O6
$$ -14 55 -56 3 31 -40 6 -26 -29 -13 18 -58 -11 8 24 -32 -10 -29 27 10 3 -8 19 -6 -24 -21 29 20 -11 10 -25 0 -8 28 -38 -32 -33 6 -41 25
-2.29501B5k6l7Qj4M1J3o6K7J3L9l3K9k8K8m4qj5N9k4j0K2k0j4M1Kl7NK7j7pNJ0J3j3RLPl8J7K2
$$ 25 -1 -38 -30 -44 -3 10 -56 -29 -16 23 -10 19 -9 19 -25 -33 -48 11 -13 -23 -1 -21 -35 6 8 -29 -24 3 -14 -21 -16 -6 7 -6 3 6 13 -25 -8 14
-2.31536A4l4K4o1R2o3JK9m9K1%ORK2j1Lo9P8k6k1jL4mK5n1M7lrlj8O9p5N9k3m1N4m3Q%LOL2l5o
$$ 14 -20 4 -57 35 -28 -27 2 -47 -26 -26 -20 -11 11 0 3 -66 12 -14 -35 -36 -2 -6 19 -32 15 12 3 0 -18 51 -24 35 12 -29 25 -18 -10 -10 -7 -1 31 -4 -10
-2.33724a0K5k7n2O2j4%J7qJ3j1l4O8l0Kj3M1l2jr%Tj6J2Kkk2M6k8RK8q1M4nK2K9m3No9Q2J0j9k6
$$ -10 15 -12 -64 -2 -16 -16 1 -7 6 -5 -39 29 -1 1 -12 29 -3 -4 -13 -13 -13 -29 -17 -15 -17 -39 7 -21 -12 16 -65 -21 -26 -4 25 -18 -13 -82 0 10 -9 -35
-2.35860c5M3Kl0K6m3P6n2K2l2k4N4j2K1p8P4M6o9J1n6O4loQmPj4jpL8l2jK1l4l2M5k7J2Rk6qN0l
$$ -35 8 10 -20 6 -37 39 -13 9 -23 -47 7 -5 16 -62 12 58 -11 0 -56 8 5 -1 7 3 10 -4 -5 -12 26 -6 -7 14 -20 -52 -7 -34 -22 -13 -39 -47 3 0
-2.37997@ql4O9l9K2qj4pN2l9j2RK9rj7OPn7J9O2n1LJ7j6J1j3OPmTj1L9lj6k3J5J3rj8J2L6j9K9
$$ 0 -8 -42 27 -12 10 2 -12 -19 33 -6 -18 -9 20 11 -6 0 7 -50 -31 31 -20 -17 0 -16 -5 -18 -12 -5 -9 -13 -24 15 12 -4 -27 -12 1 -8 -26 -14 22 3 32
-2.40184C2k2%j1rQkmlL8m4MJ6k5K5m5M1JJ5j5OPn0O1L0m0mm3N7k4L0o4J1K3k7J6j6N9r4O4Jj9R
$$ 32 10 10 -1 -10 -2 -4 -8 -11 27 -17 -13 3 -22 3 -42 -1 0 15 0 6 13 -37 24 54 14 10 -33 24 0 30 -34 -23 0 -27 -11 -27 32 -62 2 3 -16 -7
-2.42321go7P5m3Q7n7L0lOm5N5n9L0n9O9k8P7n5k2jM4n3N3k0j5K1k2NM6n1j9K6K7l9J4jJ4m8M7j2
$$ -7 -74 1 -42 45 -12 18 15 21 -24 31 -28 2 -57 12 -16 61 6 -16 -17 27 -26 27 7 -8 13 -9 -4 42 -9 -28 -2 25 -14 0 -1 13 -35 12 0
-2.44305@Nk8pN3k3nj4K5m0P3j05R9o2J8k6K9L1M1n2j2k3L7M0o1K0j5PK6Pn3pO6m8j3K6k3L2n1J5
$$ 0 5 -23 -30 23 0 -5 -19 6 -34 39 -66 33 -29 -11 -37 -8 23 64 12 0 -23 14 54 -7 13 -2 5 31 38 -15 -22 44 -4 -17 9 -14 18 -33 -18
-2.46289a8KJ6oj3M3qk4J5l3jM2m3N0m5M7n0Lk9N6JJ7l8N5m3Lj2K9K0m8j7N9l5jOrl1P6j7qk1qM0
$$ -18 -16 0 -6 -19 24 16 -8 7 -26 -27 15 -28 22 -23 24 -26 -23 -52 4 5 22 -16 39 -4 -1 -13 16 36 -12 -29 30 -5 -6 0 -9 -40 36 19 11 -10 -18 22
-2.48426B2oJ5m5k1M1j7mM1l0mj9N7n6L6l2J6K1J5k2m9N0rm5O1k7M8n1M6k8ol2N5j7j0K5n2P1m4k
$$ 22 16 31 -14 -35 6 -11 -15 26 -4 -8 -27 30 -26 10 -22 -6 15 30 8 -41 9 0 -45 16 -11 37 -14 32 4 -2 -34 21 4 -6 19 -33 38 -6 -8
-2.50410hj7L9mLj3k0J8K7Np7J2K7m5O7Lj6J0MJ8l6k8MJ4JoK3Rn2J3MJ8oO2q7L5%k6K4J8K0k1J3
$$ -8 -25 14 10 13 0 -20 -2 25 30 -47 -35 -8 -53 14 17 1 11 15 33 -3 -31 -27 -13 -12 -18 5 14 -38 -25 -21 -3 -9 53 -34 1 1 -25 -1 17 37 16 29
-2.52546B9j1pj0NK7l3K2K6p4L4k3J6l0L8lL1n2nJ4L2j1j9L6p2N3l5M1j5l5P3pJ5r3K6L1Ol4J0J6
$$ 29 18 11 1 6 33 0 22 48 -26 8 -15 1 -29 9 6 37 -15 -20 -6 26 15 -4 32 -40 13 -22 19 4 -31 42 35 50 -43 -17 14 20 -14 -4 12
-2.54530A2J9n6J3N7p2K2L6o7mJ4K0J6j7J9l6P7p9J2K5j4L0lp4P5n8L3J5k0n3N5j2N9o6J1K7l1J0
$$ 12 31 -25 -12 45 -27 -5 31 -36 -40 -26 -6 10 -7 12 -24 53 -26 -14 11 -3 27 24 -50 25 -33 0 15 -5 -58 -3 -15 44 -22 -11 16 -15 -5
-2.56412el1L6LJ9j7Qj0l5O2p1K1l1K4M1l1J7m1M5qJ9k3j0K4j5J2j7k3J7L1l3jJ8N6q5RN4m0M6l9
$$ -5 -36 0 3 22 5 13 3 -32 30 -41 -20 -51 -27 14 -17 0 -41 4 -4 15 -8 -18 6 -9 3 -14 -37 -20 11 -22 -23 -5 51 -34 -25 29 -11 35 -4
-2.58396dL4nl9l4M5k4K6j3l1O5Rm9pM0l0oK4l9Q0o1J0Tn1N5J2l5K6j1Jn1L2K3K7J4n2K1l2Qk0Q
$$ -4 30 25 -14 -48 -3 -27 -1 -14 -45 20 29 -20 -27 13 -17 -23 1 -38 42 -19 -9 1 -50 5 17 -18 8 -3 -2 -53 -21 2 29 43 -9 12 -20 -12 -32 -24
-2.60431b4j6M5kK1K7p8jL8LK1n5L7k0Lj6PkjQm8L1j9Q4l5j4PM7j2k4j0Pj6PNk0K5j0J5M2p2pK2PR
$$ -24 -40 5 3 24 51 -27 -28 10 13 34 -21 16 -4 -1 -17 -10 -12 -13 -5 -53 -22 -41 43 8 -6 1 48 36 12 2 9 -7 0 5 -15 10 0 15 57 -15 -22 0 7 16
-2.62669A6prqj5NM1J3Lk4j1K9n4J9j9k8M7%n0N1J1J5o7K6KM8pk8j4QROQk5J7m9M7J0k1Nk6K5j5L5
$$ 16 9 0 -8 -23 -18 23 36 39 15 4 33 -21 -2 -21 -49 -2 -2 -52 -1 10 25 -42 -16 -14 34 27 -1 -15 -7 2 8 16 -9 8 -41 6 16 -5 0 -26 -1 -16 19
-2.64857A9j2j4k2J9j8j0N1%j3pL2p0J3J7m0N5kql3rN1j1O4l9M2j0k4k6J4j1l5J9J0rJ5J6on1L7o4
$$ 19 7 -7 -29 -10 -28 -38 13 13 0 -7 25 -45 -32 -15 -55 0 -2 -10 -43 -52 -1 -12 52 13 55 45 21 -5 9 -2 -37 -18 -8 -17 -2 14 8 -43 -6 -70
-2.66892g0R5l4J2m3QL9J1n6J2K5K2l1J6k3jlL0l9MM7jJ7p1N3l2K1lM2n0M4l1j3j1k2K3mK3k5j9J6
$$ -70 25 -9 3 -40 -32 7 18 -38 -26 -1 21 -10 6 -17 -18 -21 9 -30 -26 21 20 37 -34 19 -13 8 5 47 -3 41 10 -3 -14 -36 -13 -17 6 -19 -38 -22
-2.68927b2K2lj2J8Rj0J5l6K9l4O2o1M9n4K7J%J7J1l8K4n9P0k7Kl3M0M6p9K4K8Mm1N4j7o0M0QKK2
$$ -22 0 -3 -15 3 12 2 17 -19 10 -24 38 -23 26 -28 -1 0 0 17 28 -10 14 -45 25 -2 0 -33 7 53 -26 -2 26 30 -11 43 26 -34 6 14 16 38
-2.70961C8l5rk2J9kM3m6pnR1p3J6l6L2K2J2p7J5O4l8jLMk2j7oM3k3K7K3k3pqj1jP0o4K0mj0j4K4
$$ 38 3 -6 -28 -9 -11 32 -14 -21 -26 65 -8 8 -28 4 26 38 -39 -24 40 2 1 4 8 -14 -31 -37 6 -17 10 33 10 3 -5 -16 -17 53 -11 9 5 -5 -19 5
-2.73098Ej4M6l0j2J2oj5J3j2mJ7jK0roJ2Rk4%j2L5n8L8lq3Q9p1N1NK4l1M2j4l7N8j7p2J5K1Rj9K1
$$ 5 -9 37 7 -5 7 1 -14 -1 -13 -17 0 -1 19 10 4 16 25 1 1 -11 24 -34 4 1 -82 7 -64 -13 -8 16 -15 27 13 -24 34 17 -55 -40 -19 -10 -29 -8
-2.75235hLNl9K5OTj1MJ3k3M4l9m6P7l6K8k8M3j8k6j3L4J6oj4K7o0M4k8L2k3n0K5J4K7j8J4J3qpj0
$$ -8 -5 0 -39 -14 -8 -2 -13 -9 4 -19 25 -14 -60 17 -19 9 -19 24 6 -20 -33 1 17 11 -3 24 -36 8 -20 12 -11 -61 -36 -22 5 -13 1 14 6 -1 -11
-2.77320a1j7P5l6j9j3K5N2r7N4k7M6m9N0j0k2K8kK5r1N3n4N7kk0RK0q8N4mJ7rj7L5j1J0o2O1K7l7
$$ -11 -28 47 11 -8 -21 4 56 -41 13 -14 32 -17 33 23 1 29 27 52 -39 14 -40 17 15 -5 4 24 -64 -10 -14 3 -6 -23 12 1 11 -51 10 37 0
-2.79304@%JLqK7Pk0Kj2lj0J5oK6r0J36n7ml2oJ4N0l9kk9M1L4j3p5JN0JRm8P0Rl4k4R2j01J7lJ6k1
$$ 0 0 1 4 -4 23 30 10 12 0 -3 -13 2 -4 22 -68 68 11 7 -25 -31 -17 33 -6 -8 -37 4 38 25 -50 -49 1 2 11 -37 33 42 8 -16 76 -25 -8 -11 5 -16
-2.81543a6L1k2mTL7mj8k5K9k2O9m7J7j6j0RlJ5l1K8kn0P9k9j5LO3p5N6k5m4RK4l7N4pm2K9Komk2
$$ -16 15 -7 -11 -15 22 18 0 -25 4 -18 51 4 21 5 -5 4 1 16 -15 13 11 -39 40 11 -4 -1 62 -13 43 18 -26 -17 7 -30 24 17 -25 4 6 0 -4 -26
-2.83679b6j0J2M7o7M4m5M5K5j1Lork1O1k8q0Q6Jk8lJ0%Qk3J8qm8N5k2J6mOkK6m7jN1m2M3JJ8n8j7
$$ -26 -36 -24 23 -44 0 -45 0 25 14 17 11 2 -19 42 14 -66 20 21 -7 -10 0 0 8 -15 3 -5 -53 2 -20 -4 -8 -2 -4 22 -25 -26 25 -17 26 27 45 -13 -30
-2.85867c0QJ1J3k0krM2k2K1k1Ppk0J5j1N1k6k1PJ9qN2o5J8L1k0j5j8L6Tp7J5L5l4m4M4K7l0L2k9
$$ -30 -22 -11 2 -18 -20 -29 13 -9 12 -9 -2 -9 -29 -14 -25 26 0 -21 -14 5 -3 49 -16 2 33 13 -2 -20 16 52 -25 -10 25 -9 -53 -9 18 -12 20 -9
-2.87902iJ9L4p0L2rJ9j8M6k6j3L3K8o2J6k9M9j5m6K4Pm0M7k1Kj0J9k8K4K7n8N1p4N0JL3j0k8l1J5
$$ -9 10 44 -26 6 -3 16 -2 44 18 5 38 66 4 20 -9 40 25 -21 3 10 -30 17 -4 -2 -12 7 -21 3 30 -28 23 -51 -1 0 33 23 -5 -36 -21
-2.89886b1RK5k8lL0l5M8J1kl7j4K3k3N2m7j1M3K5o4PP3m0m7MPmL8k4J4K6m8PJ8nn7P3m6M1j1j4L1
$$ -21 -12 13 -15 -18 12 -23 25 36 34 -3 -17 6 -17 35 -12 -23 20 45 -19 -12 61 21 -26 -22 -15 -19 19 -5 9 35 -13 -6 12 7 -50 23 -23 18 7 -7 24
-2.91971B4m2LJ5K7kk0Rkl7l0Q0oJ2rm6K4p3P5pj8N6nl1j4M3m3rK7Pn7O9l5J1k3L6j5L6j6%RQo7J9
$$ 24 -18 -15 0 27 25 5 14 12 -25 -55 25 19 31 22 -24 0 -73 2 -5 -23 33 28 -3 -17 26 -17 -26 1 8 -49 20 -15 -4 -27 9 -6 30 14 14 23 31 -36 -17
-2.94159a7j3K7%RpJkj3K6k0qQ5o6L4krpj8l0P1j7k3QK3n3KK4J0k2l3O6j4j8k6O3n0J4moJ5k5PJ2
$$ -17 -30 -3 -3 6 -1 0 -2 -15 11 -9 -17 68 2 36 34 25 18 0 -30 41 24 1 9 32 -21 -19 5 15 -7 -40 26 12 -6 -32 31 -19 -5 -9 -15 0 -25 -18 -6
-2.96346fL9k7nk8K2J3l4M4m6M0l5K6qTL8K3p9K1j1M3o4M4Mm4J4JLN7o7K8Jj0P0l8jpj3K5k8mK3j5
$$ -6 33 6 1 -27 -5 8 -26 18 -28 12 -23 3 -5 -13 25 48 -31 -10 -21 22 -42 2 6 -38 -24 -23 -20 37 -30 -2 -1 -11 59 21 20 13 0 25 -3 -7 16 1
-2.98483Aj6L6l8Q6r7O3l5Nj0J2K1j2K0k4K2m6L5m5L1Qj8QJ9j3m3N0k0K1N5r5Q0l0k6kPM5n5J4m3
$$ 1 -15 21 -17 69 -28 35 0 5 -5 7 28 16 36 12 34 -12 23 -22 9 17 -1 7 26 13 -30 20 0 21 76 -19 61 31 5 3 10 55 0 14 -29
-3.00467b9M2n7K8OQTJ3N9q5j7N7k2j1J0L1p1J0NJ8Oj3k4M4rTK2k6J8J2qj2Lj4k0K0J7K9m0jM1q8
$$ -29 13 -44 -16 -10 -2 6 19 78 -7 -24 33 11 0 10 41 -30 -20 -15 3 9 -4 -28 16 7 -2 20 -6 12 24 16 4 7 -7 -27 -7 10 39 -1 -2 39 -49
-3.02552d9Q4n7M9m1LoK9J7j6l0J7L4n4j4QJ1%Oj7N5j0l2mj1N5m6M2o8R5r2M0j8K7k9N2k4qJ7n2N8
$$ -49 35 -22 27 -14 -11 -17 12 29 13 -17 0 34 -20 -34 -26 -15 -15 -9 -26 29 19 -13 -17 -28 27 -19 23 -45 50 -42 -2 -20 7 -22 30 6 -2 15 -37 21
-3.04587B1n3P1k7l7J6oJ2l8O1m2N2k9m0M3nLK1k3j4P0p1O0m7M7m9J7l3k5N2k3J6mk9R7p3N1n1k2
$$ 21 -32 39 12 -25 -9 -15 -3 -41 20 -22 30 1 -39 4 -1 2 23 0 -14 56 -15 45 -2 45 -4 13 -20 -45 7 -16 0 -4 -33 64 -9 42 -9 -31
-3.06520c1K4L2J5j4Rm0L9l8L3l1j8J3%K8n4L3K8rm6P5r1P8j7J3k3pj4j2L2Kl1M1K1o6P5n4L6p9R8
$$ -31 -7 25 40 26 35 -5 34 -4 29 -2 -20 -7 -7 21 -33 0 28 19 -27 48 -43 35 18 31 8 1 -13 -25 7 9 -22 19 40 -26 49 -5 31 -48 50
-3.08504E0l6K1m2k3N8pLk1Mk8K5jRJ4l7J1N3l5qKj2J9j7LK3o0M5j2K7K
$$ 50 14 35 -7 -30 28 21 24 3 7 -21 4 3 12 26 -11 0 53 18 10 12 0 19 2 5 28 -32 13 1 28 30
-3.10030C0    $$ checkpoint
##END=
